[INFO] Scanning for projects...
[INFO]                                                                         
[INFO] ------------------------------------------------------------------------
[INFO] Building Joda-Time 2.8.1
[INFO] ------------------------------------------------------------------------
[INFO] 
[INFO] --- maven-resources-plugin:2.7:resources (default-resources) @ joda-time ---
[INFO] Using 'UTF-8' encoding to copy filtered resources.
[INFO] Copying 2 resources to META-INF
[INFO] Copying 10 resources
[INFO] 
[INFO] --- maven-compiler-plugin:3.3:compile (default-compile) @ joda-time ---
[INFO] Changes detected - recompiling the module!
[INFO] Compiling 166 source files to /home/perham/Study/LittleDarwin/Cases/joda-time-2.8.1/target/classes
[INFO] 
[INFO] --- exec-maven-plugin:1.4.0:java (compile-tzdb) @ joda-time ---
Writing zoneinfo files
Writing ZoneInfoMap
[INFO] 
[INFO] --- maven-resources-plugin:2.7:testResources (default-testResources) @ joda-time ---
[INFO] Using 'UTF-8' encoding to copy filtered resources.
[INFO] Copying 34 resources
[INFO] 
[INFO] --- maven-compiler-plugin:3.3:testCompile (default-testCompile) @ joda-time ---
[INFO] Nothing to compile - all classes are up to date
[INFO] 
[INFO] --- maven-surefire-plugin:2.18.1:test (default-test) @ joda-time ---
[INFO] Surefire report directory: /home/perham/Study/LittleDarwin/Cases/joda-time-2.8.1/target/surefire-reports

-------------------------------------------------------
 T E S T S
-------------------------------------------------------
Running org.joda.time.TestAllPackages

TestBuddhistChronology.testCalendar

TestCopticChronology.testCalendar

TestEthiopicChronology.testCalendar

TestIslamicChronology.testCalendar

Testing Gregorian chronology over 1000 iterations
100% complete (i=1000)

Testing Julian chronology over 1000 iterations
100% complete (i=1000)
Writing zoneinfo files
Writing ZoneInfoMap
Tests run: 4157, Failures: 0, Errors: 28, Skipped: 0, Time elapsed: 6.298 sec <<< FAILURE! - in org.joda.time.TestAllPackages
testNameProvider(org.joda.time.TestDateTimeZone)  Time elapsed: 0.005 sec  <<< ERROR!
java.lang.RuntimeException: java.lang.NullPointerException
	at org.joda.time.DateTimeZone.getDefaultNameProvider(DateTimeZone.java:133)
	at org.joda.time.DateTimeZone.setNameProvider(DateTimeZone.java:128)
	at org.joda.time.TestDateTimeZone.testNameProvider(TestDateTimeZone.java:611)
Caused by: java.lang.NullPointerException
	at java.lang.Class.forName0(Native Method)
	at java.lang.Class.forName(Class.java:191)
	at org.joda.time.DateTimeZone.getDefaultNameProvider(DateTimeZone.java:132)
	... 28 more

testGetShortName(org.joda.time.TestDateTimeZone)  Time elapsed: 0.001 sec  <<< ERROR!
java.lang.RuntimeException: java.lang.NullPointerException
	at org.joda.time.DateTimeZone.getDefaultNameProvider(DateTimeZone.java:133)
	at org.joda.time.DateTimeZone.getNameProvider(DateTimeZone.java:123)
	at org.joda.time.DateTimeZone.getShortName(DateTimeZone.java:168)
	at org.joda.time.DateTimeZone.getShortName(DateTimeZone.java:163)
	at org.joda.time.TestDateTimeZone.testGetShortName(TestDateTimeZone.java:721)
Caused by: java.lang.NullPointerException
	at java.lang.Class.forName0(Native Method)
	at java.lang.Class.forName(Class.java:191)
	at org.joda.time.DateTimeZone.getDefaultNameProvider(DateTimeZone.java:132)
	... 30 more

testGetShortName_berlin(org.joda.time.TestDateTimeZone)  Time elapsed: 0.002 sec  <<< ERROR!
java.lang.RuntimeException: java.lang.NullPointerException
	at org.joda.time.DateTimeZone.getDefaultNameProvider(DateTimeZone.java:133)
	at org.joda.time.DateTimeZone.getNameProvider(DateTimeZone.java:123)
	at org.joda.time.DateTimeZone.getShortName(DateTimeZone.java:168)
	at org.joda.time.TestDateTimeZone.testGetShortName_berlin(TestDateTimeZone.java:728)
Caused by: java.lang.NullPointerException
	at java.lang.Class.forName0(Native Method)
	at java.lang.Class.forName(Class.java:191)
	at org.joda.time.DateTimeZone.getDefaultNameProvider(DateTimeZone.java:132)
	... 29 more

testGetShortNameProviderName(org.joda.time.TestDateTimeZone)  Time elapsed: 0.002 sec  <<< ERROR!
java.lang.RuntimeException: java.lang.NullPointerException
	at org.joda.time.DateTimeZone.getDefaultNameProvider(DateTimeZone.java:133)
	at org.joda.time.DateTimeZone.getNameProvider(DateTimeZone.java:123)
	at org.joda.time.TestDateTimeZone.testGetShortNameProviderName(TestDateTimeZone.java:740)
Caused by: java.lang.NullPointerException
	at java.lang.Class.forName0(Native Method)
	at java.lang.Class.forName(Class.java:191)
	at org.joda.time.DateTimeZone.getDefaultNameProvider(DateTimeZone.java:132)
	... 28 more

testGetName(org.joda.time.TestDateTimeZone)  Time elapsed: 0.002 sec  <<< ERROR!
java.lang.RuntimeException: java.lang.NullPointerException
	at org.joda.time.DateTimeZone.getDefaultNameProvider(DateTimeZone.java:133)
	at org.joda.time.DateTimeZone.getNameProvider(DateTimeZone.java:123)
	at org.joda.time.DateTimeZone.getName(DateTimeZone.java:178)
	at org.joda.time.DateTimeZone.getName(DateTimeZone.java:173)
	at org.joda.time.TestDateTimeZone.testGetName(TestDateTimeZone.java:753)
Caused by: java.lang.NullPointerException
	at java.lang.Class.forName0(Native Method)
	at java.lang.Class.forName(Class.java:191)
	at org.joda.time.DateTimeZone.getDefaultNameProvider(DateTimeZone.java:132)
	... 30 more

testGetName_berlin(org.joda.time.TestDateTimeZone)  Time elapsed: 0.001 sec  <<< ERROR!
java.lang.RuntimeException: java.lang.NullPointerException
	at org.joda.time.DateTimeZone.getDefaultNameProvider(DateTimeZone.java:133)
	at org.joda.time.DateTimeZone.getNameProvider(DateTimeZone.java:123)
	at org.joda.time.DateTimeZone.getName(DateTimeZone.java:178)
	at org.joda.time.TestDateTimeZone.testGetName_berlin(TestDateTimeZone.java:760)
Caused by: java.lang.NullPointerException
	at java.lang.Class.forName0(Native Method)
	at java.lang.Class.forName(Class.java:191)
	at org.joda.time.DateTimeZone.getDefaultNameProvider(DateTimeZone.java:132)
	... 29 more

testGetNameProviderName(org.joda.time.TestDateTimeZone)  Time elapsed: 0.001 sec  <<< ERROR!
java.lang.RuntimeException: java.lang.NullPointerException
	at org.joda.time.DateTimeZone.getDefaultNameProvider(DateTimeZone.java:133)
	at org.joda.time.DateTimeZone.getNameProvider(DateTimeZone.java:123)
	at org.joda.time.TestDateTimeZone.testGetNameProviderName(TestDateTimeZone.java:772)
Caused by: java.lang.NullPointerException
	at java.lang.Class.forName0(Native Method)
	at java.lang.Class.forName(Class.java:191)
	at org.joda.time.DateTimeZone.getDefaultNameProvider(DateTimeZone.java:132)
	... 28 more

testPatchedNameKeysLondon(org.joda.time.TestDateTimeZone)  Time elapsed: 0.001 sec  <<< ERROR!
java.lang.RuntimeException: java.lang.NullPointerException
	at org.joda.time.DateTimeZone.getDefaultNameProvider(DateTimeZone.java:133)
	at org.joda.time.DateTimeZone.getNameProvider(DateTimeZone.java:123)
	at org.joda.time.DateTimeZone.getName(DateTimeZone.java:178)
	at org.joda.time.DateTimeZone.getName(DateTimeZone.java:173)
	at org.joda.time.TestDateTimeZone.testPatchedNameKeysLondon(TestDateTimeZone.java:1071)
Caused by: java.lang.NullPointerException
	at java.lang.Class.forName0(Native Method)
	at java.lang.Class.forName(Class.java:191)
	at org.joda.time.DateTimeZone.getDefaultNameProvider(DateTimeZone.java:132)
	... 30 more

testPatchedNameKeysSydney(org.joda.time.TestDateTimeZone)  Time elapsed: 0.001 sec  <<< ERROR!
java.lang.RuntimeException: java.lang.NullPointerException
	at org.joda.time.DateTimeZone.getDefaultNameProvider(DateTimeZone.java:133)
	at org.joda.time.DateTimeZone.getNameProvider(DateTimeZone.java:123)
	at org.joda.time.DateTimeZone.getName(DateTimeZone.java:178)
	at org.joda.time.DateTimeZone.getName(DateTimeZone.java:173)
	at org.joda.time.TestDateTimeZone.testPatchedNameKeysSydney(TestDateTimeZone.java:1081)
Caused by: java.lang.NullPointerException
	at java.lang.Class.forName0(Native Method)
	at java.lang.Class.forName(Class.java:191)
	at org.joda.time.DateTimeZone.getDefaultNameProvider(DateTimeZone.java:132)
	... 30 more

testPatchedNameKeysSydneyHistoric(org.joda.time.TestDateTimeZone)  Time elapsed: 0.001 sec  <<< ERROR!
java.lang.RuntimeException: java.lang.NullPointerException
	at org.joda.time.DateTimeZone.getDefaultNameProvider(DateTimeZone.java:133)
	at org.joda.time.DateTimeZone.getNameProvider(DateTimeZone.java:123)
	at org.joda.time.DateTimeZone.getName(DateTimeZone.java:178)
	at org.joda.time.DateTimeZone.getName(DateTimeZone.java:173)
	at org.joda.time.TestDateTimeZone.testPatchedNameKeysSydneyHistoric(TestDateTimeZone.java:1091)
Caused by: java.lang.NullPointerException
	at java.lang.Class.forName0(Native Method)
	at java.lang.Class.forName(Class.java:191)
	at org.joda.time.DateTimeZone.getDefaultNameProvider(DateTimeZone.java:132)
	... 30 more

testPatchedNameKeysGazaHistoric(org.joda.time.TestDateTimeZone)  Time elapsed: 0.001 sec  <<< ERROR!
java.lang.RuntimeException: java.lang.NullPointerException
	at org.joda.time.DateTimeZone.getDefaultNameProvider(DateTimeZone.java:133)
	at org.joda.time.DateTimeZone.getNameProvider(DateTimeZone.java:123)
	at org.joda.time.DateTimeZone.getName(DateTimeZone.java:178)
	at org.joda.time.DateTimeZone.getName(DateTimeZone.java:173)
	at org.joda.time.TestDateTimeZone.testPatchedNameKeysGazaHistoric(TestDateTimeZone.java:1101)
Caused by: java.lang.NullPointerException
	at java.lang.Class.forName0(Native Method)
	at java.lang.Class.forName(Class.java:191)
	at org.joda.time.DateTimeZone.getDefaultNameProvider(DateTimeZone.java:132)
	... 30 more

testZoneNameNearTransition(org.joda.time.format.TestDateTimeFormatter)  Time elapsed: 0.002 sec  <<< ERROR!
java.lang.RuntimeException: java.lang.NullPointerException
	at org.joda.time.DateTimeZone.getDefaultNameProvider(DateTimeZone.java:133)
	at org.joda.time.DateTimeZone.getNameProvider(DateTimeZone.java:123)
	at org.joda.time.DateTimeZone.getName(DateTimeZone.java:178)
	at org.joda.time.format.DateTimeFormatterBuilder$TimeZoneName.print(DateTimeFormatterBuilder.java:2277)
	at org.joda.time.format.DateTimeFormatterBuilder$TimeZoneName.printTo(DateTimeFormatterBuilder.java:2268)
	at org.joda.time.format.DateTimeFormatterBuilder$Composite.printTo(DateTimeFormatterBuilder.java:2429)
	at org.joda.time.format.DateTimeFormatter.printTo(DateTimeFormatter.java:684)
	at org.joda.time.format.DateTimeFormatter.printTo(DateTimeFormatter.java:521)
	at org.joda.time.format.DateTimeFormatter.print(DateTimeFormatter.java:625)
	at org.joda.time.format.TestDateTimeFormatter.testZoneNameNearTransition(TestDateTimeFormatter.java:1003)
Caused by: java.lang.NullPointerException
	at java.lang.Class.forName0(Native Method)
	at java.lang.Class.forName(Class.java:191)
	at org.joda.time.DateTimeZone.getDefaultNameProvider(DateTimeZone.java:132)
	... 35 more

testZoneShortNameNearTransition(org.joda.time.format.TestDateTimeFormatter)  Time elapsed: 0.001 sec  <<< ERROR!
java.lang.RuntimeException: java.lang.NullPointerException
	at org.joda.time.DateTimeZone.getDefaultNameProvider(DateTimeZone.java:133)
	at org.joda.time.DateTimeZone.getNameProvider(DateTimeZone.java:123)
	at org.joda.time.DateTimeZone.getShortName(DateTimeZone.java:168)
	at org.joda.time.format.DateTimeFormatterBuilder$TimeZoneName.print(DateTimeFormatterBuilder.java:2279)
	at org.joda.time.format.DateTimeFormatterBuilder$TimeZoneName.printTo(DateTimeFormatterBuilder.java:2268)
	at org.joda.time.format.DateTimeFormatterBuilder$Composite.printTo(DateTimeFormatterBuilder.java:2429)
	at org.joda.time.format.DateTimeFormatter.printTo(DateTimeFormatter.java:684)
	at org.joda.time.format.DateTimeFormatter.printTo(DateTimeFormatter.java:521)
	at org.joda.time.format.DateTimeFormatter.print(DateTimeFormatter.java:625)
	at org.joda.time.format.TestDateTimeFormatter.testZoneShortNameNearTransition(TestDateTimeFormatter.java:1019)
Caused by: java.lang.NullPointerException
	at java.lang.Class.forName0(Native Method)
	at java.lang.Class.forName(Class.java:191)
	at org.joda.time.DateTimeZone.getDefaultNameProvider(DateTimeZone.java:132)
	... 35 more

testFormat_zoneText(org.joda.time.format.TestDateTimeFormat)  Time elapsed: 0.001 sec  <<< ERROR!
java.lang.RuntimeException: java.lang.NullPointerException
	at org.joda.time.DateTimeZone.getDefaultNameProvider(DateTimeZone.java:133)
	at org.joda.time.DateTimeZone.getNameProvider(DateTimeZone.java:123)
	at org.joda.time.DateTimeZone.getShortName(DateTimeZone.java:168)
	at org.joda.time.format.DateTimeFormatterBuilder$TimeZoneName.print(DateTimeFormatterBuilder.java:2279)
	at org.joda.time.format.DateTimeFormatterBuilder$TimeZoneName.printTo(DateTimeFormatterBuilder.java:2268)
	at org.joda.time.format.DateTimeFormatter.printTo(DateTimeFormatter.java:684)
	at org.joda.time.format.DateTimeFormatter.printTo(DateTimeFormatter.java:521)
	at org.joda.time.format.DateTimeFormatter.print(DateTimeFormatter.java:625)
	at org.joda.time.format.TestDateTimeFormat.testFormat_zoneText(TestDateTimeFormat.java:757)
Caused by: java.lang.NullPointerException
	at java.lang.Class.forName0(Native Method)
	at java.lang.Class.forName(Class.java:191)
	at org.joda.time.DateTimeZone.getDefaultNameProvider(DateTimeZone.java:132)
	... 34 more

testFormat_zoneLongText(org.joda.time.format.TestDateTimeFormat)  Time elapsed: 0.001 sec  <<< ERROR!
java.lang.RuntimeException: java.lang.NullPointerException
	at org.joda.time.DateTimeZone.getDefaultNameProvider(DateTimeZone.java:133)
	at org.joda.time.DateTimeZone.getNameProvider(DateTimeZone.java:123)
	at org.joda.time.DateTimeZone.getName(DateTimeZone.java:178)
	at org.joda.time.format.DateTimeFormatterBuilder$TimeZoneName.print(DateTimeFormatterBuilder.java:2277)
	at org.joda.time.format.DateTimeFormatterBuilder$TimeZoneName.printTo(DateTimeFormatterBuilder.java:2268)
	at org.joda.time.format.DateTimeFormatter.printTo(DateTimeFormatter.java:684)
	at org.joda.time.format.DateTimeFormatter.printTo(DateTimeFormatter.java:521)
	at org.joda.time.format.DateTimeFormatter.print(DateTimeFormatter.java:625)
	at org.joda.time.format.TestDateTimeFormat.testFormat_zoneLongText(TestDateTimeFormat.java:769)
Caused by: java.lang.NullPointerException
	at java.lang.Class.forName0(Native Method)
	at java.lang.Class.forName(Class.java:191)
	at org.joda.time.DateTimeZone.getDefaultNameProvider(DateTimeZone.java:132)
	... 34 more

testForStyle_mediumLongDateTime(org.joda.time.format.TestDateTimeFormatStyle)  Time elapsed: 0.01 sec  <<< ERROR!
java.lang.RuntimeException: java.lang.NullPointerException
	at org.joda.time.DateTimeZone.getDefaultNameProvider(DateTimeZone.java:133)
	at org.joda.time.DateTimeZone.getNameProvider(DateTimeZone.java:123)
	at org.joda.time.DateTimeZone.getShortName(DateTimeZone.java:168)
	at org.joda.time.format.DateTimeFormatterBuilder$TimeZoneName.print(DateTimeFormatterBuilder.java:2279)
	at org.joda.time.format.DateTimeFormatterBuilder$TimeZoneName.printTo(DateTimeFormatterBuilder.java:2268)
	at org.joda.time.format.DateTimeFormatterBuilder$Composite.printTo(DateTimeFormatterBuilder.java:2429)
	at org.joda.time.format.DateTimeFormat$StyleFormatter.printTo(DateTimeFormat.java:811)
	at org.joda.time.format.DateTimeFormatter.printTo(DateTimeFormatter.java:684)
	at org.joda.time.format.DateTimeFormatter.printTo(DateTimeFormatter.java:521)
	at org.joda.time.format.DateTimeFormatter.print(DateTimeFormatter.java:625)
	at org.joda.time.format.TestDateTimeFormatStyle.testForStyle_mediumLongDateTime(TestDateTimeFormatStyle.java:352)
Caused by: java.lang.NullPointerException
	at java.lang.Class.forName0(Native Method)
	at java.lang.Class.forName(Class.java:191)
	at org.joda.time.DateTimeZone.getDefaultNameProvider(DateTimeZone.java:132)
	... 36 more

testForStyle_mediumFullDateTime(org.joda.time.format.TestDateTimeFormatStyle)  Time elapsed: 0.001 sec  <<< ERROR!
java.lang.RuntimeException: java.lang.NullPointerException
	at org.joda.time.DateTimeZone.getDefaultNameProvider(DateTimeZone.java:133)
	at org.joda.time.DateTimeZone.getNameProvider(DateTimeZone.java:123)
	at org.joda.time.DateTimeZone.getShortName(DateTimeZone.java:168)
	at org.joda.time.format.DateTimeFormatterBuilder$TimeZoneName.print(DateTimeFormatterBuilder.java:2279)
	at org.joda.time.format.DateTimeFormatterBuilder$TimeZoneName.printTo(DateTimeFormatterBuilder.java:2268)
	at org.joda.time.format.DateTimeFormatterBuilder$Composite.printTo(DateTimeFormatterBuilder.java:2429)
	at org.joda.time.format.DateTimeFormat$StyleFormatter.printTo(DateTimeFormat.java:811)
	at org.joda.time.format.DateTimeFormatter.printTo(DateTimeFormatter.java:684)
	at org.joda.time.format.DateTimeFormatter.printTo(DateTimeFormatter.java:521)
	at org.joda.time.format.DateTimeFormatter.print(DateTimeFormatter.java:625)
	at org.joda.time.format.TestDateTimeFormatStyle.testForStyle_mediumFullDateTime(TestDateTimeFormatStyle.java:363)
Caused by: java.lang.NullPointerException
	at java.lang.Class.forName0(Native Method)
	at java.lang.Class.forName(Class.java:191)
	at org.joda.time.DateTimeZone.getDefaultNameProvider(DateTimeZone.java:132)
	... 36 more

testForStyle_longTime(org.joda.time.format.TestDateTimeFormatStyle)  Time elapsed: 0.001 sec  <<< ERROR!
java.lang.RuntimeException: java.lang.NullPointerException
	at org.joda.time.DateTimeZone.getDefaultNameProvider(DateTimeZone.java:133)
	at org.joda.time.DateTimeZone.getNameProvider(DateTimeZone.java:123)
	at org.joda.time.DateTimeZone.getShortName(DateTimeZone.java:168)
	at org.joda.time.format.DateTimeFormatterBuilder$TimeZoneName.print(DateTimeFormatterBuilder.java:2279)
	at org.joda.time.format.DateTimeFormatterBuilder$TimeZoneName.printTo(DateTimeFormatterBuilder.java:2268)
	at org.joda.time.format.DateTimeFormatterBuilder$Composite.printTo(DateTimeFormatterBuilder.java:2429)
	at org.joda.time.format.DateTimeFormat$StyleFormatter.printTo(DateTimeFormat.java:811)
	at org.joda.time.format.DateTimeFormatter.printTo(DateTimeFormatter.java:684)
	at org.joda.time.format.DateTimeFormatter.printTo(DateTimeFormatter.java:521)
	at org.joda.time.format.DateTimeFormatter.print(DateTimeFormatter.java:625)
	at org.joda.time.format.TestDateTimeFormatStyle.testForStyle_longTime(TestDateTimeFormatStyle.java:242)
Caused by: java.lang.NullPointerException
	at java.lang.Class.forName0(Native Method)
	at java.lang.Class.forName(Class.java:191)
	at org.joda.time.DateTimeZone.getDefaultNameProvider(DateTimeZone.java:132)
	... 36 more

testForStyle_longDateTime(org.joda.time.format.TestDateTimeFormatStyle)  Time elapsed: 0.001 sec  <<< ERROR!
java.lang.RuntimeException: java.lang.NullPointerException
	at org.joda.time.DateTimeZone.getDefaultNameProvider(DateTimeZone.java:133)
	at org.joda.time.DateTimeZone.getNameProvider(DateTimeZone.java:123)
	at org.joda.time.DateTimeZone.getShortName(DateTimeZone.java:168)
	at org.joda.time.format.DateTimeFormatterBuilder$TimeZoneName.print(DateTimeFormatterBuilder.java:2279)
	at org.joda.time.format.DateTimeFormatterBuilder$TimeZoneName.printTo(DateTimeFormatterBuilder.java:2268)
	at org.joda.time.format.DateTimeFormatterBuilder$Composite.printTo(DateTimeFormatterBuilder.java:2429)
	at org.joda.time.format.DateTimeFormat$StyleFormatter.printTo(DateTimeFormat.java:811)
	at org.joda.time.format.DateTimeFormatter.printTo(DateTimeFormatter.java:684)
	at org.joda.time.format.DateTimeFormatter.printTo(DateTimeFormatter.java:521)
	at org.joda.time.format.DateTimeFormatter.print(DateTimeFormatter.java:625)
	at org.joda.time.format.TestDateTimeFormatStyle.testForStyle_longDateTime(TestDateTimeFormatStyle.java:255)
Caused by: java.lang.NullPointerException
	at java.lang.Class.forName0(Native Method)
	at java.lang.Class.forName(Class.java:191)
	at org.joda.time.DateTimeZone.getDefaultNameProvider(DateTimeZone.java:132)
	... 36 more

testForStyle_fullTime(org.joda.time.format.TestDateTimeFormatStyle)  Time elapsed: 0.001 sec  <<< ERROR!
java.lang.RuntimeException: java.lang.NullPointerException
	at org.joda.time.DateTimeZone.getDefaultNameProvider(DateTimeZone.java:133)
	at org.joda.time.DateTimeZone.getNameProvider(DateTimeZone.java:123)
	at org.joda.time.DateTimeZone.getShortName(DateTimeZone.java:168)
	at org.joda.time.format.DateTimeFormatterBuilder$TimeZoneName.print(DateTimeFormatterBuilder.java:2279)
	at org.joda.time.format.DateTimeFormatterBuilder$TimeZoneName.printTo(DateTimeFormatterBuilder.java:2268)
	at org.joda.time.format.DateTimeFormatterBuilder$Composite.printTo(DateTimeFormatterBuilder.java:2429)
	at org.joda.time.format.DateTimeFormat$StyleFormatter.printTo(DateTimeFormat.java:811)
	at org.joda.time.format.DateTimeFormatter.printTo(DateTimeFormatter.java:684)
	at org.joda.time.format.DateTimeFormatter.printTo(DateTimeFormatter.java:521)
	at org.joda.time.format.DateTimeFormatter.print(DateTimeFormatter.java:625)
	at org.joda.time.format.TestDateTimeFormatStyle.testForStyle_fullTime(TestDateTimeFormatStyle.java:282)
Caused by: java.lang.NullPointerException
	at java.lang.Class.forName0(Native Method)
	at java.lang.Class.forName(Class.java:191)
	at org.joda.time.DateTimeZone.getDefaultNameProvider(DateTimeZone.java:132)
	... 36 more

testForStyle_fullDateTime(org.joda.time.format.TestDateTimeFormatStyle)  Time elapsed: 0.001 sec  <<< ERROR!
java.lang.RuntimeException: java.lang.NullPointerException
	at org.joda.time.DateTimeZone.getDefaultNameProvider(DateTimeZone.java:133)
	at org.joda.time.DateTimeZone.getNameProvider(DateTimeZone.java:123)
	at org.joda.time.DateTimeZone.getShortName(DateTimeZone.java:168)
	at org.joda.time.format.DateTimeFormatterBuilder$TimeZoneName.print(DateTimeFormatterBuilder.java:2279)
	at org.joda.time.format.DateTimeFormatterBuilder$TimeZoneName.printTo(DateTimeFormatterBuilder.java:2268)
	at org.joda.time.format.DateTimeFormatterBuilder$Composite.printTo(DateTimeFormatterBuilder.java:2429)
	at org.joda.time.format.DateTimeFormat$StyleFormatter.printTo(DateTimeFormat.java:811)
	at org.joda.time.format.DateTimeFormatter.printTo(DateTimeFormatter.java:684)
	at org.joda.time.format.DateTimeFormatter.printTo(DateTimeFormatter.java:521)
	at org.joda.time.format.DateTimeFormatter.print(DateTimeFormatter.java:625)
	at org.joda.time.format.TestDateTimeFormatStyle.testForStyle_fullDateTime(TestDateTimeFormatStyle.java:295)
Caused by: java.lang.NullPointerException
	at java.lang.Class.forName0(Native Method)
	at java.lang.Class.forName(Class.java:191)
	at org.joda.time.DateTimeZone.getDefaultNameProvider(DateTimeZone.java:132)
	... 36 more

testForStyle_shortLongDateTime(org.joda.time.format.TestDateTimeFormatStyle)  Time elapsed: 0.001 sec  <<< ERROR!
java.lang.RuntimeException: java.lang.NullPointerException
	at org.joda.time.DateTimeZone.getDefaultNameProvider(DateTimeZone.java:133)
	at org.joda.time.DateTimeZone.getNameProvider(DateTimeZone.java:123)
	at org.joda.time.DateTimeZone.getShortName(DateTimeZone.java:168)
	at org.joda.time.format.DateTimeFormatterBuilder$TimeZoneName.print(DateTimeFormatterBuilder.java:2279)
	at org.joda.time.format.DateTimeFormatterBuilder$TimeZoneName.printTo(DateTimeFormatterBuilder.java:2268)
	at org.joda.time.format.DateTimeFormatterBuilder$Composite.printTo(DateTimeFormatterBuilder.java:2429)
	at org.joda.time.format.DateTimeFormat$StyleFormatter.printTo(DateTimeFormat.java:811)
	at org.joda.time.format.DateTimeFormatter.printTo(DateTimeFormatter.java:684)
	at org.joda.time.format.DateTimeFormatter.printTo(DateTimeFormatter.java:521)
	at org.joda.time.format.DateTimeFormatter.print(DateTimeFormatter.java:625)
	at org.joda.time.format.TestDateTimeFormatStyle.testForStyle_shortLongDateTime(TestDateTimeFormatStyle.java:318)
Caused by: java.lang.NullPointerException
	at java.lang.Class.forName0(Native Method)
	at java.lang.Class.forName(Class.java:191)
	at org.joda.time.DateTimeZone.getDefaultNameProvider(DateTimeZone.java:132)
	... 36 more

testForStyle_shortFullDateTime(org.joda.time.format.TestDateTimeFormatStyle)  Time elapsed: 0.001 sec  <<< ERROR!
java.lang.RuntimeException: java.lang.NullPointerException
	at org.joda.time.DateTimeZone.getDefaultNameProvider(DateTimeZone.java:133)
	at org.joda.time.DateTimeZone.getNameProvider(DateTimeZone.java:123)
	at org.joda.time.DateTimeZone.getShortName(DateTimeZone.java:168)
	at org.joda.time.format.DateTimeFormatterBuilder$TimeZoneName.print(DateTimeFormatterBuilder.java:2279)
	at org.joda.time.format.DateTimeFormatterBuilder$TimeZoneName.printTo(DateTimeFormatterBuilder.java:2268)
	at org.joda.time.format.DateTimeFormatterBuilder$Composite.printTo(DateTimeFormatterBuilder.java:2429)
	at org.joda.time.format.DateTimeFormat$StyleFormatter.printTo(DateTimeFormat.java:811)
	at org.joda.time.format.DateTimeFormatter.printTo(DateTimeFormatter.java:684)
	at org.joda.time.format.DateTimeFormatter.printTo(DateTimeFormatter.java:521)
	at org.joda.time.format.DateTimeFormatter.print(DateTimeFormatter.java:625)
	at org.joda.time.format.TestDateTimeFormatStyle.testForStyle_shortFullDateTime(TestDateTimeFormatStyle.java:329)
Caused by: java.lang.NullPointerException
	at java.lang.Class.forName0(Native Method)
	at java.lang.Class.forName(Class.java:191)
	at org.joda.time.DateTimeZone.getDefaultNameProvider(DateTimeZone.java:132)
	... 36 more

test_printParseShortName(org.joda.time.format.TestDateTimeFormatterBuilder)  Time elapsed: 0.001 sec  <<< ERROR!
java.lang.RuntimeException: java.lang.NullPointerException
	at org.joda.time.DateTimeZone.getDefaultNameProvider(DateTimeZone.java:133)
	at org.joda.time.DateTimeZone.getNameProvider(DateTimeZone.java:123)
	at org.joda.time.DateTimeZone.getShortName(DateTimeZone.java:168)
	at org.joda.time.format.DateTimeFormatterBuilder$TimeZoneName.print(DateTimeFormatterBuilder.java:2279)
	at org.joda.time.format.DateTimeFormatterBuilder$TimeZoneName.printTo(DateTimeFormatterBuilder.java:2268)
	at org.joda.time.format.DateTimeFormatterBuilder$Composite.printTo(DateTimeFormatterBuilder.java:2429)
	at org.joda.time.format.DateTimeFormatter.printTo(DateTimeFormatter.java:684)
	at org.joda.time.format.DateTimeFormatter.printTo(DateTimeFormatter.java:521)
	at org.joda.time.format.DateTimeFormatter.print(DateTimeFormatter.java:625)
	at org.joda.time.format.TestDateTimeFormatterBuilder.test_printParseShortName(TestDateTimeFormatterBuilder.java:563)
Caused by: java.lang.NullPointerException
	at java.lang.Class.forName0(Native Method)
	at java.lang.Class.forName(Class.java:191)
	at org.joda.time.DateTimeZone.getDefaultNameProvider(DateTimeZone.java:132)
	... 35 more

test_printParseShortNameWithLookup(org.joda.time.format.TestDateTimeFormatterBuilder)  Time elapsed: 0.001 sec  <<< ERROR!
java.lang.RuntimeException: java.lang.NullPointerException
	at org.joda.time.DateTimeZone.getDefaultNameProvider(DateTimeZone.java:133)
	at org.joda.time.DateTimeZone.getNameProvider(DateTimeZone.java:123)
	at org.joda.time.DateTimeZone.getShortName(DateTimeZone.java:168)
	at org.joda.time.format.DateTimeFormatterBuilder$TimeZoneName.print(DateTimeFormatterBuilder.java:2279)
	at org.joda.time.format.DateTimeFormatterBuilder$TimeZoneName.printTo(DateTimeFormatterBuilder.java:2268)
	at org.joda.time.format.DateTimeFormatterBuilder$Composite.printTo(DateTimeFormatterBuilder.java:2429)
	at org.joda.time.format.DateTimeFormatter.printTo(DateTimeFormatter.java:684)
	at org.joda.time.format.DateTimeFormatter.printTo(DateTimeFormatter.java:521)
	at org.joda.time.format.DateTimeFormatter.print(DateTimeFormatter.java:625)
	at org.joda.time.format.TestDateTimeFormatterBuilder.test_printParseShortNameWithLookup(TestDateTimeFormatterBuilder.java:584)
Caused by: java.lang.NullPointerException
	at java.lang.Class.forName0(Native Method)
	at java.lang.Class.forName(Class.java:191)
	at org.joda.time.DateTimeZone.getDefaultNameProvider(DateTimeZone.java:132)
	... 35 more

test_printParseShortNameWithAutoLookup(org.joda.time.format.TestDateTimeFormatterBuilder)  Time elapsed: 0.001 sec  <<< ERROR!
java.lang.RuntimeException: java.lang.NullPointerException
	at org.joda.time.DateTimeZone.getDefaultNameProvider(DateTimeZone.java:133)
	at org.joda.time.DateTimeZone.getNameProvider(DateTimeZone.java:123)
	at org.joda.time.DateTimeZone.getShortName(DateTimeZone.java:168)
	at org.joda.time.format.DateTimeFormatterBuilder$TimeZoneName.print(DateTimeFormatterBuilder.java:2279)
	at org.joda.time.format.DateTimeFormatterBuilder$TimeZoneName.printTo(DateTimeFormatterBuilder.java:2268)
	at org.joda.time.format.DateTimeFormatterBuilder$Composite.printTo(DateTimeFormatterBuilder.java:2429)
	at org.joda.time.format.DateTimeFormatter.printTo(DateTimeFormatter.java:684)
	at org.joda.time.format.DateTimeFormatter.printTo(DateTimeFormatter.java:521)
	at org.joda.time.format.DateTimeFormatter.print(DateTimeFormatter.java:625)
	at org.joda.time.format.TestDateTimeFormatterBuilder.test_printParseShortNameWithAutoLookup(TestDateTimeFormatterBuilder.java:605)
Caused by: java.lang.NullPointerException
	at java.lang.Class.forName0(Native Method)
	at java.lang.Class.forName(Class.java:191)
	at org.joda.time.DateTimeZone.getDefaultNameProvider(DateTimeZone.java:132)
	... 35 more

test_printParseLongName(org.joda.time.format.TestDateTimeFormatterBuilder)  Time elapsed: 0.001 sec  <<< ERROR!
java.lang.RuntimeException: java.lang.NullPointerException
	at org.joda.time.DateTimeZone.getDefaultNameProvider(DateTimeZone.java:133)
	at org.joda.time.DateTimeZone.getNameProvider(DateTimeZone.java:123)
	at org.joda.time.DateTimeZone.getName(DateTimeZone.java:178)
	at org.joda.time.format.DateTimeFormatterBuilder$TimeZoneName.print(DateTimeFormatterBuilder.java:2277)
	at org.joda.time.format.DateTimeFormatterBuilder$TimeZoneName.printTo(DateTimeFormatterBuilder.java:2268)
	at org.joda.time.format.DateTimeFormatterBuilder$Composite.printTo(DateTimeFormatterBuilder.java:2429)
	at org.joda.time.format.DateTimeFormatter.printTo(DateTimeFormatter.java:684)
	at org.joda.time.format.DateTimeFormatter.printTo(DateTimeFormatter.java:521)
	at org.joda.time.format.DateTimeFormatter.print(DateTimeFormatter.java:625)
	at org.joda.time.format.TestDateTimeFormatterBuilder.test_printParseLongName(TestDateTimeFormatterBuilder.java:637)
Caused by: java.lang.NullPointerException
	at java.lang.Class.forName0(Native Method)
	at java.lang.Class.forName(Class.java:191)
	at org.joda.time.DateTimeZone.getDefaultNameProvider(DateTimeZone.java:132)
	... 35 more

test_printParseLongNameWithLookup(org.joda.time.format.TestDateTimeFormatterBuilder)  Time elapsed: 0.001 sec  <<< ERROR!
java.lang.RuntimeException: java.lang.NullPointerException
	at org.joda.time.DateTimeZone.getDefaultNameProvider(DateTimeZone.java:133)
	at org.joda.time.DateTimeZone.getNameProvider(DateTimeZone.java:123)
	at org.joda.time.DateTimeZone.getName(DateTimeZone.java:178)
	at org.joda.time.format.DateTimeFormatterBuilder$TimeZoneName.print(DateTimeFormatterBuilder.java:2277)
	at org.joda.time.format.DateTimeFormatterBuilder$TimeZoneName.printTo(DateTimeFormatterBuilder.java:2268)
	at org.joda.time.format.DateTimeFormatterBuilder$Composite.printTo(DateTimeFormatterBuilder.java:2429)
	at org.joda.time.format.DateTimeFormatter.printTo(DateTimeFormatter.java:684)
	at org.joda.time.format.DateTimeFormatter.printTo(DateTimeFormatter.java:521)
	at org.joda.time.format.DateTimeFormatter.print(DateTimeFormatter.java:625)
	at org.joda.time.format.TestDateTimeFormatterBuilder.test_printParseLongNameWithLookup(TestDateTimeFormatterBuilder.java:658)
Caused by: java.lang.NullPointerException
	at java.lang.Class.forName0(Native Method)
	at java.lang.Class.forName(Class.java:191)
	at org.joda.time.DateTimeZone.getDefaultNameProvider(DateTimeZone.java:132)
	... 35 more


Results :

Tests in error: 
  org.joda.time.TestDateTimeZone#testGetName RuntimeException java.lang.NullPoin...
  org.joda.time.TestDateTimeZone#testGetNameProviderName RuntimeException java.l...
  org.joda.time.TestDateTimeZone#testGetName_berlin RuntimeException java.lang.N...
  org.joda.time.TestDateTimeZone#testGetShortName RuntimeException java.lang.Nul...
  org.joda.time.TestDateTimeZone#testGetShortNameProviderName RuntimeException j...
  org.joda.time.TestDateTimeZone#testGetShortName_berlin RuntimeException java.l...
  org.joda.time.TestDateTimeZone#testNameProvider RuntimeException java.lang.Nul...
  org.joda.time.TestDateTimeZone#testPatchedNameKeysGazaHistoric RuntimeException
  org.joda.time.TestDateTimeZone#testPatchedNameKeysLondon RuntimeException java...
  org.joda.time.TestDateTimeZone#testPatchedNameKeysSydney RuntimeException java...
  org.joda.time.TestDateTimeZone#testPatchedNameKeysSydneyHistoric RuntimeException
  org.joda.time.format.TestDateTimeFormat#testFormat_zoneLongText RuntimeException
  org.joda.time.format.TestDateTimeFormat#testFormat_zoneText RuntimeException j...
  org.joda.time.format.TestDateTimeFormatStyle#testForStyle_fullDateTime RuntimeException
  org.joda.time.format.TestDateTimeFormatStyle#testForStyle_fullTime RuntimeException
  org.joda.time.format.TestDateTimeFormatStyle#testForStyle_longDateTime RuntimeException
  org.joda.time.format.TestDateTimeFormatStyle#testForStyle_longTime RuntimeException
  org.joda.time.format.TestDateTimeFormatStyle#testForStyle_mediumFullDateTime RuntimeException
  org.joda.time.format.TestDateTimeFormatStyle#testForStyle_mediumLongDateTime RuntimeException
  org.joda.time.format.TestDateTimeFormatStyle#testForStyle_shortFullDateTime RuntimeException
  org.joda.time.format.TestDateTimeFormatStyle#testForStyle_shortLongDateTime RuntimeException
  org.joda.time.format.TestDateTimeFormatter#testZoneNameNearTransition RuntimeException
  org.joda.time.format.TestDateTimeFormatter#testZoneShortNameNearTransition RuntimeException
  org.joda.time.format.TestDateTimeFormatterBuilder#test_printParseLongName RuntimeException
  org.joda.time.format.TestDateTimeFormatterBuilder#test_printParseLongNameWithLookup RuntimeException
  org.joda.time.format.TestDateTimeFormatterBuilder#test_printParseShortName RuntimeException
  org.joda.time.format.TestDateTimeFormatterBuilder#test_printParseShortNameWithAutoLookup RuntimeException
  org.joda.time.format.TestDateTimeFormatterBuilder#test_printParseShortNameWithLookup RuntimeException

Tests run: 4157, Failures: 0, Errors: 28, Skipped: 0

[INFO] ------------------------------------------------------------------------
[INFO] BUILD FAILURE
[INFO] ------------------------------------------------------------------------
[INFO] Total time: 18.733s
[INFO] Finished at: Wed Aug 05 15:35:49 BST 2015
[INFO] Final Memory: 9M/213M
[INFO] ------------------------------------------------------------------------
[ERROR] Failed to execute goal org.apache.maven.plugins:maven-surefire-plugin:2.18.1:test (default-test) on project joda-time: There are test failures.
[ERROR] 
[ERROR] Please refer to /home/perham/Study/LittleDarwin/Cases/joda-time-2.8.1/target/surefire-reports for the individual test results.
[ERROR] -> [Help 1]
[ERROR] 
[ERROR] To see the full stack trace of the errors, re-run Maven with the -e switch.
[ERROR] Re-run Maven using the -X switch to enable full debug logging.
[ERROR] 
[ERROR] For more information about the errors and possible solutions, please read the following articles:
[ERROR] [Help 1] http://cwiki.apache.org/confluence/display/MAVEN/MojoFailureException
