[INFO] Scanning for projects...
[INFO]                                                                         
[INFO] ------------------------------------------------------------------------
[INFO] Building Joda-Time 2.8.1
[INFO] ------------------------------------------------------------------------
[INFO] 
[INFO] --- maven-resources-plugin:2.7:resources (default-resources) @ joda-time ---
[INFO] Using 'UTF-8' encoding to copy filtered resources.
[INFO] Copying 2 resources to META-INF
[INFO] Copying 10 resources
[INFO] 
[INFO] --- maven-compiler-plugin:3.3:compile (default-compile) @ joda-time ---
[INFO] Changes detected - recompiling the module!
[INFO] Compiling 166 source files to /home/perham/Study/LittleDarwin/Cases/joda-time-2.8.1/target/classes
[INFO] 
[INFO] --- exec-maven-plugin:1.4.0:java (compile-tzdb) @ joda-time ---
Writing zoneinfo files
Writing ZoneInfoMap
[INFO] 
[INFO] --- maven-resources-plugin:2.7:testResources (default-testResources) @ joda-time ---
[INFO] Using 'UTF-8' encoding to copy filtered resources.
[INFO] Copying 34 resources
[INFO] 
[INFO] --- maven-compiler-plugin:3.3:testCompile (default-testCompile) @ joda-time ---
[INFO] Nothing to compile - all classes are up to date
[INFO] 
[INFO] --- maven-surefire-plugin:2.18.1:test (default-test) @ joda-time ---
[INFO] Surefire report directory: /home/perham/Study/LittleDarwin/Cases/joda-time-2.8.1/target/surefire-reports

-------------------------------------------------------
 T E S T S
-------------------------------------------------------
Running org.joda.time.TestAllPackages

TestBuddhistChronology.testCalendar

TestCopticChronology.testCalendar

TestEthiopicChronology.testCalendar

TestIslamicChronology.testCalendar

Testing Gregorian chronology over 1000 iterations
100% complete (i=1000)

Testing Julian chronology over 1000 iterations
100% complete (i=1000)
Writing zoneinfo files
Writing ZoneInfoMap
Tests run: 4157, Failures: 11, Errors: 0, Skipped: 0, Time elapsed: 6.691 sec <<< FAILURE! - in org.joda.time.TestAllPackages
test_DateTime_minusDay_Gaza(org.joda.time.TestDateTimeZoneCutover)  Time elapsed: 0.005 sec  <<< FAILURE!
junit.framework.ComparisonFailure: expected:<2007-0[4-01T01:00:00.000+03]:00> but was:<2007-0[3-31T23:00:00.000+02]:00>
	at junit.framework.Assert.assertEquals(Assert.java:81)
	at junit.framework.Assert.assertEquals(Assert.java:87)
	at org.joda.time.TestDateTimeZoneCutover.test_DateTime_minusDay_Gaza(TestDateTimeZoneCutover.java:163)

test_DateTime_plusDay_Gaza(org.joda.time.TestDateTimeZoneCutover)  Time elapsed: 0 sec  <<< FAILURE!
junit.framework.ComparisonFailure: expected:<2007-0[4-01T01:00:00.000+03]:00> but was:<2007-0[3-31T23:00:00.000+02]:00>
	at junit.framework.Assert.assertEquals(Assert.java:81)
	at junit.framework.Assert.assertEquals(Assert.java:87)
	at org.joda.time.TestDateTimeZoneCutover.test_DateTime_plusDay_Gaza(TestDateTimeZoneCutover.java:173)

test_DateTime_plusDayMidGap_Gaza(org.joda.time.TestDateTimeZoneCutover)  Time elapsed: 0.001 sec  <<< FAILURE!
junit.framework.ComparisonFailure: expected:<2007-0[4-01T01:30:00.000+03]:00> but was:<2007-0[3-31T23:30:00.000+02]:00>
	at junit.framework.Assert.assertEquals(Assert.java:81)
	at junit.framework.Assert.assertEquals(Assert.java:87)
	at org.joda.time.TestDateTimeZoneCutover.test_DateTime_plusDayMidGap_Gaza(TestDateTimeZoneCutover.java:183)

test_getOffsetFromLocal_Turk(org.joda.time.TestDateTimeZoneCutover)  Time elapsed: 0.001 sec  <<< FAILURE!
junit.framework.AssertionFailedError: expected:<-18000000> but was:<-14400000>
	at junit.framework.Assert.fail(Assert.java:47)
	at junit.framework.Assert.failNotEquals(Assert.java:280)
	at junit.framework.Assert.assertEquals(Assert.java:64)
	at junit.framework.Assert.assertEquals(Assert.java:133)
	at junit.framework.Assert.assertEquals(Assert.java:139)
	at org.joda.time.TestDateTimeZoneCutover.doTest_getOffsetFromLocal_Turk(TestDateTimeZoneCutover.java:296)
	at org.joda.time.TestDateTimeZoneCutover.test_getOffsetFromLocal_Turk(TestDateTimeZoneCutover.java:282)

test_DateTime_minusDay_Turk(org.joda.time.TestDateTimeZoneCutover)  Time elapsed: 0.002 sec  <<< FAILURE!
junit.framework.ComparisonFailure: expected:<2007-0[4-01T01:00:00.000-04]:00> but was:<2007-0[3-31T23:00:00.000-05]:00>
	at junit.framework.Assert.assertEquals(Assert.java:81)
	at junit.framework.Assert.assertEquals(Assert.java:87)
	at org.joda.time.TestDateTimeZoneCutover.test_DateTime_minusDay_Turk(TestDateTimeZoneCutover.java:380)

test_DateTime_plusDay_Turk(org.joda.time.TestDateTimeZoneCutover)  Time elapsed: 0.001 sec  <<< FAILURE!
junit.framework.ComparisonFailure: expected:<2007-0[4-01T01:00:00.000-04]:00> but was:<2007-0[3-31T23:00:00.000-05]:00>
	at junit.framework.Assert.assertEquals(Assert.java:81)
	at junit.framework.Assert.assertEquals(Assert.java:87)
	at org.joda.time.TestDateTimeZoneCutover.test_DateTime_plusDay_Turk(TestDateTimeZoneCutover.java:390)

test_DateTime_plusDayMidGap_Turk(org.joda.time.TestDateTimeZoneCutover)  Time elapsed: 0 sec  <<< FAILURE!
junit.framework.ComparisonFailure: expected:<2007-0[4-01T01:30:00.000-04]:00> but was:<2007-0[3-31T23:30:00.000-05]:00>
	at junit.framework.Assert.assertEquals(Assert.java:81)
	at junit.framework.Assert.assertEquals(Assert.java:87)
	at org.joda.time.TestDateTimeZoneCutover.test_DateTime_plusDayMidGap_Turk(TestDateTimeZoneCutover.java:400)

test_getOffsetFromLocal_RioBranco_Spring(org.joda.time.TestDateTimeZoneCutover)  Time elapsed: 0.001 sec  <<< FAILURE!
junit.framework.AssertionFailedError: expected:<-18000000> but was:<-14400000>
	at junit.framework.Assert.fail(Assert.java:47)
	at junit.framework.Assert.failNotEquals(Assert.java:280)
	at junit.framework.Assert.assertEquals(Assert.java:64)
	at junit.framework.Assert.assertEquals(Assert.java:133)
	at junit.framework.Assert.assertEquals(Assert.java:139)
	at org.joda.time.TestDateTimeZoneCutover.doTest_getOffsetFromLocal(TestDateTimeZoneCutover.java:1369)
	at org.joda.time.TestDateTimeZoneCutover.doTest_getOffsetFromLocal(TestDateTimeZoneCutover.java:1363)
	at org.joda.time.TestDateTimeZoneCutover.test_getOffsetFromLocal_RioBranco_Spring(TestDateTimeZoneCutover.java:1073)

test_getOffsetFromLocal_Gaza(org.joda.time.TestDateTimeZoneCutover)  Time elapsed: 0.001 sec  <<< FAILURE!
junit.framework.ComparisonFailure: 2007-03-31T23:00:00.000+02:00 expected:<2007-0[4-01T01:00:00.000+03]:00> but was:<2007-0[3-31T23:00:00.000+02]:00>
	at junit.framework.Assert.assertEquals(Assert.java:81)
	at org.joda.time.TestDateTimeZoneCutover.doTest_getOffsetFromLocal_Gaza(TestDateTimeZoneCutover.java:88)
	at org.joda.time.TestDateTimeZoneCutover.test_getOffsetFromLocal_Gaza(TestDateTimeZoneCutover.java:73)

test_getOffsetFromLocal_NewYork_Spring(org.joda.time.TestDateTimeZoneCutover)  Time elapsed: 0 sec  <<< FAILURE!
junit.framework.AssertionFailedError: expected:<-18000000> but was:<-14400000>
	at junit.framework.Assert.fail(Assert.java:47)
	at junit.framework.Assert.failNotEquals(Assert.java:280)
	at junit.framework.Assert.assertEquals(Assert.java:64)
	at junit.framework.Assert.assertEquals(Assert.java:133)
	at junit.framework.Assert.assertEquals(Assert.java:139)
	at org.joda.time.TestDateTimeZoneCutover.doTest_getOffsetFromLocal(TestDateTimeZoneCutover.java:1369)
	at org.joda.time.TestDateTimeZoneCutover.doTest_getOffsetFromLocal(TestDateTimeZoneCutover.java:1355)
	at org.joda.time.TestDateTimeZoneCutover.test_getOffsetFromLocal_NewYork_Spring(TestDateTimeZoneCutover.java:502)

test_getOffsetFromLocal_Moscow_Spring(org.joda.time.TestDateTimeZoneCutover)  Time elapsed: 0.001 sec  <<< FAILURE!
junit.framework.AssertionFailedError: expected:<10800000> but was:<14400000>
	at junit.framework.Assert.fail(Assert.java:47)
	at junit.framework.Assert.failNotEquals(Assert.java:280)
	at junit.framework.Assert.assertEquals(Assert.java:64)
	at junit.framework.Assert.assertEquals(Assert.java:133)
	at junit.framework.Assert.assertEquals(Assert.java:139)
	at org.joda.time.TestDateTimeZoneCutover.doTest_getOffsetFromLocal(TestDateTimeZoneCutover.java:1369)
	at org.joda.time.TestDateTimeZoneCutover.doTest_getOffsetFromLocal(TestDateTimeZoneCutover.java:1355)
	at org.joda.time.TestDateTimeZoneCutover.test_getOffsetFromLocal_Moscow_Spring(TestDateTimeZoneCutover.java:833)


Results :

Failed tests: 
  org.joda.time.TestDateTimeZoneCutover#test_DateTime_minusDay_Gaza ComparisonFailure
  org.joda.time.TestDateTimeZoneCutover#test_DateTime_minusDay_Turk ComparisonFailure
  org.joda.time.TestDateTimeZoneCutover#test_DateTime_plusDayMidGap_Gaza ComparisonFailure
  org.joda.time.TestDateTimeZoneCutover#test_DateTime_plusDayMidGap_Turk ComparisonFailure
  org.joda.time.TestDateTimeZoneCutover#test_DateTime_plusDay_Gaza ComparisonFailure
  org.joda.time.TestDateTimeZoneCutover#test_DateTime_plusDay_Turk ComparisonFailure
  org.joda.time.TestDateTimeZoneCutover#test_getOffsetFromLocal_Gaza ComparisonFailure
  org.joda.time.TestDateTimeZoneCutover#test_getOffsetFromLocal_Moscow_Spring AssertionFailedError
  org.joda.time.TestDateTimeZoneCutover#test_getOffsetFromLocal_NewYork_Spring AssertionFailedError
  org.joda.time.TestDateTimeZoneCutover#test_getOffsetFromLocal_RioBranco_Spring AssertionFailedError
  org.joda.time.TestDateTimeZoneCutover#test_getOffsetFromLocal_Turk AssertionFailedError

Tests run: 4157, Failures: 11, Errors: 0, Skipped: 0

[INFO] ------------------------------------------------------------------------
[INFO] BUILD FAILURE
[INFO] ------------------------------------------------------------------------
[INFO] Total time: 19.003s
[INFO] Finished at: Wed Aug 05 15:30:45 BST 2015
[INFO] Final Memory: 9M/214M
[INFO] ------------------------------------------------------------------------
[ERROR] Failed to execute goal org.apache.maven.plugins:maven-surefire-plugin:2.18.1:test (default-test) on project joda-time: There are test failures.
[ERROR] 
[ERROR] Please refer to /home/perham/Study/LittleDarwin/Cases/joda-time-2.8.1/target/surefire-reports for the individual test results.
[ERROR] -> [Help 1]
[ERROR] 
[ERROR] To see the full stack trace of the errors, re-run Maven with the -e switch.
[ERROR] Re-run Maven using the -X switch to enable full debug logging.
[ERROR] 
[ERROR] For more information about the errors and possible solutions, please read the following articles:
[ERROR] [Help 1] http://cwiki.apache.org/confluence/display/MAVEN/MojoFailureException
