[INFO] Scanning for projects...
[INFO]                                                                         
[INFO] ------------------------------------------------------------------------
[INFO] Building Joda-Time 2.8.1
[INFO] ------------------------------------------------------------------------
[INFO] 
[INFO] --- maven-resources-plugin:2.7:resources (default-resources) @ joda-time ---
[INFO] Using 'UTF-8' encoding to copy filtered resources.
[INFO] Copying 2 resources to META-INF
[INFO] Copying 10 resources
[INFO] 
[INFO] --- maven-compiler-plugin:3.3:compile (default-compile) @ joda-time ---
[INFO] Changes detected - recompiling the module!
[INFO] Compiling 166 source files to /home/perham/Study/LittleDarwin/Cases/joda-time-2.8.1/target/classes
[INFO] 
[INFO] --- exec-maven-plugin:1.4.0:java (compile-tzdb) @ joda-time ---
Writing zoneinfo files
Writing ZoneInfoMap
[INFO] 
[INFO] --- maven-resources-plugin:2.7:testResources (default-testResources) @ joda-time ---
[INFO] Using 'UTF-8' encoding to copy filtered resources.
[INFO] Copying 34 resources
[INFO] 
[INFO] --- maven-compiler-plugin:3.3:testCompile (default-testCompile) @ joda-time ---
[INFO] Nothing to compile - all classes are up to date
[INFO] 
[INFO] --- maven-surefire-plugin:2.18.1:test (default-test) @ joda-time ---
[INFO] Surefire report directory: /home/perham/Study/LittleDarwin/Cases/joda-time-2.8.1/target/surefire-reports

-------------------------------------------------------
 T E S T S
-------------------------------------------------------
Running org.joda.time.TestAllPackages

TestBuddhistChronology.testCalendar

TestCopticChronology.testCalendar

TestEthiopicChronology.testCalendar

TestIslamicChronology.testCalendar

Testing Gregorian chronology over 1000 iterations
100% complete (i=1000)

Testing Julian chronology over 1000 iterations
100% complete (i=1000)
Writing zoneinfo files
Writing ZoneInfoMap
Tests run: 4157, Failures: 0, Errors: 6, Skipped: 0, Time elapsed: 6.616 sec <<< FAILURE! - in org.joda.time.TestAllPackages
test_lenientChrononolgy_Chicago(org.joda.time.chrono.TestLenientChronology)  Time elapsed: 0.006 sec  <<< ERROR!
java.lang.ArithmeticException: Adding time zone offset caused overflow
	at org.joda.time.DateTimeZone.convertUTCToLocal(DateTimeZone.java:203)
	at org.joda.time.field.LenientDateTimeField.set(LenientDateTimeField.java:72)
	at org.joda.time.chrono.BaseChronology.getDateTimeMillis(BaseChronology.java:132)
	at org.joda.time.chrono.AssembledChronology.getDateTimeMillis(AssembledChronology.java:136)
	at org.joda.time.base.BaseDateTime.<init>(BaseDateTime.java:258)
	at org.joda.time.DateTime.<init>(DateTime.java:532)
	at org.joda.time.chrono.TestLenientChronology.test_lenientChrononolgy_Chicago(TestLenientChronology.java:138)

test_lenientChrononolgy_Turk(org.joda.time.chrono.TestLenientChronology)  Time elapsed: 0.001 sec  <<< ERROR!
java.lang.ArithmeticException: Adding time zone offset caused overflow
	at org.joda.time.DateTimeZone.convertUTCToLocal(DateTimeZone.java:203)
	at org.joda.time.field.LenientDateTimeField.set(LenientDateTimeField.java:72)
	at org.joda.time.chrono.BaseChronology.getDateTimeMillis(BaseChronology.java:132)
	at org.joda.time.chrono.AssembledChronology.getDateTimeMillis(AssembledChronology.java:136)
	at org.joda.time.base.BaseDateTime.<init>(BaseDateTime.java:258)
	at org.joda.time.DateTime.<init>(DateTime.java:532)
	at org.joda.time.chrono.TestLenientChronology.test_lenientChrononolgy_Turk(TestLenientChronology.java:144)

testNearDstTransition(org.joda.time.chrono.TestLenientChronology)  Time elapsed: 0.002 sec  <<< ERROR!
java.lang.ArithmeticException: Adding time zone offset caused overflow
	at org.joda.time.DateTimeZone.convertUTCToLocal(DateTimeZone.java:203)
	at org.joda.time.field.LenientDateTimeField.set(LenientDateTimeField.java:72)
	at org.joda.time.chrono.BaseChronology.getDateTimeMillis(BaseChronology.java:132)
	at org.joda.time.chrono.AssembledChronology.getDateTimeMillis(AssembledChronology.java:136)
	at org.joda.time.base.BaseDateTime.<init>(BaseDateTime.java:258)
	at org.joda.time.DateTime.<init>(DateTime.java:532)
	at org.joda.time.chrono.TestLenientChronology.testNearDstTransition(TestLenientChronology.java:105)

testPrint_chrono_and_zone(org.joda.time.format.TestDateTimeFormatter)  Time elapsed: 0.002 sec  <<< ERROR!
java.lang.ArithmeticException: Adding time zone offset caused overflow
	at org.joda.time.DateTimeZone.convertUTCToLocal(DateTimeZone.java:203)
	at org.joda.time.chrono.ZonedChronology$ZonedDateTimeField.set(ZonedChronology.java:481)
	at org.joda.time.field.DelegatedDateTimeField.set(DelegatedDateTimeField.java:186)
	at org.joda.time.field.SkipUndoDateTimeField.set(SkipUndoDateTimeField.java:91)
	at org.joda.time.field.DecoratedDateTimeField.set(DecoratedDateTimeField.java:83)
	at org.joda.time.field.OffsetDateTimeField.set(OffsetDateTimeField.java:154)
	at org.joda.time.chrono.BaseChronology.getDateTimeMillis(BaseChronology.java:132)
	at org.joda.time.chrono.AssembledChronology.getDateTimeMillis(AssembledChronology.java:136)
	at org.joda.time.base.BaseDateTime.<init>(BaseDateTime.java:258)
	at org.joda.time.DateTime.<init>(DateTime.java:532)
	at org.joda.time.chrono.BuddhistChronology.getInstance(BuddhistChronology.java:113)
	at org.joda.time.chrono.BuddhistChronology.withZone(BuddhistChronology.java:167)
	at org.joda.time.format.DateTimeFormatter.selectChronology(DateTimeFormatter.java:973)
	at org.joda.time.format.DateTimeFormatter.printTo(DateTimeFormatter.java:672)
	at org.joda.time.format.DateTimeFormatter.printTo(DateTimeFormatter.java:521)
	at org.joda.time.format.DateTimeFormatter.print(DateTimeFormatter.java:625)
	at org.joda.time.format.TestDateTimeFormatter.testPrint_chrono_and_zone(TestDateTimeFormatter.java:260)

test_appendTimeZoneOffset_parse(org.joda.time.format.TestDateTimeFormatterBuilder)  Time elapsed: 0.001 sec  <<< ERROR!
java.lang.ArithmeticException: Adding time zone offset caused overflow
	at org.joda.time.DateTimeZone.convertUTCToLocal(DateTimeZone.java:203)
	at org.joda.time.chrono.ZonedChronology$ZonedDateTimeField.get(ZonedChronology.java:422)
	at org.joda.time.base.BaseDateTime.<init>(BaseDateTime.java:129)
	at org.joda.time.DateTime.<init>(DateTime.java:236)
	at org.joda.time.format.DateTimeFormatter.parseDateTime(DateTimeFormatter.java:890)
	at org.joda.time.format.TestDateTimeFormatterBuilder.test_appendTimeZoneOffset_parse(TestDateTimeFormatterBuilder.java:328)

test_appendTimeZoneId(org.joda.time.format.TestDateTimeFormatterBuilder)  Time elapsed: 0.002 sec  <<< ERROR!
java.lang.ArithmeticException: Adding time zone offset caused overflow
	at org.joda.time.DateTimeZone.convertUTCToLocal(DateTimeZone.java:203)
	at org.joda.time.chrono.ZonedChronology$ZonedDateTimeField.get(ZonedChronology.java:422)
	at org.joda.time.base.BaseDateTime.<init>(BaseDateTime.java:129)
	at org.joda.time.DateTime.<init>(DateTime.java:236)
	at org.joda.time.format.DateTimeFormatter.parseDateTime(DateTimeFormatter.java:890)
	at org.joda.time.format.TestDateTimeFormatterBuilder.test_appendTimeZoneId(TestDateTimeFormatterBuilder.java:399)


Results :

Tests in error: 
  org.joda.time.chrono.TestLenientChronology#testNearDstTransition ArithmeticException
  org.joda.time.chrono.TestLenientChronology#test_lenientChrononolgy_Chicago ArithmeticException
  org.joda.time.chrono.TestLenientChronology#test_lenientChrononolgy_Turk ArithmeticException
  org.joda.time.format.TestDateTimeFormatter#testPrint_chrono_and_zone ArithmeticException
  org.joda.time.format.TestDateTimeFormatterBuilder#test_appendTimeZoneId ArithmeticException
  org.joda.time.format.TestDateTimeFormatterBuilder#test_appendTimeZoneOffset_parse ArithmeticException

Tests run: 4157, Failures: 0, Errors: 6, Skipped: 0

[INFO] ------------------------------------------------------------------------
[INFO] BUILD FAILURE
[INFO] ------------------------------------------------------------------------
[INFO] Total time: 19.922s
[INFO] Finished at: Wed Aug 05 15:28:08 BST 2015
[INFO] Final Memory: 9M/213M
[INFO] ------------------------------------------------------------------------
[ERROR] Failed to execute goal org.apache.maven.plugins:maven-surefire-plugin:2.18.1:test (default-test) on project joda-time: There are test failures.
[ERROR] 
[ERROR] Please refer to /home/perham/Study/LittleDarwin/Cases/joda-time-2.8.1/target/surefire-reports for the individual test results.
[ERROR] -> [Help 1]
[ERROR] 
[ERROR] To see the full stack trace of the errors, re-run Maven with the -e switch.
[ERROR] Re-run Maven using the -X switch to enable full debug logging.
[ERROR] 
[ERROR] For more information about the errors and possible solutions, please read the following articles:
[ERROR] [Help 1] http://cwiki.apache.org/confluence/display/MAVEN/MojoFailureException
