[INFO] Scanning for projects...
[INFO]                                                                         
[INFO] ------------------------------------------------------------------------
[INFO] Building Joda-Time 2.8.1
[INFO] ------------------------------------------------------------------------
[INFO] 
[INFO] --- maven-resources-plugin:2.7:resources (default-resources) @ joda-time ---
[INFO] Using 'UTF-8' encoding to copy filtered resources.
[INFO] Copying 2 resources to META-INF
[INFO] Copying 10 resources
[INFO] 
[INFO] --- maven-compiler-plugin:3.3:compile (default-compile) @ joda-time ---
[INFO] Changes detected - recompiling the module!
[INFO] Compiling 166 source files to /home/perham/Study/LittleDarwin/Cases/joda-time-2.8.1/target/classes
[INFO] 
[INFO] --- exec-maven-plugin:1.4.0:java (compile-tzdb) @ joda-time ---
Writing zoneinfo files
Writing ZoneInfoMap
[INFO] 
[INFO] --- maven-resources-plugin:2.7:testResources (default-testResources) @ joda-time ---
[INFO] Using 'UTF-8' encoding to copy filtered resources.
[INFO] Copying 34 resources
[INFO] 
[INFO] --- maven-compiler-plugin:3.3:testCompile (default-testCompile) @ joda-time ---
[INFO] Nothing to compile - all classes are up to date
[INFO] 
[INFO] --- maven-surefire-plugin:2.18.1:test (default-test) @ joda-time ---
[INFO] Surefire report directory: /home/perham/Study/LittleDarwin/Cases/joda-time-2.8.1/target/surefire-reports

-------------------------------------------------------
 T E S T S
-------------------------------------------------------
Running org.joda.time.TestAllPackages

Results :

Tests run: 0, Failures: 0, Errors: 0, Skipped: 0

[INFO] ------------------------------------------------------------------------
[INFO] BUILD FAILURE
[INFO] ------------------------------------------------------------------------
[INFO] Total time: 11.802s
[INFO] Finished at: Wed Aug 05 15:25:48 BST 2015
[INFO] Final Memory: 9M/214M
[INFO] ------------------------------------------------------------------------
[ERROR] Failed to execute goal org.apache.maven.plugins:maven-surefire-plugin:2.18.1:test (default-test) on project joda-time: Execution default-test of goal org.apache.maven.plugins:maven-surefire-plugin:2.18.1:test failed: There was an error in the forked process
[ERROR] org.apache.maven.surefire.testset.TestSetFailedException: org.joda.time.TestAllPackages
[ERROR] at org.apache.maven.surefire.junit.JUnitTestSet.execute(JUnitTestSet.java:115)
[ERROR] at org.apache.maven.surefire.junit.JUnit3Provider.executeTestSet(JUnit3Provider.java:130)
[ERROR] at org.apache.maven.surefire.junit.JUnit3Provider.invoke(JUnit3Provider.java:107)
[ERROR] at org.apache.maven.surefire.booter.ForkedBooter.invokeProviderInSameClassLoader(ForkedBooter.java:203)
[ERROR] at org.apache.maven.surefire.booter.ForkedBooter.runSuitesInProcess(ForkedBooter.java:155)
[ERROR] at org.apache.maven.surefire.booter.ForkedBooter.main(ForkedBooter.java:103)
[ERROR] Caused by: java.lang.ExceptionInInitializerError
[ERROR] at org.joda.time.TestAll.suite(TestAll.java:65)
[ERROR] at org.joda.time.TestAllPackages.suite(TestAllPackages.java:36)
[ERROR] at sun.reflect.NativeMethodAccessorImpl.invoke0(Native Method)
[ERROR] at sun.reflect.NativeMethodAccessorImpl.invoke(NativeMethodAccessorImpl.java:57)
[ERROR] at sun.reflect.DelegatingMethodAccessorImpl.invoke(DelegatingMethodAccessorImpl.java:43)
[ERROR] at java.lang.reflect.Method.invoke(Method.java:606)
[ERROR] at org.apache.maven.surefire.common.junit3.JUnit3Reflector.createInstanceFromSuiteMethod(JUnit3Reflector.java:159)
[ERROR] at org.apache.maven.surefire.common.junit3.JUnit3Reflector.constructTestObject(JUnit3Reflector.java:124)
[ERROR] at org.apache.maven.surefire.junit.JUnitTestSet.execute(JUnitTestSet.java:74)
[ERROR] ... 5 more
[ERROR] Caused by: java.lang.ArithmeticException: Subtracting time zone offset caused overflow
[ERROR] at org.joda.time.DateTimeZone.convertLocalToUTC(DateTimeZone.java:219)
[ERROR] at org.joda.time.DateTimeZone.convertLocalToUTC(DateTimeZone.java:209)
[ERROR] at org.joda.time.chrono.ZonedChronology$ZonedDateTimeField.set(ZonedChronology.java:483)
[ERROR] at org.joda.time.field.DelegatedDateTimeField.set(DelegatedDateTimeField.java:186)
[ERROR] at org.joda.time.field.SkipUndoDateTimeField.set(SkipUndoDateTimeField.java:91)
[ERROR] at org.joda.time.field.DecoratedDateTimeField.set(DecoratedDateTimeField.java:83)
[ERROR] at org.joda.time.field.OffsetDateTimeField.set(OffsetDateTimeField.java:154)
[ERROR] at org.joda.time.chrono.BaseChronology.getDateTimeMillis(BaseChronology.java:132)
[ERROR] at org.joda.time.chrono.AssembledChronology.getDateTimeMillis(AssembledChronology.java:136)
[ERROR] at org.joda.time.base.BaseDateTime.<init>(BaseDateTime.java:258)
[ERROR] at org.joda.time.DateTime.<init>(DateTime.java:532)
[ERROR] at org.joda.time.chrono.BuddhistChronology.getInstance(BuddhistChronology.java:113)
[ERROR] at org.joda.time.TestLocalDateTime_Basics.<clinit>(TestLocalDateTime_Basics.java:62)
[ERROR] ... 14 more
[ERROR] -> [Help 1]
[ERROR] 
[ERROR] To see the full stack trace of the errors, re-run Maven with the -e switch.
[ERROR] Re-run Maven using the -X switch to enable full debug logging.
[ERROR] 
[ERROR] For more information about the errors and possible solutions, please read the following articles:
[ERROR] [Help 1] http://cwiki.apache.org/confluence/display/MAVEN/PluginExecutionException
