[INFO] Scanning for projects...
[INFO]                                                                         
[INFO] ------------------------------------------------------------------------
[INFO] Building Joda-Time 2.8.1
[INFO] ------------------------------------------------------------------------
[INFO] 
[INFO] --- maven-resources-plugin:2.7:resources (default-resources) @ joda-time ---
[INFO] Using 'UTF-8' encoding to copy filtered resources.
[INFO] Copying 2 resources to META-INF
[INFO] Copying 10 resources
[INFO] 
[INFO] --- maven-compiler-plugin:3.3:compile (default-compile) @ joda-time ---
[INFO] Changes detected - recompiling the module!
[INFO] Compiling 166 source files to /home/perham/Study/LittleDarwin/Cases/joda-time-2.8.1/target/classes
[INFO] 
[INFO] --- exec-maven-plugin:1.4.0:java (compile-tzdb) @ joda-time ---
Writing zoneinfo files
Writing ZoneInfoMap
[INFO] 
[INFO] --- maven-resources-plugin:2.7:testResources (default-testResources) @ joda-time ---
[INFO] Using 'UTF-8' encoding to copy filtered resources.
[INFO] Copying 34 resources
[INFO] 
[INFO] --- maven-compiler-plugin:3.3:testCompile (default-testCompile) @ joda-time ---
[INFO] Nothing to compile - all classes are up to date
[INFO] 
[INFO] --- maven-surefire-plugin:2.18.1:test (default-test) @ joda-time ---
[INFO] Surefire report directory: /home/perham/Study/LittleDarwin/Cases/joda-time-2.8.1/target/surefire-reports

-------------------------------------------------------
 T E S T S
-------------------------------------------------------
Running org.joda.time.TestAllPackages

TestBuddhistChronology.testCalendar

TestCopticChronology.testCalendar

TestEthiopicChronology.testCalendar

TestIslamicChronology.testCalendar

Testing Gregorian chronology over 1000 iterations
100% complete (i=1000)

Testing Julian chronology over 1000 iterations
100% complete (i=1000)
Writing zoneinfo files
Writing ZoneInfoMap
Tests run: 4157, Failures: 0, Errors: 29, Skipped: 0, Time elapsed: 7.606 sec <<< FAILURE! - in org.joda.time.TestAllPackages
testConstructor_RP_RP1(org.joda.time.TestPeriod_Constructors)  Time elapsed: 0.005 sec  <<< ERROR!
java.lang.IndexOutOfBoundsException: Invalid index: -1
	at org.joda.time.YearMonthDay.getField(YearMonthDay.java:339)
	at org.joda.time.base.AbstractPartial.getField(AbstractPartial.java:105)
	at org.joda.time.DateTimeUtils.isContiguous(DateTimeUtils.java:65)
	at org.joda.time.base.BasePeriod.<init>(BasePeriod.java:177)
	at org.joda.time.Period.<init>(Period.java:582)
	at org.joda.time.TestPeriod_Constructors.testConstructor_RP_RP1(TestPeriod_Constructors.java:805)

testConstructor_RP_RP2(org.joda.time.TestPeriod_Constructors)  Time elapsed: 0.001 sec  <<< ERROR!
java.lang.IndexOutOfBoundsException: Invalid index: -1
	at org.joda.time.YearMonthDay.getField(YearMonthDay.java:339)
	at org.joda.time.base.AbstractPartial.getField(AbstractPartial.java:105)
	at org.joda.time.DateTimeUtils.isContiguous(DateTimeUtils.java:65)
	at org.joda.time.base.BasePeriod.<init>(BasePeriod.java:177)
	at org.joda.time.Period.<init>(Period.java:582)
	at org.joda.time.TestPeriod_Constructors.testConstructor_RP_RP2(TestPeriod_Constructors.java:821)

testConstructor_RP_RP8(org.joda.time.TestPeriod_Constructors)  Time elapsed: 0.001 sec  <<< ERROR!
java.lang.ArrayIndexOutOfBoundsException: -1
	at org.joda.time.Partial.getField(Partial.java:358)
	at org.joda.time.base.AbstractPartial.getField(AbstractPartial.java:105)
	at org.joda.time.DateTimeUtils.isContiguous(DateTimeUtils.java:65)
	at org.joda.time.base.BasePeriod.<init>(BasePeriod.java:177)
	at org.joda.time.Period.<init>(Period.java:582)
	at org.joda.time.TestPeriod_Constructors.testConstructor_RP_RP8(TestPeriod_Constructors.java:901)

testConstructor_RP_RP_PeriodType1(org.joda.time.TestPeriod_Constructors)  Time elapsed: 0.001 sec  <<< ERROR!
java.lang.IndexOutOfBoundsException: Invalid index: -1
	at org.joda.time.YearMonthDay.getField(YearMonthDay.java:339)
	at org.joda.time.base.AbstractPartial.getField(AbstractPartial.java:105)
	at org.joda.time.DateTimeUtils.isContiguous(DateTimeUtils.java:65)
	at org.joda.time.base.BasePeriod.<init>(BasePeriod.java:177)
	at org.joda.time.Period.<init>(Period.java:616)
	at org.joda.time.TestPeriod_Constructors.testConstructor_RP_RP_PeriodType1(TestPeriod_Constructors.java:911)

testConstructor_RP_RP_PeriodType2(org.joda.time.TestPeriod_Constructors)  Time elapsed: 0.002 sec  <<< ERROR!
java.lang.IndexOutOfBoundsException: Invalid index: -1
	at org.joda.time.YearMonthDay.getField(YearMonthDay.java:339)
	at org.joda.time.base.AbstractPartial.getField(AbstractPartial.java:105)
	at org.joda.time.DateTimeUtils.isContiguous(DateTimeUtils.java:65)
	at org.joda.time.base.BasePeriod.<init>(BasePeriod.java:177)
	at org.joda.time.Period.<init>(Period.java:616)
	at org.joda.time.TestPeriod_Constructors.testConstructor_RP_RP_PeriodType2(TestPeriod_Constructors.java:927)

testConstructor_RP_RP_PeriodType8(org.joda.time.TestPeriod_Constructors)  Time elapsed: 0.001 sec  <<< ERROR!
java.lang.ArrayIndexOutOfBoundsException: -1
	at org.joda.time.Partial.getField(Partial.java:358)
	at org.joda.time.base.AbstractPartial.getField(AbstractPartial.java:105)
	at org.joda.time.DateTimeUtils.isContiguous(DateTimeUtils.java:65)
	at org.joda.time.base.BasePeriod.<init>(BasePeriod.java:177)
	at org.joda.time.Period.<init>(Period.java:616)
	at org.joda.time.TestPeriod_Constructors.testConstructor_RP_RP_PeriodType8(TestPeriod_Constructors.java:1007)

testFactory_between_RPartial(org.joda.time.TestBaseSingleFieldPeriod)  Time elapsed: 0 sec  <<< ERROR!
java.lang.IndexOutOfBoundsException: Invalid index: -1
	at org.joda.time.LocalDate.getField(LocalDate.java:507)
	at org.joda.time.base.AbstractPartial.getField(AbstractPartial.java:105)
	at org.joda.time.DateTimeUtils.isContiguous(DateTimeUtils.java:65)
	at org.joda.time.base.BaseSingleFieldPeriod.between(BaseSingleFieldPeriod.java:101)
	at org.joda.time.TestBaseSingleFieldPeriod$Single.between(TestBaseSingleFieldPeriod.java:310)
	at org.joda.time.TestBaseSingleFieldPeriod.testFactory_between_RPartial(TestBaseSingleFieldPeriod.java:90)

testFactory_yearsBetween_RPartial(org.joda.time.TestYears)  Time elapsed: 0.001 sec  <<< ERROR!
java.lang.IndexOutOfBoundsException: Invalid index: -1
	at org.joda.time.LocalDate.getField(LocalDate.java:507)
	at org.joda.time.base.AbstractPartial.getField(AbstractPartial.java:105)
	at org.joda.time.DateTimeUtils.isContiguous(DateTimeUtils.java:65)
	at org.joda.time.base.BaseSingleFieldPeriod.between(BaseSingleFieldPeriod.java:101)
	at org.joda.time.Years.yearsBetween(Years.java:125)
	at org.joda.time.TestYears.testFactory_yearsBetween_RPartial(TestYears.java:99)

testFactory_monthsBetween_RPartial_LocalDate(org.joda.time.TestMonths)  Time elapsed: 0.005 sec  <<< ERROR!
java.lang.IndexOutOfBoundsException: Invalid index: -1
	at org.joda.time.LocalDate.getField(LocalDate.java:507)
	at org.joda.time.base.AbstractPartial.getField(AbstractPartial.java:105)
	at org.joda.time.DateTimeUtils.isContiguous(DateTimeUtils.java:65)
	at org.joda.time.base.BaseSingleFieldPeriod.between(BaseSingleFieldPeriod.java:101)
	at org.joda.time.Months.monthsBetween(Months.java:161)
	at org.joda.time.TestMonths.testFactory_monthsBetween_RPartial_LocalDate(TestMonths.java:118)

testFactory_monthsBetween_RPartial_YearMonth(org.joda.time.TestMonths)  Time elapsed: 0 sec  <<< ERROR!
java.lang.IndexOutOfBoundsException: Invalid index: -1
	at org.joda.time.YearMonth.getField(YearMonth.java:406)
	at org.joda.time.base.AbstractPartial.getField(AbstractPartial.java:105)
	at org.joda.time.DateTimeUtils.isContiguous(DateTimeUtils.java:65)
	at org.joda.time.base.BaseSingleFieldPeriod.between(BaseSingleFieldPeriod.java:101)
	at org.joda.time.Months.monthsBetween(Months.java:161)
	at org.joda.time.TestMonths.testFactory_monthsBetween_RPartial_YearMonth(TestMonths.java:126)

testFactory_monthsBetween_RPartial_MonthDay(org.joda.time.TestMonths)  Time elapsed: 0 sec  <<< ERROR!
java.lang.IndexOutOfBoundsException: Invalid index: -1
	at org.joda.time.MonthDay.getField(MonthDay.java:414)
	at org.joda.time.base.AbstractPartial.getField(AbstractPartial.java:105)
	at org.joda.time.DateTimeUtils.isContiguous(DateTimeUtils.java:65)
	at org.joda.time.base.BaseSingleFieldPeriod.between(BaseSingleFieldPeriod.java:101)
	at org.joda.time.Months.monthsBetween(Months.java:161)
	at org.joda.time.TestMonths.testFactory_monthsBetween_RPartial_MonthDay(TestMonths.java:137)

testFactory_weeksBetween_RPartial(org.joda.time.TestWeeks)  Time elapsed: 0.001 sec  <<< ERROR!
java.lang.IndexOutOfBoundsException: Invalid index: -1
	at org.joda.time.LocalDate.getField(LocalDate.java:507)
	at org.joda.time.base.AbstractPartial.getField(AbstractPartial.java:105)
	at org.joda.time.DateTimeUtils.isContiguous(DateTimeUtils.java:65)
	at org.joda.time.base.BaseSingleFieldPeriod.between(BaseSingleFieldPeriod.java:101)
	at org.joda.time.Weeks.weeksBetween(Weeks.java:124)
	at org.joda.time.TestWeeks.testFactory_weeksBetween_RPartial(TestWeeks.java:99)

testFactory_daysBetween_RPartial_LocalDate(org.joda.time.TestDays)  Time elapsed: 0.001 sec  <<< ERROR!
java.lang.IndexOutOfBoundsException: Invalid index: -1
	at org.joda.time.LocalDate.getField(LocalDate.java:507)
	at org.joda.time.base.AbstractPartial.getField(AbstractPartial.java:105)
	at org.joda.time.DateTimeUtils.isContiguous(DateTimeUtils.java:65)
	at org.joda.time.base.BaseSingleFieldPeriod.between(BaseSingleFieldPeriod.java:101)
	at org.joda.time.Days.daysBetween(Days.java:141)
	at org.joda.time.TestDays.testFactory_daysBetween_RPartial_LocalDate(TestDays.java:108)

testFactory_daysBetween_RPartial_YearMonth(org.joda.time.TestDays)  Time elapsed: 0 sec  <<< ERROR!
java.lang.IndexOutOfBoundsException: Invalid index: -1
	at org.joda.time.YearMonth.getField(YearMonth.java:406)
	at org.joda.time.base.AbstractPartial.getField(AbstractPartial.java:105)
	at org.joda.time.DateTimeUtils.isContiguous(DateTimeUtils.java:65)
	at org.joda.time.base.BaseSingleFieldPeriod.between(BaseSingleFieldPeriod.java:101)
	at org.joda.time.Days.daysBetween(Days.java:141)
	at org.joda.time.TestDays.testFactory_daysBetween_RPartial_YearMonth(TestDays.java:117)

testFactory_daysBetween_RPartial_MonthDay(org.joda.time.TestDays)  Time elapsed: 0.001 sec  <<< ERROR!
java.lang.IndexOutOfBoundsException: Invalid index: -1
	at org.joda.time.MonthDay.getField(MonthDay.java:414)
	at org.joda.time.base.AbstractPartial.getField(AbstractPartial.java:105)
	at org.joda.time.DateTimeUtils.isContiguous(DateTimeUtils.java:65)
	at org.joda.time.base.BaseSingleFieldPeriod.between(BaseSingleFieldPeriod.java:101)
	at org.joda.time.Days.daysBetween(Days.java:141)
	at org.joda.time.TestDays.testFactory_daysBetween_RPartial_MonthDay(TestDays.java:130)

testFactory_hoursBetween_RPartial(org.joda.time.TestHours)  Time elapsed: 0.001 sec  <<< ERROR!
java.lang.IndexOutOfBoundsException: Invalid index: -1
	at org.joda.time.LocalTime.getField(LocalTime.java:558)
	at org.joda.time.base.AbstractPartial.getField(AbstractPartial.java:105)
	at org.joda.time.DateTimeUtils.isContiguous(DateTimeUtils.java:65)
	at org.joda.time.base.BaseSingleFieldPeriod.between(BaseSingleFieldPeriod.java:101)
	at org.joda.time.Hours.hoursBetween(Hours.java:144)
	at org.joda.time.TestHours.testFactory_hoursBetween_RPartial(TestHours.java:109)

testFactory_minutesBetween_RPartial(org.joda.time.TestMinutes)  Time elapsed: 0.001 sec  <<< ERROR!
java.lang.IndexOutOfBoundsException: Invalid index: -1
	at org.joda.time.LocalTime.getField(LocalTime.java:558)
	at org.joda.time.base.AbstractPartial.getField(AbstractPartial.java:105)
	at org.joda.time.DateTimeUtils.isContiguous(DateTimeUtils.java:65)
	at org.joda.time.base.BaseSingleFieldPeriod.between(BaseSingleFieldPeriod.java:101)
	at org.joda.time.Minutes.minutesBetween(Minutes.java:124)
	at org.joda.time.TestMinutes.testFactory_minutesBetween_RPartial(TestMinutes.java:99)

testFactory_secondsBetween_RPartial(org.joda.time.TestSeconds)  Time elapsed: 0.001 sec  <<< ERROR!
java.lang.IndexOutOfBoundsException: Invalid index: -1
	at org.joda.time.LocalTime.getField(LocalTime.java:558)
	at org.joda.time.base.AbstractPartial.getField(AbstractPartial.java:105)
	at org.joda.time.DateTimeUtils.isContiguous(DateTimeUtils.java:65)
	at org.joda.time.base.BaseSingleFieldPeriod.between(BaseSingleFieldPeriod.java:101)
	at org.joda.time.Seconds.secondsBetween(Seconds.java:124)
	at org.joda.time.TestSeconds.testFactory_secondsBetween_RPartial(TestSeconds.java:99)

testPropertyAddDay(org.joda.time.TestYearMonthDay_Properties)  Time elapsed: 0.001 sec  <<< ERROR!
java.lang.IndexOutOfBoundsException: Invalid index: -1
	at org.joda.time.YearMonthDay.getField(YearMonthDay.java:339)
	at org.joda.time.base.AbstractPartial.getField(AbstractPartial.java:105)
	at org.joda.time.DateTimeUtils.isContiguous(DateTimeUtils.java:65)
	at org.joda.time.chrono.BasicMonthOfYearDateTimeField.add(BasicMonthOfYearDateTimeField.java:216)
	at org.joda.time.field.BaseDateTimeField.add(BaseDateTimeField.java:324)
	at org.joda.time.YearMonthDay$Property.addToCopy(YearMonthDay.java:1011)
	at org.joda.time.TestYearMonthDay_Properties.testPropertyAddDay(TestYearMonthDay_Properties.java:382)

testPropertyAddMonth(org.joda.time.TestYearMonthDay_Properties)  Time elapsed: 0.001 sec  <<< ERROR!
java.lang.IndexOutOfBoundsException: Invalid index: -1
	at org.joda.time.YearMonthDay.getField(YearMonthDay.java:339)
	at org.joda.time.base.AbstractPartial.getField(AbstractPartial.java:105)
	at org.joda.time.DateTimeUtils.isContiguous(DateTimeUtils.java:65)
	at org.joda.time.chrono.BasicMonthOfYearDateTimeField.add(BasicMonthOfYearDateTimeField.java:216)
	at org.joda.time.YearMonthDay$Property.addToCopy(YearMonthDay.java:1011)
	at org.joda.time.TestYearMonthDay_Properties.testPropertyAddMonth(TestYearMonthDay_Properties.java:227)

testPropertyAddMonth(org.joda.time.TestYearMonth_Properties)  Time elapsed: 0 sec  <<< ERROR!
java.lang.IndexOutOfBoundsException: Invalid index: -1
	at org.joda.time.YearMonth.getField(YearMonth.java:406)
	at org.joda.time.base.AbstractPartial.getField(AbstractPartial.java:105)
	at org.joda.time.DateTimeUtils.isContiguous(DateTimeUtils.java:65)
	at org.joda.time.chrono.BasicMonthOfYearDateTimeField.add(BasicMonthOfYearDateTimeField.java:216)
	at org.joda.time.YearMonth$Property.addToCopy(YearMonth.java:914)
	at org.joda.time.TestYearMonth_Properties.testPropertyAddMonth(TestYearMonth_Properties.java:226)

testIsContiguous_RP(org.joda.time.TestDateTimeUtils)  Time elapsed: 0.002 sec  <<< ERROR!
java.lang.IndexOutOfBoundsException: Invalid index: -1
	at org.joda.time.YearMonthDay.getField(YearMonthDay.java:339)
	at org.joda.time.base.AbstractPartial.getField(AbstractPartial.java:105)
	at org.joda.time.DateTimeUtils.isContiguous(DateTimeUtils.java:65)
	at org.joda.time.TestDateTimeUtils.testIsContiguous_RP(TestDateTimeUtils.java:431)

testIsContiguous_RP_GJChronology(org.joda.time.TestDateTimeUtils)  Time elapsed: 0.001 sec  <<< ERROR!
java.lang.IndexOutOfBoundsException: Invalid index: -1
	at org.joda.time.YearMonthDay.getField(YearMonthDay.java:339)
	at org.joda.time.base.AbstractPartial.getField(AbstractPartial.java:105)
	at org.joda.time.DateTimeUtils.isContiguous(DateTimeUtils.java:65)
	at org.joda.time.TestDateTimeUtils.testIsContiguous_RP_GJChronology(TestDateTimeUtils.java:455)

testCutoverAddYears(org.joda.time.chrono.TestGJChronology)  Time elapsed: 0.002 sec  <<< ERROR!
java.lang.IndexOutOfBoundsException: Invalid index: -1
	at org.joda.time.YearMonthDay.getField(YearMonthDay.java:339)
	at org.joda.time.base.AbstractPartial.getField(AbstractPartial.java:105)
	at org.joda.time.DateTimeUtils.isContiguous(DateTimeUtils.java:65)
	at org.joda.time.chrono.GJChronology$CutoverField.add(GJChronology.java:705)
	at org.joda.time.YearMonthDay.withFieldAdded(YearMonthDay.java:444)
	at org.joda.time.chrono.TestGJChronology.testAdd(TestGJChronology.java:496)
	at org.joda.time.chrono.TestGJChronology.testCutoverAddYears(TestGJChronology.java:381)

testCutoverAddMonths(org.joda.time.chrono.TestGJChronology)  Time elapsed: 0.002 sec  <<< ERROR!
java.lang.IndexOutOfBoundsException: Invalid index: -1
	at org.joda.time.YearMonthDay.getField(YearMonthDay.java:339)
	at org.joda.time.base.AbstractPartial.getField(AbstractPartial.java:105)
	at org.joda.time.DateTimeUtils.isContiguous(DateTimeUtils.java:65)
	at org.joda.time.chrono.GJChronology$CutoverField.add(GJChronology.java:705)
	at org.joda.time.YearMonthDay.withFieldAdded(YearMonthDay.java:444)
	at org.joda.time.chrono.TestGJChronology.testAdd(TestGJChronology.java:496)
	at org.joda.time.chrono.TestGJChronology.testCutoverAddMonths(TestGJChronology.java:422)

testCutoverAddDays(org.joda.time.chrono.TestGJChronology)  Time elapsed: 0.001 sec  <<< ERROR!
java.lang.IndexOutOfBoundsException: Invalid index: -1
	at org.joda.time.YearMonthDay.getField(YearMonthDay.java:339)
	at org.joda.time.base.AbstractPartial.getField(AbstractPartial.java:105)
	at org.joda.time.DateTimeUtils.isContiguous(DateTimeUtils.java:65)
	at org.joda.time.chrono.GJChronology$CutoverField.add(GJChronology.java:705)
	at org.joda.time.YearMonthDay.withFieldAdded(YearMonthDay.java:444)
	at org.joda.time.chrono.TestGJChronology.testAdd(TestGJChronology.java:496)
	at org.joda.time.chrono.TestGJChronology.testCutoverAddDays(TestGJChronology.java:452)

testYearEndAddDays(org.joda.time.chrono.TestGJChronology)  Time elapsed: 0.001 sec  <<< ERROR!
java.lang.IndexOutOfBoundsException: Invalid index: -1
	at org.joda.time.YearMonthDay.getField(YearMonthDay.java:339)
	at org.joda.time.base.AbstractPartial.getField(AbstractPartial.java:105)
	at org.joda.time.DateTimeUtils.isContiguous(DateTimeUtils.java:65)
	at org.joda.time.chrono.GJChronology$CutoverField.add(GJChronology.java:705)
	at org.joda.time.YearMonthDay.withFieldAdded(YearMonthDay.java:444)
	at org.joda.time.chrono.TestGJChronology.testAdd(TestGJChronology.java:496)
	at org.joda.time.chrono.TestGJChronology.testYearEndAddDays(TestGJChronology.java:462)

testSubtractDays(org.joda.time.chrono.TestGJChronology)  Time elapsed: 0.002 sec  <<< ERROR!
java.lang.IndexOutOfBoundsException: Invalid index: -1
	at org.joda.time.YearMonthDay.getField(YearMonthDay.java:339)
	at org.joda.time.base.AbstractPartial.getField(AbstractPartial.java:105)
	at org.joda.time.DateTimeUtils.isContiguous(DateTimeUtils.java:65)
	at org.joda.time.chrono.GJChronology$CutoverField.add(GJChronology.java:705)
	at org.joda.time.YearMonthDay.withPeriodAdded(YearMonthDay.java:473)
	at org.joda.time.YearMonthDay.minus(YearMonthDay.java:574)
	at org.joda.time.chrono.TestGJChronology.testSubtractDays(TestGJChronology.java:477)

testAddMonths(org.joda.time.chrono.TestISOChronology)  Time elapsed: 0.001 sec  <<< ERROR!
java.lang.IndexOutOfBoundsException: Invalid index: -1
	at org.joda.time.YearMonthDay.getField(YearMonthDay.java:339)
	at org.joda.time.base.AbstractPartial.getField(AbstractPartial.java:105)
	at org.joda.time.DateTimeUtils.isContiguous(DateTimeUtils.java:65)
	at org.joda.time.chrono.BasicMonthOfYearDateTimeField.add(BasicMonthOfYearDateTimeField.java:216)
	at org.joda.time.YearMonthDay.withFieldAdded(YearMonthDay.java:444)
	at org.joda.time.chrono.TestISOChronology.testAdd(TestISOChronology.java:425)
	at org.joda.time.chrono.TestISOChronology.testAddMonths(TestISOChronology.java:394)


Results :

Tests in error: 
  org.joda.time.TestBaseSingleFieldPeriod#testFactory_between_RPartial IndexOutOfBoundsException
  org.joda.time.TestDateTimeUtils#testIsContiguous_RP IndexOutOfBoundsException ...
  org.joda.time.TestDateTimeUtils#testIsContiguous_RP_GJChronology IndexOutOfBoundsException
  org.joda.time.TestDays#testFactory_daysBetween_RPartial_LocalDate IndexOutOfBoundsException
  org.joda.time.TestDays#testFactory_daysBetween_RPartial_MonthDay IndexOutOfBoundsException
  org.joda.time.TestDays#testFactory_daysBetween_RPartial_YearMonth IndexOutOfBoundsException
  org.joda.time.TestHours#testFactory_hoursBetween_RPartial IndexOutOfBoundsException
  org.joda.time.TestMinutes#testFactory_minutesBetween_RPartial IndexOutOfBoundsException
  org.joda.time.TestMonths#testFactory_monthsBetween_RPartial_LocalDate IndexOutOfBoundsException
  org.joda.time.TestMonths#testFactory_monthsBetween_RPartial_MonthDay IndexOutOfBoundsException
  org.joda.time.TestMonths#testFactory_monthsBetween_RPartial_YearMonth IndexOutOfBoundsException
  org.joda.time.TestPeriod_Constructors#testConstructor_RP_RP1 IndexOutOfBoundsException
  org.joda.time.TestPeriod_Constructors#testConstructor_RP_RP2 IndexOutOfBoundsException
  org.joda.time.TestPeriod_Constructors#testConstructor_RP_RP8 ArrayIndexOutOfBoundsException
  org.joda.time.TestPeriod_Constructors#testConstructor_RP_RP_PeriodType1 IndexOutOfBoundsException
  org.joda.time.TestPeriod_Constructors#testConstructor_RP_RP_PeriodType2 IndexOutOfBoundsException
  org.joda.time.TestPeriod_Constructors#testConstructor_RP_RP_PeriodType8 ArrayIndexOutOfBoundsException
  org.joda.time.TestSeconds#testFactory_secondsBetween_RPartial IndexOutOfBoundsException
  org.joda.time.TestWeeks#testFactory_weeksBetween_RPartial IndexOutOfBoundsException
  org.joda.time.TestYearMonthDay_Properties#testPropertyAddDay IndexOutOfBoundsException
  org.joda.time.TestYearMonthDay_Properties#testPropertyAddMonth IndexOutOfBoundsException
  org.joda.time.TestYearMonth_Properties#testPropertyAddMonth IndexOutOfBoundsException
  org.joda.time.TestYears#testFactory_yearsBetween_RPartial IndexOutOfBoundsException
  org.joda.time.chrono.TestGJChronology#testCutoverAddDays IndexOutOfBoundsException
  org.joda.time.chrono.TestGJChronology#testCutoverAddMonths IndexOutOfBoundsException
  org.joda.time.chrono.TestGJChronology#testCutoverAddYears IndexOutOfBoundsException
  org.joda.time.chrono.TestGJChronology#testSubtractDays IndexOutOfBoundsException
  org.joda.time.chrono.TestGJChronology#testYearEndAddDays IndexOutOfBoundsException
  org.joda.time.chrono.TestISOChronology#testAddMonths IndexOutOfBoundsException

Tests run: 4157, Failures: 0, Errors: 29, Skipped: 0

[INFO] ------------------------------------------------------------------------
[INFO] BUILD FAILURE
[INFO] ------------------------------------------------------------------------
[INFO] Total time: 22.850s
[INFO] Finished at: Wed Aug 05 14:55:59 BST 2015
[INFO] Final Memory: 9M/213M
[INFO] ------------------------------------------------------------------------
[ERROR] Failed to execute goal org.apache.maven.plugins:maven-surefire-plugin:2.18.1:test (default-test) on project joda-time: There are test failures.
[ERROR] 
[ERROR] Please refer to /home/perham/Study/LittleDarwin/Cases/joda-time-2.8.1/target/surefire-reports for the individual test results.
[ERROR] -> [Help 1]
[ERROR] 
[ERROR] To see the full stack trace of the errors, re-run Maven with the -e switch.
[ERROR] Re-run Maven using the -X switch to enable full debug logging.
[ERROR] 
[ERROR] For more information about the errors and possible solutions, please read the following articles:
[ERROR] [Help 1] http://cwiki.apache.org/confluence/display/MAVEN/MojoFailureException
