[INFO] Scanning for projects...
[INFO]                                                                         
[INFO] ------------------------------------------------------------------------
[INFO] Building Joda-Time 2.8.1
[INFO] ------------------------------------------------------------------------
[INFO] 
[INFO] --- maven-resources-plugin:2.7:resources (default-resources) @ joda-time ---
[INFO] Using 'UTF-8' encoding to copy filtered resources.
[INFO] Copying 2 resources to META-INF
[INFO] Copying 10 resources
[INFO] 
[INFO] --- maven-compiler-plugin:3.3:compile (default-compile) @ joda-time ---
[INFO] Changes detected - recompiling the module!
[INFO] Compiling 166 source files to /home/perham/Study/LittleDarwin/Cases/joda-time-2.8.1/target/classes
[INFO] 
[INFO] --- exec-maven-plugin:1.4.0:java (compile-tzdb) @ joda-time ---
Writing zoneinfo files
Writing ZoneInfoMap
[INFO] 
[INFO] --- maven-resources-plugin:2.7:testResources (default-testResources) @ joda-time ---
[INFO] Using 'UTF-8' encoding to copy filtered resources.
[INFO] Copying 34 resources
[INFO] 
[INFO] --- maven-compiler-plugin:3.3:testCompile (default-testCompile) @ joda-time ---
[INFO] Nothing to compile - all classes are up to date
[INFO] 
[INFO] --- maven-surefire-plugin:2.18.1:test (default-test) @ joda-time ---
[INFO] Surefire report directory: /home/perham/Study/LittleDarwin/Cases/joda-time-2.8.1/target/surefire-reports

-------------------------------------------------------
 T E S T S
-------------------------------------------------------
Running org.joda.time.TestAllPackages

TestBuddhistChronology.testCalendar

TestCopticChronology.testCalendar

TestEthiopicChronology.testCalendar

TestIslamicChronology.testCalendar

Testing Gregorian chronology over 1000 iterations
100% complete (i=1000)

Testing Julian chronology over 1000 iterations
100% complete (i=1000)
Writing zoneinfo files
Writing ZoneInfoMap
Tests run: 4157, Failures: 6, Errors: 4, Skipped: 0, Time elapsed: 7.823 sec <<< FAILURE! - in org.joda.time.TestAllPackages
test_useCase_ContainsOverlapAbutGap(org.joda.time.TestInterval_Basics)  Time elapsed: 0.005 sec  <<< FAILURE!
junit.framework.AssertionFailedError
	at junit.framework.Assert.fail(Assert.java:47)
	at junit.framework.Assert.assertTrue(Assert.java:20)
	at junit.framework.Assert.assertNull(Assert.java:230)
	at junit.framework.Assert.assertNull(Assert.java:223)
	at org.joda.time.TestInterval_Basics.test_useCase_ContainsOverlapAbutGap(TestInterval_Basics.java:255)

test_useCase_ContainsOverlapAbutGap_bothZeroDuration(org.joda.time.TestInterval_Basics)  Time elapsed: 0.001 sec  <<< FAILURE!
junit.framework.AssertionFailedError
	at junit.framework.Assert.fail(Assert.java:47)
	at junit.framework.Assert.assertTrue(Assert.java:20)
	at junit.framework.Assert.assertNull(Assert.java:230)
	at junit.framework.Assert.assertNull(Assert.java:223)
	at org.joda.time.TestInterval_Basics.test_useCase_ContainsOverlapAbutGap_bothZeroDuration(TestInterval_Basics.java:422)

testOverlap_RInterval(org.joda.time.TestInterval_Basics)  Time elapsed: 0.002 sec  <<< FAILURE!
junit.framework.AssertionFailedError: expected:<1970-01-01T01:00:00.003+01:00/1970-01-01T01:00:00.004+01:00> but was:<null>
	at junit.framework.Assert.fail(Assert.java:47)
	at junit.framework.Assert.failNotEquals(Assert.java:280)
	at junit.framework.Assert.assertEquals(Assert.java:64)
	at junit.framework.Assert.assertEquals(Assert.java:71)
	at org.joda.time.TestInterval_Basics.testOverlap_RInterval(TestInterval_Basics.java:640)

testOverlap_RInterval_null(org.joda.time.TestInterval_Basics)  Time elapsed: 0.001 sec  <<< ERROR!
java.lang.NullPointerException
	at org.joda.time.Interval.overlap(Interval.java:255)
	at org.joda.time.TestInterval_Basics.testOverlap_RInterval_null(TestInterval_Basics.java:666)

testOverlap_RInterval_zone(org.joda.time.TestInterval_Basics)  Time elapsed: 0.001 sec  <<< ERROR!
java.lang.NullPointerException
	at org.joda.time.TestInterval_Basics.testOverlap_RInterval_zone(TestInterval_Basics.java:686)

testOverlap_RInterval_zoneUTC(org.joda.time.TestInterval_Basics)  Time elapsed: 0 sec  <<< ERROR!
java.lang.NullPointerException
	at org.joda.time.TestInterval_Basics.testOverlap_RInterval_zoneUTC(TestInterval_Basics.java:700)

testGap_RInterval(org.joda.time.TestInterval_Basics)  Time elapsed: 0.001 sec  <<< FAILURE!
junit.framework.AssertionFailedError: expected:<1970-01-01T01:00:00.001+01:00/1970-01-01T01:00:00.003+01:00> but was:<1970-01-01T01:00:00.007+01:00/2002-06-09T02:00:00.000+02:00>
	at junit.framework.Assert.fail(Assert.java:47)
	at junit.framework.Assert.failNotEquals(Assert.java:280)
	at junit.framework.Assert.assertEquals(Assert.java:64)
	at junit.framework.Assert.assertEquals(Assert.java:71)
	at org.joda.time.TestInterval_Basics.testGap_RInterval(TestInterval_Basics.java:705)

testGap_RInterval_null(org.joda.time.TestInterval_Basics)  Time elapsed: 0.001 sec  <<< ERROR!
java.lang.NullPointerException
	at org.joda.time.Interval.gap(Interval.java:287)
	at org.joda.time.TestInterval_Basics.testGap_RInterval_null(TestInterval_Basics.java:729)

test_useCase_ContainsOverlapAbutGap_zeroDuration(org.joda.time.TestInterval_Basics)  Time elapsed: 0.002 sec  <<< FAILURE!
junit.framework.AssertionFailedError
	at junit.framework.Assert.fail(Assert.java:47)
	at junit.framework.Assert.assertTrue(Assert.java:20)
	at junit.framework.Assert.assertNull(Assert.java:230)
	at junit.framework.Assert.assertNull(Assert.java:223)
	at org.joda.time.TestInterval_Basics.test_useCase_ContainsOverlapAbutGap_zeroDuration(TestInterval_Basics.java:359)

testGetReadableInterval_ReadableInterval(org.joda.time.TestDateTimeUtils)  Time elapsed: 0 sec  <<< FAILURE!
junit.framework.AssertionFailedError: expected:<1970-01-01T01:00:00.000+01:00/1970-01-01T01:00:00.100+01:00> but was:<2015-08-05T15:00:01.216+01:00/2015-08-05T15:00:01.216+01:00>
	at junit.framework.Assert.fail(Assert.java:47)
	at junit.framework.Assert.failNotEquals(Assert.java:280)
	at junit.framework.Assert.assertEquals(Assert.java:64)
	at junit.framework.Assert.assertEquals(Assert.java:71)
	at org.joda.time.TestDateTimeUtils.testGetReadableInterval_ReadableInterval(TestDateTimeUtils.java:392)


Results :

Failed tests: 
  org.joda.time.TestDateTimeUtils#testGetReadableInterval_ReadableInterval AssertionFailedError
  org.joda.time.TestInterval_Basics#testGap_RInterval AssertionFailedError expec...
  org.joda.time.TestInterval_Basics#testOverlap_RInterval AssertionFailedError e...
  org.joda.time.TestInterval_Basics#test_useCase_ContainsOverlapAbutGap AssertionFailedError
  org.joda.time.TestInterval_Basics#test_useCase_ContainsOverlapAbutGap_bothZeroDuration AssertionFailedError
  org.joda.time.TestInterval_Basics#test_useCase_ContainsOverlapAbutGap_zeroDuration AssertionFailedError
Tests in error: 
  org.joda.time.TestInterval_Basics#testGap_RInterval_null NullPointerException
  org.joda.time.TestInterval_Basics#testOverlap_RInterval_null NullPointerException
  org.joda.time.TestInterval_Basics#testOverlap_RInterval_zone NullPointerException
  org.joda.time.TestInterval_Basics#testOverlap_RInterval_zoneUTC NullPointerException

Tests run: 4157, Failures: 6, Errors: 4, Skipped: 0

[INFO] ------------------------------------------------------------------------
[INFO] BUILD FAILURE
[INFO] ------------------------------------------------------------------------
[INFO] Total time: 23.035s
[INFO] Finished at: Wed Aug 05 15:00:07 BST 2015
[INFO] Final Memory: 9M/213M
[INFO] ------------------------------------------------------------------------
[ERROR] Failed to execute goal org.apache.maven.plugins:maven-surefire-plugin:2.18.1:test (default-test) on project joda-time: There are test failures.
[ERROR] 
[ERROR] Please refer to /home/perham/Study/LittleDarwin/Cases/joda-time-2.8.1/target/surefire-reports for the individual test results.
[ERROR] -> [Help 1]
[ERROR] 
[ERROR] To see the full stack trace of the errors, re-run Maven with the -e switch.
[ERROR] Re-run Maven using the -X switch to enable full debug logging.
[ERROR] 
[ERROR] For more information about the errors and possible solutions, please read the following articles:
[ERROR] [Help 1] http://cwiki.apache.org/confluence/display/MAVEN/MojoFailureException
