[INFO] Scanning for projects...
[INFO]                                                                         
[INFO] ------------------------------------------------------------------------
[INFO] Building Joda-Time 2.8.1
[INFO] ------------------------------------------------------------------------
[INFO] 
[INFO] --- maven-resources-plugin:2.7:resources (default-resources) @ joda-time ---
[INFO] Using 'UTF-8' encoding to copy filtered resources.
[INFO] Copying 2 resources to META-INF
[INFO] Copying 10 resources
[INFO] 
[INFO] --- maven-compiler-plugin:3.3:compile (default-compile) @ joda-time ---
[INFO] Changes detected - recompiling the module!
[INFO] Compiling 166 source files to /home/perham/Study/LittleDarwin/Cases/joda-time-2.8.1/target/classes
[INFO] 
[INFO] --- exec-maven-plugin:1.4.0:java (compile-tzdb) @ joda-time ---
Writing zoneinfo files
Writing ZoneInfoMap
[INFO] 
[INFO] --- maven-resources-plugin:2.7:testResources (default-testResources) @ joda-time ---
[INFO] Using 'UTF-8' encoding to copy filtered resources.
[INFO] Copying 34 resources
[INFO] 
[INFO] --- maven-compiler-plugin:3.3:testCompile (default-testCompile) @ joda-time ---
[INFO] Nothing to compile - all classes are up to date
[INFO] 
[INFO] --- maven-surefire-plugin:2.18.1:test (default-test) @ joda-time ---
[INFO] Surefire report directory: /home/perham/Study/LittleDarwin/Cases/joda-time-2.8.1/target/surefire-reports

-------------------------------------------------------
 T E S T S
-------------------------------------------------------
Running org.joda.time.TestAllPackages

TestBuddhistChronology.testCalendar

TestCopticChronology.testCalendar

TestEthiopicChronology.testCalendar

TestIslamicChronology.testCalendar

Testing Gregorian chronology over 1000 iterations
100% complete (i=1000)

Testing Julian chronology over 1000 iterations
100% complete (i=1000)
Writing zoneinfo files
Writing ZoneInfoMap
Tests run: 4157, Failures: 31, Errors: 21, Skipped: 0, Time elapsed: 7.516 sec <<< FAILURE! - in org.joda.time.TestAllPackages
testConstructor_RI_RD1(org.joda.time.TestInterval_Constructors)  Time elapsed: 0.01 sec  <<< FAILURE!
junit.framework.AssertionFailedError: expected:<1039399200000> but was:<1023580800000>
	at junit.framework.Assert.fail(Assert.java:47)
	at junit.framework.Assert.failNotEquals(Assert.java:280)
	at junit.framework.Assert.assertEquals(Assert.java:64)
	at junit.framework.Assert.assertEquals(Assert.java:133)
	at junit.framework.Assert.assertEquals(Assert.java:139)
	at org.joda.time.TestInterval_Constructors.testConstructor_RI_RD1(TestInterval_Constructors.java:446)

testConstructor_RI_RD2(org.joda.time.TestInterval_Constructors)  Time elapsed: 0 sec  <<< ERROR!
java.lang.NullPointerException
	at org.joda.time.DateTimeUtils.getDurationMillis(DateTimeUtils.java:60)
	at org.joda.time.base.BaseInterval.<init>(BaseInterval.java:110)
	at org.joda.time.Interval.<init>(Interval.java:134)
	at org.joda.time.TestInterval_Constructors.testConstructor_RI_RD2(TestInterval_Constructors.java:450)

testConstructor_RI_RD3(org.joda.time.TestInterval_Constructors)  Time elapsed: 0 sec  <<< ERROR!
java.lang.NullPointerException
	at org.joda.time.DateTimeUtils.getDurationMillis(DateTimeUtils.java:60)
	at org.joda.time.base.BaseInterval.<init>(BaseInterval.java:110)
	at org.joda.time.Interval.<init>(Interval.java:134)
	at org.joda.time.TestInterval_Constructors.testConstructor_RI_RD3(TestInterval_Constructors.java:457)

testConstructor_RI_RD4(org.joda.time.TestInterval_Constructors)  Time elapsed: 0 sec  <<< FAILURE!
junit.framework.AssertionFailedError: expected:<1039399200000> but was:<1023580800000>
	at junit.framework.Assert.fail(Assert.java:47)
	at junit.framework.Assert.failNotEquals(Assert.java:280)
	at junit.framework.Assert.assertEquals(Assert.java:64)
	at junit.framework.Assert.assertEquals(Assert.java:133)
	at junit.framework.Assert.assertEquals(Assert.java:139)
	at org.joda.time.TestInterval_Constructors.testConstructor_RI_RD4(TestInterval_Constructors.java:471)

testConstructor_RI_RD5(org.joda.time.TestInterval_Constructors)  Time elapsed: 0 sec  <<< FAILURE!
junit.framework.AssertionFailedError
	at junit.framework.Assert.fail(Assert.java:47)
	at junit.framework.Assert.fail(Assert.java:53)
	at org.joda.time.TestInterval_Constructors.testConstructor_RI_RD5(TestInterval_Constructors.java:479)

testConstructor_RD_RI1(org.joda.time.TestInterval_Constructors)  Time elapsed: 0 sec  <<< FAILURE!
junit.framework.AssertionFailedError: expected:<1007856000000> but was:<1023580800000>
	at junit.framework.Assert.fail(Assert.java:47)
	at junit.framework.Assert.failNotEquals(Assert.java:280)
	at junit.framework.Assert.assertEquals(Assert.java:64)
	at junit.framework.Assert.assertEquals(Assert.java:133)
	at junit.framework.Assert.assertEquals(Assert.java:139)
	at org.joda.time.TestInterval_Constructors.testConstructor_RD_RI1(TestInterval_Constructors.java:493)

testConstructor_RD_RI2(org.joda.time.TestInterval_Constructors)  Time elapsed: 0.001 sec  <<< ERROR!
java.lang.NullPointerException
	at org.joda.time.DateTimeUtils.getDurationMillis(DateTimeUtils.java:60)
	at org.joda.time.base.BaseInterval.<init>(BaseInterval.java:127)
	at org.joda.time.Interval.<init>(Interval.java:146)
	at org.joda.time.TestInterval_Constructors.testConstructor_RD_RI2(TestInterval_Constructors.java:498)

testConstructor_RD_RI3(org.joda.time.TestInterval_Constructors)  Time elapsed: 0.002 sec  <<< ERROR!
java.lang.NullPointerException
	at org.joda.time.DateTimeUtils.getDurationMillis(DateTimeUtils.java:60)
	at org.joda.time.base.BaseInterval.<init>(BaseInterval.java:127)
	at org.joda.time.Interval.<init>(Interval.java:146)
	at org.joda.time.TestInterval_Constructors.testConstructor_RD_RI3(TestInterval_Constructors.java:505)

testConstructor_RD_RI4(org.joda.time.TestInterval_Constructors)  Time elapsed: 0.001 sec  <<< FAILURE!
junit.framework.AssertionFailedError: expected:<1007856000000> but was:<1023580800000>
	at junit.framework.Assert.fail(Assert.java:47)
	at junit.framework.Assert.failNotEquals(Assert.java:280)
	at junit.framework.Assert.assertEquals(Assert.java:64)
	at junit.framework.Assert.assertEquals(Assert.java:133)
	at junit.framework.Assert.assertEquals(Assert.java:139)
	at org.joda.time.TestInterval_Constructors.testConstructor_RD_RI4(TestInterval_Constructors.java:518)

testConstructor_RD_RI5(org.joda.time.TestInterval_Constructors)  Time elapsed: 0.001 sec  <<< FAILURE!
junit.framework.AssertionFailedError
	at junit.framework.Assert.fail(Assert.java:47)
	at junit.framework.Assert.fail(Assert.java:53)
	at org.joda.time.TestInterval_Constructors.testConstructor_RD_RI5(TestInterval_Constructors.java:527)

testWithPeriodAfterStart2(org.joda.time.TestInterval_Basics)  Time elapsed: 0.001 sec  <<< ERROR!
java.lang.NullPointerException
	at org.joda.time.DateTimeUtils.getDurationMillis(DateTimeUtils.java:60)
	at org.joda.time.Interval.withDurationAfterStart(Interval.java:422)
	at org.joda.time.Interval.withPeriodAfterStart(Interval.java:460)
	at org.joda.time.TestInterval_Basics.testWithPeriodAfterStart2(TestInterval_Basics.java:1235)

testWithPeriodBeforeEnd2(org.joda.time.TestInterval_Basics)  Time elapsed: 0 sec  <<< ERROR!
java.lang.NullPointerException
	at org.joda.time.DateTimeUtils.getDurationMillis(DateTimeUtils.java:60)
	at org.joda.time.Interval.withDurationBeforeEnd(Interval.java:440)
	at org.joda.time.Interval.withPeriodBeforeEnd(Interval.java:477)
	at org.joda.time.TestInterval_Basics.testWithPeriodBeforeEnd2(TestInterval_Basics.java:1261)

testWithDurationAfterStart1(org.joda.time.TestInterval_Basics)  Time elapsed: 0.001 sec  <<< FAILURE!
junit.framework.AssertionFailedError: expected:<1718-10-02T02:00:00.000+02:00/1719-08-28T16:28:00.000+02:00> but was:<1718-10-02T02:00:00.000+02:00/1718-10-02T02:00:00.000+02:00>
	at junit.framework.Assert.fail(Assert.java:47)
	at junit.framework.Assert.failNotEquals(Assert.java:280)
	at junit.framework.Assert.assertEquals(Assert.java:64)
	at junit.framework.Assert.assertEquals(Assert.java:71)
	at org.joda.time.TestInterval_Basics.testWithDurationAfterStart1(TestInterval_Basics.java:1165)

testWithDurationAfterStart2(org.joda.time.TestInterval_Basics)  Time elapsed: 0 sec  <<< ERROR!
java.lang.NullPointerException
	at org.joda.time.DateTimeUtils.getDurationMillis(DateTimeUtils.java:60)
	at org.joda.time.Interval.withDurationAfterStart(Interval.java:422)
	at org.joda.time.TestInterval_Basics.testWithDurationAfterStart2(TestInterval_Basics.java:1170)

testWithDurationAfterStart3(org.joda.time.TestInterval_Basics)  Time elapsed: 0.003 sec  <<< FAILURE!
junit.framework.AssertionFailedError
	at junit.framework.Assert.fail(Assert.java:47)
	at junit.framework.Assert.fail(Assert.java:53)
	at org.joda.time.TestInterval_Basics.testWithDurationAfterStart3(TestInterval_Basics.java:1180)

testWithDurationAfterStart4(org.joda.time.TestInterval_Basics)  Time elapsed: 0 sec  <<< FAILURE!
junit.framework.AssertionFailedError: expected same:<1718-10-02T02:00:00.000+02:00/1719-08-28T16:28:00.000+02:00> was not:<1718-10-02T02:00:00.000+02:00/1718-10-02T02:00:00.000+02:00>
	at junit.framework.Assert.fail(Assert.java:47)
	at junit.framework.Assert.failNotSame(Assert.java:276)
	at junit.framework.Assert.assertSame(Assert.java:239)
	at junit.framework.Assert.assertSame(Assert.java:246)
	at org.joda.time.TestInterval_Basics.testWithDurationAfterStart4(TestInterval_Basics.java:1188)

testWithDurationBeforeEnd1(org.joda.time.TestInterval_Basics)  Time elapsed: 0.001 sec  <<< FAILURE!
junit.framework.AssertionFailedError: expected:<1718-07-27T14:24:00.000+02:00/1718-10-02T02:00:00.000+02:00> but was:<1718-10-02T02:00:00.000+02:00/1718-10-02T02:00:00.000+02:00>
	at junit.framework.Assert.fail(Assert.java:47)
	at junit.framework.Assert.failNotEquals(Assert.java:280)
	at junit.framework.Assert.assertEquals(Assert.java:64)
	at junit.framework.Assert.assertEquals(Assert.java:71)
	at org.joda.time.TestInterval_Basics.testWithDurationBeforeEnd1(TestInterval_Basics.java:1197)

testWithDurationBeforeEnd2(org.joda.time.TestInterval_Basics)  Time elapsed: 0.001 sec  <<< ERROR!
java.lang.NullPointerException
	at org.joda.time.DateTimeUtils.getDurationMillis(DateTimeUtils.java:60)
	at org.joda.time.Interval.withDurationBeforeEnd(Interval.java:440)
	at org.joda.time.TestInterval_Basics.testWithDurationBeforeEnd2(TestInterval_Basics.java:1202)

testWithDurationBeforeEnd3(org.joda.time.TestInterval_Basics)  Time elapsed: 0.002 sec  <<< FAILURE!
junit.framework.AssertionFailedError
	at junit.framework.Assert.fail(Assert.java:47)
	at junit.framework.Assert.fail(Assert.java:53)
	at org.joda.time.TestInterval_Basics.testWithDurationBeforeEnd3(TestInterval_Basics.java:1212)

testWithDurationBeforeEnd4(org.joda.time.TestInterval_Basics)  Time elapsed: 0 sec  <<< FAILURE!
junit.framework.AssertionFailedError: expected same:<1718-10-02T02:00:00.000+02:00/1719-08-28T16:28:00.000+02:00> was not:<1719-08-28T16:28:00.000+02:00/1719-08-28T16:28:00.000+02:00>
	at junit.framework.Assert.fail(Assert.java:47)
	at junit.framework.Assert.failNotSame(Assert.java:276)
	at junit.framework.Assert.assertSame(Assert.java:239)
	at junit.framework.Assert.assertSame(Assert.java:246)
	at org.joda.time.TestInterval_Basics.testWithDurationBeforeEnd4(TestInterval_Basics.java:1220)

testConstructor_RI_RD1(org.joda.time.TestMutableInterval_Constructors)  Time elapsed: 0.001 sec  <<< FAILURE!
junit.framework.AssertionFailedError: expected:<1039399200000> but was:<1023580800000>
	at junit.framework.Assert.fail(Assert.java:47)
	at junit.framework.Assert.failNotEquals(Assert.java:280)
	at junit.framework.Assert.assertEquals(Assert.java:64)
	at junit.framework.Assert.assertEquals(Assert.java:133)
	at junit.framework.Assert.assertEquals(Assert.java:139)
	at org.joda.time.TestMutableInterval_Constructors.testConstructor_RI_RD1(TestMutableInterval_Constructors.java:422)

testConstructor_RI_RD2(org.joda.time.TestMutableInterval_Constructors)  Time elapsed: 0.001 sec  <<< ERROR!
java.lang.NullPointerException
	at org.joda.time.DateTimeUtils.getDurationMillis(DateTimeUtils.java:60)
	at org.joda.time.base.BaseInterval.<init>(BaseInterval.java:110)
	at org.joda.time.MutableInterval.<init>(MutableInterval.java:127)
	at org.joda.time.TestMutableInterval_Constructors.testConstructor_RI_RD2(TestMutableInterval_Constructors.java:426)

testConstructor_RI_RD3(org.joda.time.TestMutableInterval_Constructors)  Time elapsed: 0.001 sec  <<< ERROR!
java.lang.NullPointerException
	at org.joda.time.DateTimeUtils.getDurationMillis(DateTimeUtils.java:60)
	at org.joda.time.base.BaseInterval.<init>(BaseInterval.java:110)
	at org.joda.time.MutableInterval.<init>(MutableInterval.java:127)
	at org.joda.time.TestMutableInterval_Constructors.testConstructor_RI_RD3(TestMutableInterval_Constructors.java:433)

testConstructor_RI_RD4(org.joda.time.TestMutableInterval_Constructors)  Time elapsed: 0.001 sec  <<< FAILURE!
junit.framework.AssertionFailedError: expected:<1039399200000> but was:<1023580800000>
	at junit.framework.Assert.fail(Assert.java:47)
	at junit.framework.Assert.failNotEquals(Assert.java:280)
	at junit.framework.Assert.assertEquals(Assert.java:64)
	at junit.framework.Assert.assertEquals(Assert.java:133)
	at junit.framework.Assert.assertEquals(Assert.java:139)
	at org.joda.time.TestMutableInterval_Constructors.testConstructor_RI_RD4(TestMutableInterval_Constructors.java:447)

testConstructor_RI_RD5(org.joda.time.TestMutableInterval_Constructors)  Time elapsed: 0.001 sec  <<< FAILURE!
junit.framework.AssertionFailedError
	at junit.framework.Assert.fail(Assert.java:47)
	at junit.framework.Assert.fail(Assert.java:53)
	at org.joda.time.TestMutableInterval_Constructors.testConstructor_RI_RD5(TestMutableInterval_Constructors.java:455)

testConstructor_RD_RI1(org.joda.time.TestMutableInterval_Constructors)  Time elapsed: 0.006 sec  <<< FAILURE!
junit.framework.AssertionFailedError: expected:<1007856000000> but was:<1023580800000>
	at junit.framework.Assert.fail(Assert.java:47)
	at junit.framework.Assert.failNotEquals(Assert.java:280)
	at junit.framework.Assert.assertEquals(Assert.java:64)
	at junit.framework.Assert.assertEquals(Assert.java:133)
	at junit.framework.Assert.assertEquals(Assert.java:139)
	at org.joda.time.TestMutableInterval_Constructors.testConstructor_RD_RI1(TestMutableInterval_Constructors.java:469)

testConstructor_RD_RI2(org.joda.time.TestMutableInterval_Constructors)  Time elapsed: 0 sec  <<< ERROR!
java.lang.NullPointerException
	at org.joda.time.DateTimeUtils.getDurationMillis(DateTimeUtils.java:60)
	at org.joda.time.base.BaseInterval.<init>(BaseInterval.java:127)
	at org.joda.time.MutableInterval.<init>(MutableInterval.java:139)
	at org.joda.time.TestMutableInterval_Constructors.testConstructor_RD_RI2(TestMutableInterval_Constructors.java:474)

testConstructor_RD_RI3(org.joda.time.TestMutableInterval_Constructors)  Time elapsed: 0.001 sec  <<< ERROR!
java.lang.NullPointerException
	at org.joda.time.DateTimeUtils.getDurationMillis(DateTimeUtils.java:60)
	at org.joda.time.base.BaseInterval.<init>(BaseInterval.java:127)
	at org.joda.time.MutableInterval.<init>(MutableInterval.java:139)
	at org.joda.time.TestMutableInterval_Constructors.testConstructor_RD_RI3(TestMutableInterval_Constructors.java:481)

testConstructor_RD_RI4(org.joda.time.TestMutableInterval_Constructors)  Time elapsed: 0.001 sec  <<< FAILURE!
junit.framework.AssertionFailedError: expected:<1007856000000> but was:<1023580800000>
	at junit.framework.Assert.fail(Assert.java:47)
	at junit.framework.Assert.failNotEquals(Assert.java:280)
	at junit.framework.Assert.assertEquals(Assert.java:64)
	at junit.framework.Assert.assertEquals(Assert.java:133)
	at junit.framework.Assert.assertEquals(Assert.java:139)
	at org.joda.time.TestMutableInterval_Constructors.testConstructor_RD_RI4(TestMutableInterval_Constructors.java:494)

testConstructor_RD_RI5(org.joda.time.TestMutableInterval_Constructors)  Time elapsed: 0 sec  <<< FAILURE!
junit.framework.AssertionFailedError
	at junit.framework.Assert.fail(Assert.java:47)
	at junit.framework.Assert.fail(Assert.java:53)
	at org.joda.time.TestMutableInterval_Constructors.testConstructor_RD_RI5(TestMutableInterval_Constructors.java:503)

testSetDurationAfterStart_RI1(org.joda.time.TestMutableInterval_Updates)  Time elapsed: 0.001 sec  <<< FAILURE!
junit.framework.AssertionFailedError: expected:<1018009440123> but was:<1018009440000>
	at junit.framework.Assert.fail(Assert.java:47)
	at junit.framework.Assert.failNotEquals(Assert.java:280)
	at junit.framework.Assert.assertEquals(Assert.java:64)
	at junit.framework.Assert.assertEquals(Assert.java:133)
	at junit.framework.Assert.assertEquals(Assert.java:139)
	at org.joda.time.TestMutableInterval_Updates.testSetDurationAfterStart_RI1(TestMutableInterval_Updates.java:295)

testSeDurationAfterStart_RI2(org.joda.time.TestMutableInterval_Updates)  Time elapsed: 0 sec  <<< FAILURE!
junit.framework.AssertionFailedError
	at junit.framework.Assert.fail(Assert.java:47)
	at junit.framework.Assert.fail(Assert.java:53)
	at org.joda.time.TestMutableInterval_Updates.testSeDurationAfterStart_RI2(TestMutableInterval_Updates.java:302)

testSetDurationAfterStart_RI3(org.joda.time.TestMutableInterval_Updates)  Time elapsed: 0.001 sec  <<< ERROR!
java.lang.NullPointerException
	at org.joda.time.DateTimeUtils.getDurationMillis(DateTimeUtils.java:60)
	at org.joda.time.MutableInterval.setDurationAfterStart(MutableInterval.java:342)
	at org.joda.time.TestMutableInterval_Updates.testSetDurationAfterStart_RI3(TestMutableInterval_Updates.java:308)

testSetDurationBeforeEnd_RI1(org.joda.time.TestMutableInterval_Updates)  Time elapsed: 0.001 sec  <<< FAILURE!
junit.framework.AssertionFailedError: expected:<1052231279877> but was:<1052231280000>
	at junit.framework.Assert.fail(Assert.java:47)
	at junit.framework.Assert.failNotEquals(Assert.java:280)
	at junit.framework.Assert.assertEquals(Assert.java:64)
	at junit.framework.Assert.assertEquals(Assert.java:133)
	at junit.framework.Assert.assertEquals(Assert.java:139)
	at org.joda.time.TestMutableInterval_Updates.testSetDurationBeforeEnd_RI1(TestMutableInterval_Updates.java:333)

testSeDurationBeforeEnd_RI2(org.joda.time.TestMutableInterval_Updates)  Time elapsed: 0 sec  <<< FAILURE!
junit.framework.AssertionFailedError
	at junit.framework.Assert.fail(Assert.java:47)
	at junit.framework.Assert.fail(Assert.java:53)
	at org.joda.time.TestMutableInterval_Updates.testSeDurationBeforeEnd_RI2(TestMutableInterval_Updates.java:341)

testSetDurationBeforeEnd_RI3(org.joda.time.TestMutableInterval_Updates)  Time elapsed: 0.001 sec  <<< ERROR!
java.lang.NullPointerException
	at org.joda.time.DateTimeUtils.getDurationMillis(DateTimeUtils.java:60)
	at org.joda.time.MutableInterval.setDurationBeforeEnd(MutableInterval.java:354)
	at org.joda.time.TestMutableInterval_Updates.testSetDurationBeforeEnd_RI3(TestMutableInterval_Updates.java:347)

testConstructor_RI_RD1(org.joda.time.TestPeriod_Constructors)  Time elapsed: 0 sec  <<< FAILURE!
junit.framework.AssertionFailedError: expected:<1> but was:<0>
	at junit.framework.Assert.fail(Assert.java:47)
	at junit.framework.Assert.failNotEquals(Assert.java:280)
	at junit.framework.Assert.assertEquals(Assert.java:64)
	at junit.framework.Assert.assertEquals(Assert.java:198)
	at junit.framework.Assert.assertEquals(Assert.java:204)
	at org.joda.time.TestPeriod_Constructors.testConstructor_RI_RD1(TestPeriod_Constructors.java:1019)

testConstructor_RI_RD2(org.joda.time.TestPeriod_Constructors)  Time elapsed: 0 sec  <<< ERROR!
java.lang.NullPointerException
	at org.joda.time.DateTimeUtils.getDurationMillis(DateTimeUtils.java:60)
	at org.joda.time.base.BasePeriod.<init>(BasePeriod.java:197)
	at org.joda.time.Period.<init>(Period.java:626)
	at org.joda.time.TestPeriod_Constructors.testConstructor_RI_RD2(TestPeriod_Constructors.java:1032)

testConstructor_RD_RI1(org.joda.time.TestPeriod_Constructors)  Time elapsed: 0.002 sec  <<< FAILURE!
junit.framework.AssertionFailedError: expected:<1> but was:<0>
	at junit.framework.Assert.fail(Assert.java:47)
	at junit.framework.Assert.failNotEquals(Assert.java:280)
	at junit.framework.Assert.assertEquals(Assert.java:64)
	at junit.framework.Assert.assertEquals(Assert.java:198)
	at junit.framework.Assert.assertEquals(Assert.java:204)
	at org.joda.time.TestPeriod_Constructors.testConstructor_RD_RI1(TestPeriod_Constructors.java:1083)

testConstructor_RD_RI2(org.joda.time.TestPeriod_Constructors)  Time elapsed: 0.003 sec  <<< ERROR!
java.lang.NullPointerException
	at org.joda.time.DateTimeUtils.getDurationMillis(DateTimeUtils.java:60)
	at org.joda.time.base.BasePeriod.<init>(BasePeriod.java:214)
	at org.joda.time.Period.<init>(Period.java:647)
	at org.joda.time.TestPeriod_Constructors.testConstructor_RD_RI2(TestPeriod_Constructors.java:1096)

testConstructor_RI_RD_PeriodType1(org.joda.time.TestPeriod_Constructors)  Time elapsed: 0.001 sec  <<< FAILURE!
junit.framework.AssertionFailedError: expected:<1> but was:<0>
	at junit.framework.Assert.fail(Assert.java:47)
	at junit.framework.Assert.failNotEquals(Assert.java:280)
	at junit.framework.Assert.assertEquals(Assert.java:64)
	at junit.framework.Assert.assertEquals(Assert.java:198)
	at junit.framework.Assert.assertEquals(Assert.java:204)
	at org.joda.time.TestPeriod_Constructors.testConstructor_RI_RD_PeriodType1(TestPeriod_Constructors.java:1051)

testConstructor_RI_RD_PeriodType2(org.joda.time.TestPeriod_Constructors)  Time elapsed: 0.001 sec  <<< ERROR!
java.lang.NullPointerException
	at org.joda.time.DateTimeUtils.getDurationMillis(DateTimeUtils.java:60)
	at org.joda.time.base.BasePeriod.<init>(BasePeriod.java:197)
	at org.joda.time.Period.<init>(Period.java:637)
	at org.joda.time.TestPeriod_Constructors.testConstructor_RI_RD_PeriodType2(TestPeriod_Constructors.java:1064)

testConstructor_RD_RI_PeriodType1(org.joda.time.TestPeriod_Constructors)  Time elapsed: 0.001 sec  <<< FAILURE!
junit.framework.AssertionFailedError: expected:<1> but was:<0>
	at junit.framework.Assert.fail(Assert.java:47)
	at junit.framework.Assert.failNotEquals(Assert.java:280)
	at junit.framework.Assert.assertEquals(Assert.java:64)
	at junit.framework.Assert.assertEquals(Assert.java:198)
	at junit.framework.Assert.assertEquals(Assert.java:204)
	at org.joda.time.TestPeriod_Constructors.testConstructor_RD_RI_PeriodType1(TestPeriod_Constructors.java:1115)

testConstructor_RD_RI_PeriodType2(org.joda.time.TestPeriod_Constructors)  Time elapsed: 0 sec  <<< ERROR!
java.lang.NullPointerException
	at org.joda.time.DateTimeUtils.getDurationMillis(DateTimeUtils.java:60)
	at org.joda.time.base.BasePeriod.<init>(BasePeriod.java:214)
	at org.joda.time.Period.<init>(Period.java:658)
	at org.joda.time.TestPeriod_Constructors.testConstructor_RD_RI_PeriodType2(TestPeriod_Constructors.java:1128)

testConstructor_RI_RD1(org.joda.time.TestMutablePeriod_Constructors)  Time elapsed: 0.001 sec  <<< FAILURE!
junit.framework.AssertionFailedError: expected:<1> but was:<0>
	at junit.framework.Assert.fail(Assert.java:47)
	at junit.framework.Assert.failNotEquals(Assert.java:280)
	at junit.framework.Assert.assertEquals(Assert.java:64)
	at junit.framework.Assert.assertEquals(Assert.java:198)
	at junit.framework.Assert.assertEquals(Assert.java:204)
	at org.joda.time.TestMutablePeriod_Constructors.testConstructor_RI_RD1(TestMutablePeriod_Constructors.java:765)

testConstructor_RI_RD2(org.joda.time.TestMutablePeriod_Constructors)  Time elapsed: 0 sec  <<< ERROR!
java.lang.NullPointerException
	at org.joda.time.DateTimeUtils.getDurationMillis(DateTimeUtils.java:60)
	at org.joda.time.base.BasePeriod.<init>(BasePeriod.java:197)
	at org.joda.time.MutablePeriod.<init>(MutablePeriod.java:326)
	at org.joda.time.TestMutablePeriod_Constructors.testConstructor_RI_RD2(TestMutablePeriod_Constructors.java:778)

testConstructor_RI_RD_PeriodType1(org.joda.time.TestMutablePeriod_Constructors)  Time elapsed: 0.001 sec  <<< FAILURE!
junit.framework.AssertionFailedError: expected:<1> but was:<0>
	at junit.framework.Assert.fail(Assert.java:47)
	at junit.framework.Assert.failNotEquals(Assert.java:280)
	at junit.framework.Assert.assertEquals(Assert.java:64)
	at junit.framework.Assert.assertEquals(Assert.java:198)
	at junit.framework.Assert.assertEquals(Assert.java:204)
	at org.joda.time.TestMutablePeriod_Constructors.testConstructor_RI_RD_PeriodType1(TestMutablePeriod_Constructors.java:797)

testConstructor_RI_RD_PeriodType2(org.joda.time.TestMutablePeriod_Constructors)  Time elapsed: 0 sec  <<< ERROR!
java.lang.NullPointerException
	at org.joda.time.DateTimeUtils.getDurationMillis(DateTimeUtils.java:60)
	at org.joda.time.base.BasePeriod.<init>(BasePeriod.java:197)
	at org.joda.time.MutablePeriod.<init>(MutablePeriod.java:337)
	at org.joda.time.TestMutablePeriod_Constructors.testConstructor_RI_RD_PeriodType2(TestMutablePeriod_Constructors.java:810)

testSetPeriod_RD1(org.joda.time.TestMutablePeriod_Updates)  Time elapsed: 0.001 sec  <<< FAILURE!
junit.framework.AssertionFailedError: expected:<100> but was:<0>
	at junit.framework.Assert.fail(Assert.java:47)
	at junit.framework.Assert.failNotEquals(Assert.java:280)
	at junit.framework.Assert.assertEquals(Assert.java:64)
	at junit.framework.Assert.assertEquals(Assert.java:198)
	at junit.framework.Assert.assertEquals(Assert.java:204)
	at org.joda.time.TestMutablePeriod_Updates.testSetPeriod_RD1(TestMutablePeriod_Updates.java:1025)

testSetPeriod_RD2(org.joda.time.TestMutablePeriod_Updates)  Time elapsed: 0 sec  <<< FAILURE!
junit.framework.AssertionFailedError: expected:<10805> but was:<0>
	at junit.framework.Assert.fail(Assert.java:47)
	at junit.framework.Assert.failNotEquals(Assert.java:280)
	at junit.framework.Assert.assertEquals(Assert.java:64)
	at junit.framework.Assert.assertEquals(Assert.java:198)
	at junit.framework.Assert.assertEquals(Assert.java:204)
	at org.joda.time.TestMutablePeriod_Updates.testSetPeriod_RD2(TestMutablePeriod_Updates.java:1041)

testSetPeriod_RD3(org.joda.time.TestMutablePeriod_Updates)  Time elapsed: 0.001 sec  <<< ERROR!
java.lang.NullPointerException
	at org.joda.time.DateTimeUtils.getDurationMillis(DateTimeUtils.java:60)
	at org.joda.time.MutablePeriod.setPeriod(MutablePeriod.java:579)
	at org.joda.time.MutablePeriod.setPeriod(MutablePeriod.java:563)
	at org.joda.time.TestMutablePeriod_Updates.testSetPeriod_RD3(TestMutablePeriod_Updates.java:1049)

testGetDurationMillis_RI(org.joda.time.TestDateTimeUtils)  Time elapsed: 0 sec  <<< FAILURE!
junit.framework.AssertionFailedError: expected:<123> but was:<0>
	at junit.framework.Assert.fail(Assert.java:47)
	at junit.framework.Assert.failNotEquals(Assert.java:280)
	at junit.framework.Assert.assertEquals(Assert.java:64)
	at junit.framework.Assert.assertEquals(Assert.java:133)
	at junit.framework.Assert.assertEquals(Assert.java:139)
	at org.joda.time.TestDateTimeUtils.testGetDurationMillis_RI(TestDateTimeUtils.java:423)


Results :

Failed tests: 
  org.joda.time.TestDateTimeUtils#testGetDurationMillis_RI AssertionFailedError ...
  org.joda.time.TestInterval_Basics#testWithDurationAfterStart1 AssertionFailedError
  org.joda.time.TestInterval_Basics#testWithDurationAfterStart3 AssertionFailedError
  org.joda.time.TestInterval_Basics#testWithDurationAfterStart4 AssertionFailedError
  org.joda.time.TestInterval_Basics#testWithDurationBeforeEnd1 AssertionFailedError
  org.joda.time.TestInterval_Basics#testWithDurationBeforeEnd3 AssertionFailedError
  org.joda.time.TestInterval_Basics#testWithDurationBeforeEnd4 AssertionFailedError
  org.joda.time.TestInterval_Constructors#testConstructor_RD_RI1 AssertionFailedError
  org.joda.time.TestInterval_Constructors#testConstructor_RD_RI4 AssertionFailedError
  org.joda.time.TestInterval_Constructors#testConstructor_RD_RI5 AssertionFailedError
  org.joda.time.TestInterval_Constructors#testConstructor_RI_RD1 AssertionFailedError
  org.joda.time.TestInterval_Constructors#testConstructor_RI_RD4 AssertionFailedError
  org.joda.time.TestInterval_Constructors#testConstructor_RI_RD5 AssertionFailedError
  org.joda.time.TestMutableInterval_Constructors#testConstructor_RD_RI1 AssertionFailedError
  org.joda.time.TestMutableInterval_Constructors#testConstructor_RD_RI4 AssertionFailedError
  org.joda.time.TestMutableInterval_Constructors#testConstructor_RD_RI5 AssertionFailedError
  org.joda.time.TestMutableInterval_Constructors#testConstructor_RI_RD1 AssertionFailedError
  org.joda.time.TestMutableInterval_Constructors#testConstructor_RI_RD4 AssertionFailedError
  org.joda.time.TestMutableInterval_Constructors#testConstructor_RI_RD5 AssertionFailedError
  org.joda.time.TestMutableInterval_Updates#testSeDurationAfterStart_RI2 AssertionFailedError
  org.joda.time.TestMutableInterval_Updates#testSeDurationBeforeEnd_RI2 AssertionFailedError
  org.joda.time.TestMutableInterval_Updates#testSetDurationAfterStart_RI1 AssertionFailedError
  org.joda.time.TestMutableInterval_Updates#testSetDurationBeforeEnd_RI1 AssertionFailedError
  org.joda.time.TestMutablePeriod_Constructors#testConstructor_RI_RD1 AssertionFailedError
  org.joda.time.TestMutablePeriod_Constructors#testConstructor_RI_RD_PeriodType1 AssertionFailedError
  org.joda.time.TestMutablePeriod_Updates#testSetPeriod_RD1 AssertionFailedError
  org.joda.time.TestMutablePeriod_Updates#testSetPeriod_RD2 AssertionFailedError
  org.joda.time.TestPeriod_Constructors#testConstructor_RD_RI1 AssertionFailedError
  org.joda.time.TestPeriod_Constructors#testConstructor_RD_RI_PeriodType1 AssertionFailedError
  org.joda.time.TestPeriod_Constructors#testConstructor_RI_RD1 AssertionFailedError
  org.joda.time.TestPeriod_Constructors#testConstructor_RI_RD_PeriodType1 AssertionFailedError
Tests in error: 
  org.joda.time.TestInterval_Basics#testWithDurationAfterStart2 NullPointerException
  org.joda.time.TestInterval_Basics#testWithDurationBeforeEnd2 NullPointerException
  org.joda.time.TestInterval_Basics#testWithPeriodAfterStart2 NullPointerException
  org.joda.time.TestInterval_Basics#testWithPeriodBeforeEnd2 NullPointerException
  org.joda.time.TestInterval_Constructors#testConstructor_RD_RI2 NullPointerException
  org.joda.time.TestInterval_Constructors#testConstructor_RD_RI3 NullPointerException
  org.joda.time.TestInterval_Constructors#testConstructor_RI_RD2 NullPointerException
  org.joda.time.TestInterval_Constructors#testConstructor_RI_RD3 NullPointerException
  org.joda.time.TestMutableInterval_Constructors#testConstructor_RD_RI2 NullPointerException
  org.joda.time.TestMutableInterval_Constructors#testConstructor_RD_RI3 NullPointerException
  org.joda.time.TestMutableInterval_Constructors#testConstructor_RI_RD2 NullPointerException
  org.joda.time.TestMutableInterval_Constructors#testConstructor_RI_RD3 NullPointerException
  org.joda.time.TestMutableInterval_Updates#testSetDurationAfterStart_RI3 NullPointerException
  org.joda.time.TestMutableInterval_Updates#testSetDurationBeforeEnd_RI3 NullPointerException
  org.joda.time.TestMutablePeriod_Constructors#testConstructor_RI_RD2 NullPointerException
  org.joda.time.TestMutablePeriod_Constructors#testConstructor_RI_RD_PeriodType2 NullPointerException
  org.joda.time.TestMutablePeriod_Updates#testSetPeriod_RD3 NullPointerException
  org.joda.time.TestPeriod_Constructors#testConstructor_RD_RI2 NullPointerException
  org.joda.time.TestPeriod_Constructors#testConstructor_RD_RI_PeriodType2 NullPointerException
  org.joda.time.TestPeriod_Constructors#testConstructor_RI_RD2 NullPointerException
  org.joda.time.TestPeriod_Constructors#testConstructor_RI_RD_PeriodType2 NullPointerException

Tests run: 4157, Failures: 31, Errors: 21, Skipped: 0

[INFO] ------------------------------------------------------------------------
[INFO] BUILD FAILURE
[INFO] ------------------------------------------------------------------------
[INFO] Total time: 22.093s
[INFO] Finished at: Wed Aug 05 14:58:54 BST 2015
[INFO] Final Memory: 9M/209M
[INFO] ------------------------------------------------------------------------
[ERROR] Failed to execute goal org.apache.maven.plugins:maven-surefire-plugin:2.18.1:test (default-test) on project joda-time: There are test failures.
[ERROR] 
[ERROR] Please refer to /home/perham/Study/LittleDarwin/Cases/joda-time-2.8.1/target/surefire-reports for the individual test results.
[ERROR] -> [Help 1]
[ERROR] 
[ERROR] To see the full stack trace of the errors, re-run Maven with the -e switch.
[ERROR] Re-run Maven using the -X switch to enable full debug logging.
[ERROR] 
[ERROR] For more information about the errors and possible solutions, please read the following articles:
[ERROR] [Help 1] http://cwiki.apache.org/confluence/display/MAVEN/MojoFailureException
