[INFO] Scanning for projects...
[INFO]                                                                         
[INFO] ------------------------------------------------------------------------
[INFO] Building Joda-Time 2.8.1
[INFO] ------------------------------------------------------------------------
[INFO] 
[INFO] --- maven-resources-plugin:2.7:resources (default-resources) @ joda-time ---
[INFO] Using 'UTF-8' encoding to copy filtered resources.
[INFO] Copying 2 resources to META-INF
[INFO] Copying 10 resources
[INFO] 
[INFO] --- maven-compiler-plugin:3.3:compile (default-compile) @ joda-time ---
[INFO] Changes detected - recompiling the module!
[INFO] Compiling 166 source files to /home/perham/Study/LittleDarwin/Cases/joda-time-2.8.1/target/classes
[INFO] 
[INFO] --- exec-maven-plugin:1.4.0:java (compile-tzdb) @ joda-time ---
Writing zoneinfo files
Writing ZoneInfoMap
[INFO] 
[INFO] --- maven-resources-plugin:2.7:testResources (default-testResources) @ joda-time ---
[INFO] Using 'UTF-8' encoding to copy filtered resources.
[INFO] Copying 34 resources
[INFO] 
[INFO] --- maven-compiler-plugin:3.3:testCompile (default-testCompile) @ joda-time ---
[INFO] Nothing to compile - all classes are up to date
[INFO] 
[INFO] --- maven-surefire-plugin:2.18.1:test (default-test) @ joda-time ---
[INFO] Surefire report directory: /home/perham/Study/LittleDarwin/Cases/joda-time-2.8.1/target/surefire-reports

-------------------------------------------------------
 T E S T S
-------------------------------------------------------
Running org.joda.time.TestAllPackages

TestBuddhistChronology.testCalendar

TestCopticChronology.testCalendar

TestEthiopicChronology.testCalendar

TestIslamicChronology.testCalendar

Testing Gregorian chronology over 1000 iterations
100% complete (i=1000)

Testing Julian chronology over 1000 iterations
100% complete (i=1000)
Writing zoneinfo files
Writing ZoneInfoMap
Tests run: 4157, Failures: 17, Errors: 0, Skipped: 0, Time elapsed: 6.87 sec <<< FAILURE! - in org.joda.time.TestAllPackages
testBasicComps1(org.joda.time.TestDateTimeComparator)  Time elapsed: 0.01 sec  <<< FAILURE!
junit.framework.AssertionFailedError: MILLIS expected:<0> but was:<1>
	at junit.framework.Assert.fail(Assert.java:47)
	at junit.framework.Assert.failNotEquals(Assert.java:280)
	at junit.framework.Assert.assertEquals(Assert.java:64)
	at junit.framework.Assert.assertEquals(Assert.java:198)
	at org.joda.time.TestDateTimeComparator.testBasicComps1(TestDateTimeComparator.java:312)

testBasicComps2(org.joda.time.TestDateTimeComparator)  Time elapsed: 0 sec  <<< FAILURE!
junit.framework.AssertionFailedError: MILLIS expected:<0> but was:<1>
	at junit.framework.Assert.fail(Assert.java:47)
	at junit.framework.Assert.failNotEquals(Assert.java:280)
	at junit.framework.Assert.assertEquals(Assert.java:64)
	at junit.framework.Assert.assertEquals(Assert.java:198)
	at org.joda.time.TestDateTimeComparator.testBasicComps2(TestDateTimeComparator.java:336)

testBasicComps3(org.joda.time.TestDateTimeComparator)  Time elapsed: 0 sec  <<< FAILURE!
junit.framework.AssertionFailedError: MILLIS expected:<0> but was:<1>
	at junit.framework.Assert.fail(Assert.java:47)
	at junit.framework.Assert.failNotEquals(Assert.java:280)
	at junit.framework.Assert.assertEquals(Assert.java:64)
	at junit.framework.Assert.assertEquals(Assert.java:198)
	at org.joda.time.TestDateTimeComparator.testBasicComps3(TestDateTimeComparator.java:359)

testBasicComps4(org.joda.time.TestDateTimeComparator)  Time elapsed: 0 sec  <<< FAILURE!
junit.framework.AssertionFailedError: MILLIS expected:<0> but was:<1>
	at junit.framework.Assert.fail(Assert.java:47)
	at junit.framework.Assert.failNotEquals(Assert.java:280)
	at junit.framework.Assert.assertEquals(Assert.java:64)
	at junit.framework.Assert.assertEquals(Assert.java:198)
	at org.joda.time.TestDateTimeComparator.testBasicComps4(TestDateTimeComparator.java:382)

testBasicComps5(org.joda.time.TestDateTimeComparator)  Time elapsed: 0 sec  <<< FAILURE!
junit.framework.AssertionFailedError: MILLIS expected:<0> but was:<1>
	at junit.framework.Assert.fail(Assert.java:47)
	at junit.framework.Assert.failNotEquals(Assert.java:280)
	at junit.framework.Assert.assertEquals(Assert.java:64)
	at junit.framework.Assert.assertEquals(Assert.java:198)
	at org.joda.time.TestDateTimeComparator.testBasicComps5(TestDateTimeComparator.java:404)

testMillis(org.joda.time.TestDateTimeComparator)  Time elapsed: 0 sec  <<< FAILURE!
junit.framework.AssertionFailedError: MillisP1 expected:<1> but was:<0>
	at junit.framework.Assert.fail(Assert.java:47)
	at junit.framework.Assert.failNotEquals(Assert.java:280)
	at junit.framework.Assert.assertEquals(Assert.java:64)
	at junit.framework.Assert.assertEquals(Assert.java:198)
	at org.joda.time.TestDateTimeComparator.testMillis(TestDateTimeComparator.java:427)

testSecond(org.joda.time.TestDateTimeComparator)  Time elapsed: 0 sec  <<< FAILURE!
junit.framework.AssertionFailedError: SecondP1a expected:<1> but was:<0>
	at junit.framework.Assert.fail(Assert.java:47)
	at junit.framework.Assert.failNotEquals(Assert.java:280)
	at junit.framework.Assert.assertEquals(Assert.java:64)
	at junit.framework.Assert.assertEquals(Assert.java:198)
	at org.joda.time.TestDateTimeComparator.testSecond(TestDateTimeComparator.java:437)

testMinute(org.joda.time.TestDateTimeComparator)  Time elapsed: 0 sec  <<< FAILURE!
junit.framework.AssertionFailedError: MinuteP1a expected:<1> but was:<0>
	at junit.framework.Assert.fail(Assert.java:47)
	at junit.framework.Assert.failNotEquals(Assert.java:280)
	at junit.framework.Assert.assertEquals(Assert.java:64)
	at junit.framework.Assert.assertEquals(Assert.java:198)
	at org.joda.time.TestDateTimeComparator.testMinute(TestDateTimeComparator.java:451)

testHour(org.joda.time.TestDateTimeComparator)  Time elapsed: 0 sec  <<< FAILURE!
junit.framework.AssertionFailedError: HourP1a expected:<1> but was:<0>
	at junit.framework.Assert.fail(Assert.java:47)
	at junit.framework.Assert.failNotEquals(Assert.java:280)
	at junit.framework.Assert.assertEquals(Assert.java:64)
	at junit.framework.Assert.assertEquals(Assert.java:198)
	at org.joda.time.TestDateTimeComparator.testHour(TestDateTimeComparator.java:465)

testDOW(org.joda.time.TestDateTimeComparator)  Time elapsed: 0.003 sec  <<< FAILURE!
junit.framework.AssertionFailedError: DOWP1a expected:<1> but was:<0>
	at junit.framework.Assert.fail(Assert.java:47)
	at junit.framework.Assert.failNotEquals(Assert.java:280)
	at junit.framework.Assert.assertEquals(Assert.java:64)
	at junit.framework.Assert.assertEquals(Assert.java:198)
	at org.joda.time.TestDateTimeComparator.testDOW(TestDateTimeComparator.java:487)

testDOM(org.joda.time.TestDateTimeComparator)  Time elapsed: 0 sec  <<< FAILURE!
junit.framework.AssertionFailedError: DOMP1a expected:<1> but was:<0>
	at junit.framework.Assert.fail(Assert.java:47)
	at junit.framework.Assert.failNotEquals(Assert.java:280)
	at junit.framework.Assert.assertEquals(Assert.java:64)
	at junit.framework.Assert.assertEquals(Assert.java:198)
	at org.joda.time.TestDateTimeComparator.testDOM(TestDateTimeComparator.java:497)

testDOY(org.joda.time.TestDateTimeComparator)  Time elapsed: 0 sec  <<< FAILURE!
junit.framework.AssertionFailedError: DOYP1a expected:<1> but was:<0>
	at junit.framework.Assert.fail(Assert.java:47)
	at junit.framework.Assert.failNotEquals(Assert.java:280)
	at junit.framework.Assert.assertEquals(Assert.java:64)
	at junit.framework.Assert.assertEquals(Assert.java:198)
	at org.joda.time.TestDateTimeComparator.testDOY(TestDateTimeComparator.java:511)

testWOW(org.joda.time.TestDateTimeComparator)  Time elapsed: 0 sec  <<< FAILURE!
junit.framework.AssertionFailedError: WOWP1a expected:<1> but was:<0>
	at junit.framework.Assert.fail(Assert.java:47)
	at junit.framework.Assert.failNotEquals(Assert.java:280)
	at junit.framework.Assert.assertEquals(Assert.java:64)
	at junit.framework.Assert.assertEquals(Assert.java:198)
	at org.joda.time.TestDateTimeComparator.testWOW(TestDateTimeComparator.java:527)

testWOYY(org.joda.time.TestDateTimeComparator)  Time elapsed: 0.001 sec  <<< FAILURE!
junit.framework.AssertionFailedError: YOYYZ expected:<0> but was:<1>
	at junit.framework.Assert.fail(Assert.java:47)
	at junit.framework.Assert.failNotEquals(Assert.java:280)
	at junit.framework.Assert.assertEquals(Assert.java:64)
	at junit.framework.Assert.assertEquals(Assert.java:198)
	at org.joda.time.TestDateTimeComparator.testWOYY(TestDateTimeComparator.java:545)

testMonth(org.joda.time.TestDateTimeComparator)  Time elapsed: 0.001 sec  <<< FAILURE!
junit.framework.AssertionFailedError: MONTHP1a expected:<1> but was:<0>
	at junit.framework.Assert.fail(Assert.java:47)
	at junit.framework.Assert.failNotEquals(Assert.java:280)
	at junit.framework.Assert.assertEquals(Assert.java:64)
	at junit.framework.Assert.assertEquals(Assert.java:198)
	at org.joda.time.TestDateTimeComparator.testMonth(TestDateTimeComparator.java:558)

testYear(org.joda.time.TestDateTimeComparator)  Time elapsed: 0.001 sec  <<< FAILURE!
junit.framework.AssertionFailedError: YEARP1a expected:<1> but was:<0>
	at junit.framework.Assert.fail(Assert.java:47)
	at junit.framework.Assert.failNotEquals(Assert.java:280)
	at junit.framework.Assert.assertEquals(Assert.java:64)
	at junit.framework.Assert.assertEquals(Assert.java:198)
	at org.joda.time.TestDateTimeComparator.testYear(TestDateTimeComparator.java:572)

testNullDT(org.joda.time.TestDateTimeComparator)  Time elapsed: 0.001 sec  <<< FAILURE!
junit.framework.AssertionFailedError
	at junit.framework.Assert.fail(Assert.java:47)
	at junit.framework.Assert.assertTrue(Assert.java:20)
	at junit.framework.Assert.assertTrue(Assert.java:27)
	at org.joda.time.TestDateTimeComparator.testNullDT(TestDateTimeComparator.java:883)


Results :

Failed tests: 
  org.joda.time.TestDateTimeComparator#testBasicComps1 AssertionFailedError MILL...
  org.joda.time.TestDateTimeComparator#testBasicComps2 AssertionFailedError MILL...
  org.joda.time.TestDateTimeComparator#testBasicComps3 AssertionFailedError MILL...
  org.joda.time.TestDateTimeComparator#testBasicComps4 AssertionFailedError MILL...
  org.joda.time.TestDateTimeComparator#testBasicComps5 AssertionFailedError MILL...
  org.joda.time.TestDateTimeComparator#testDOM AssertionFailedError DOMP1a expec...
  org.joda.time.TestDateTimeComparator#testDOW AssertionFailedError DOWP1a expec...
  org.joda.time.TestDateTimeComparator#testDOY AssertionFailedError DOYP1a expec...
  org.joda.time.TestDateTimeComparator#testHour AssertionFailedError HourP1a exp...
  org.joda.time.TestDateTimeComparator#testMillis AssertionFailedError MillisP1 ...
  org.joda.time.TestDateTimeComparator#testMinute AssertionFailedError MinuteP1a...
  org.joda.time.TestDateTimeComparator#testMonth AssertionFailedError MONTHP1a e...
  org.joda.time.TestDateTimeComparator#testNullDT AssertionFailedError
  org.joda.time.TestDateTimeComparator#testSecond AssertionFailedError SecondP1a...
  org.joda.time.TestDateTimeComparator#testWOW AssertionFailedError WOWP1a expec...
  org.joda.time.TestDateTimeComparator#testWOYY AssertionFailedError YOYYZ expec...
  org.joda.time.TestDateTimeComparator#testYear AssertionFailedError YEARP1a exp...

Tests run: 4157, Failures: 17, Errors: 0, Skipped: 0

[INFO] ------------------------------------------------------------------------
[INFO] BUILD FAILURE
[INFO] ------------------------------------------------------------------------
[INFO] Total time: 19.784s
[INFO] Finished at: Wed Aug 05 14:41:32 BST 2015
[INFO] Final Memory: 9M/214M
[INFO] ------------------------------------------------------------------------
[ERROR] Failed to execute goal org.apache.maven.plugins:maven-surefire-plugin:2.18.1:test (default-test) on project joda-time: There are test failures.
[ERROR] 
[ERROR] Please refer to /home/perham/Study/LittleDarwin/Cases/joda-time-2.8.1/target/surefire-reports for the individual test results.
[ERROR] -> [Help 1]
[ERROR] 
[ERROR] To see the full stack trace of the errors, re-run Maven with the -e switch.
[ERROR] Re-run Maven using the -X switch to enable full debug logging.
[ERROR] 
[ERROR] For more information about the errors and possible solutions, please read the following articles:
[ERROR] [Help 1] http://cwiki.apache.org/confluence/display/MAVEN/MojoFailureException
