[INFO] Scanning for projects...
[INFO]                                                                         
[INFO] ------------------------------------------------------------------------
[INFO] Building Joda-Time 2.8.1
[INFO] ------------------------------------------------------------------------
[INFO] 
[INFO] --- maven-resources-plugin:2.7:resources (default-resources) @ joda-time ---
[INFO] Using 'UTF-8' encoding to copy filtered resources.
[INFO] Copying 2 resources to META-INF
[INFO] Copying 10 resources
[INFO] 
[INFO] --- maven-compiler-plugin:3.3:compile (default-compile) @ joda-time ---
[INFO] Changes detected - recompiling the module!
[INFO] Compiling 166 source files to /home/perham/Study/LittleDarwin/Cases/joda-time-2.8.1/target/classes
[INFO] 
[INFO] --- exec-maven-plugin:1.4.0:java (compile-tzdb) @ joda-time ---
Writing zoneinfo files
Writing ZoneInfoMap
[INFO] 
[INFO] --- maven-resources-plugin:2.7:testResources (default-testResources) @ joda-time ---
[INFO] Using 'UTF-8' encoding to copy filtered resources.
[INFO] Copying 34 resources
[INFO] 
[INFO] --- maven-compiler-plugin:3.3:testCompile (default-testCompile) @ joda-time ---
[INFO] Nothing to compile - all classes are up to date
[INFO] 
[INFO] --- maven-surefire-plugin:2.18.1:test (default-test) @ joda-time ---
[INFO] Surefire report directory: /home/perham/Study/LittleDarwin/Cases/joda-time-2.8.1/target/surefire-reports

-------------------------------------------------------
 T E S T S
-------------------------------------------------------
Running org.joda.time.TestAllPackages

TestBuddhistChronology.testCalendar

TestCopticChronology.testCalendar

TestEthiopicChronology.testCalendar

TestIslamicChronology.testCalendar

Testing Gregorian chronology over 1000 iterations
100% complete (i=1000)

Testing Julian chronology over 1000 iterations
100% complete (i=1000)
Writing zoneinfo files
Writing ZoneInfoMap
Tests run: 4157, Failures: 1, Errors: 3, Skipped: 0, Time elapsed: 5.223 sec <<< FAILURE! - in org.joda.time.TestAllPackages
testWithFieldAdded1(org.joda.time.TestDateMidnight_Basics)  Time elapsed: 0.004 sec  <<< ERROR!
java.lang.IllegalArgumentException: Field must not be null
	at org.joda.time.DateMidnight.withFieldAdded(DateMidnight.java:54)
	at org.joda.time.TestDateMidnight_Basics.testWithFieldAdded1(TestDateMidnight_Basics.java:759)

testWithFieldAdded2(org.joda.time.TestDateMidnight_Basics)  Time elapsed: 0 sec  <<< FAILURE!
junit.framework.AssertionFailedError
	at junit.framework.Assert.fail(Assert.java:47)
	at junit.framework.Assert.fail(Assert.java:53)
	at org.joda.time.TestDateMidnight_Basics.testWithFieldAdded2(TestDateMidnight_Basics.java:769)

testWithFieldAdded3(org.joda.time.TestDateMidnight_Basics)  Time elapsed: 0.001 sec  <<< ERROR!
java.lang.NullPointerException
	at org.joda.time.DateMidnight.withFieldAdded(DateMidnight.java:56)
	at org.joda.time.TestDateMidnight_Basics.testWithFieldAdded3(TestDateMidnight_Basics.java:776)

testWithFieldAdded4(org.joda.time.TestDateMidnight_Basics)  Time elapsed: 0.001 sec  <<< ERROR!
java.lang.IllegalArgumentException: Field must not be null
	at org.joda.time.DateMidnight.withFieldAdded(DateMidnight.java:54)
	at org.joda.time.TestDateMidnight_Basics.testWithFieldAdded4(TestDateMidnight_Basics.java:783)


Results :

Failed tests: 
  org.joda.time.TestDateMidnight_Basics#testWithFieldAdded2 AssertionFailedError
Tests in error: 
  org.joda.time.TestDateMidnight_Basics#testWithFieldAdded1 IllegalArgumentException
  org.joda.time.TestDateMidnight_Basics#testWithFieldAdded3 NullPointerException
  org.joda.time.TestDateMidnight_Basics#testWithFieldAdded4 IllegalArgumentException

Tests run: 4157, Failures: 1, Errors: 3, Skipped: 0

[INFO] ------------------------------------------------------------------------
[INFO] BUILD FAILURE
[INFO] ------------------------------------------------------------------------
[INFO] Total time: 15.285s
[INFO] Finished at: Wed Aug 05 14:19:09 BST 2015
[INFO] Final Memory: 9M/213M
[INFO] ------------------------------------------------------------------------
[ERROR] Failed to execute goal org.apache.maven.plugins:maven-surefire-plugin:2.18.1:test (default-test) on project joda-time: There are test failures.
[ERROR] 
[ERROR] Please refer to /home/perham/Study/LittleDarwin/Cases/joda-time-2.8.1/target/surefire-reports for the individual test results.
[ERROR] -> [Help 1]
[ERROR] 
[ERROR] To see the full stack trace of the errors, re-run Maven with the -e switch.
[ERROR] Re-run Maven using the -X switch to enable full debug logging.
[ERROR] 
[ERROR] For more information about the errors and possible solutions, please read the following articles:
[ERROR] [Help 1] http://cwiki.apache.org/confluence/display/MAVEN/MojoFailureException
