[INFO] Scanning for projects...
[INFO]                                                                         
[INFO] ------------------------------------------------------------------------
[INFO] Building JGraphT - Core 0.9.1
[INFO] ------------------------------------------------------------------------
[INFO] 
[INFO] --- maven-enforcer-plugin:1.0:enforce (enforce-maven) @ jgrapht-core ---
[INFO] 
[INFO] --- maven-resources-plugin:2.6:resources (default-resources) @ jgrapht-core ---
[INFO] Using 'UTF-8' encoding to copy filtered resources.
[INFO] skip non existing resourceDirectory /Users/aliparsai/Study/LittleDarwin/Cases/jgrapht-0.9.1/source/jgrapht-core/src/main/resources
[INFO] 
[INFO] --- maven-compiler-plugin:3.1:compile (default-compile) @ jgrapht-core ---
[INFO] Changes detected - recompiling the module!
[INFO] Compiling 194 source files to /Users/aliparsai/Study/LittleDarwin/Cases/jgrapht-0.9.1/source/jgrapht-core/target/classes
[WARNING] /Users/aliparsai/Study/LittleDarwin/Cases/jgrapht-0.9.1/source/jgrapht-core/src/main/java/org/jgrapht/graph/DefaultListenableGraph.java: /Users/aliparsai/Study/LittleDarwin/Cases/jgrapht-0.9.1/source/jgrapht-core/src/main/java/org/jgrapht/graph/DefaultListenableGraph.java uses or overrides a deprecated API.
[WARNING] /Users/aliparsai/Study/LittleDarwin/Cases/jgrapht-0.9.1/source/jgrapht-core/src/main/java/org/jgrapht/graph/DefaultListenableGraph.java: Recompile with -Xlint:deprecation for details.
[WARNING] /Users/aliparsai/Study/LittleDarwin/Cases/jgrapht-0.9.1/source/jgrapht-core/src/main/java/org/jgrapht/experimental/isomorphism/GraphOrdering.java: Some input files use unchecked or unsafe operations.
[WARNING] /Users/aliparsai/Study/LittleDarwin/Cases/jgrapht-0.9.1/source/jgrapht-core/src/main/java/org/jgrapht/experimental/isomorphism/GraphOrdering.java: Recompile with -Xlint:unchecked for details.
[INFO] 
[INFO] --- maven-bundle-plugin:2.3.7:manifest (bundle-manifest) @ jgrapht-core ---
[INFO] 
[INFO] --- maven-resources-plugin:2.6:testResources (default-testResources) @ jgrapht-core ---
[INFO] Using 'UTF-8' encoding to copy filtered resources.
[INFO] Copying 1 resource
[INFO] 
[INFO] --- maven-compiler-plugin:3.1:testCompile (default-testCompile) @ jgrapht-core ---
[INFO] Nothing to compile - all classes are up to date
[INFO] 
[INFO] --- maven-surefire-plugin:2.12:test (default-test) @ jgrapht-core ---
[INFO] Surefire report directory: /Users/aliparsai/Study/LittleDarwin/Cases/jgrapht-0.9.1/source/jgrapht-core/target/surefire-reports

-------------------------------------------------------
 T E S T S
-------------------------------------------------------
Running org.jgrapht.alg.BellmanFordShortestPathTest
Tests run: 3, Failures: 3, Errors: 0, Skipped: 0, Time elapsed: 0.085 sec <<< FAILURE!
Running org.jgrapht.alg.BiconnectivityInspectorTest
Tests run: 3, Failures: 1, Errors: 0, Skipped: 0, Time elapsed: 0.035 sec <<< FAILURE!
Running org.jgrapht.alg.BlockCutpointGraphTest
Tests run: 3, Failures: 1, Errors: 0, Skipped: 0, Time elapsed: 0.01 sec <<< FAILURE!
Running org.jgrapht.alg.BronKerboschCliqueFinderTest
Tests run: 2, Failures: 0, Errors: 0, Skipped: 0, Time elapsed: 0.004 sec
Running org.jgrapht.alg.ChromaticNumberTest
Tests run: 1, Failures: 0, Errors: 0, Skipped: 0, Time elapsed: 0.013 sec
Running org.jgrapht.alg.CliqueMinimalSeparatorDecompositionTest
Tests run: 7, Failures: 7, Errors: 0, Skipped: 0, Time elapsed: 0.044 sec <<< FAILURE!
Running org.jgrapht.alg.ConnectivityInspectorTest
Tests run: 6, Failures: 0, Errors: 0, Skipped: 0, Time elapsed: 0.026 sec
Running org.jgrapht.alg.cycle.DirectedSimpleCyclesTest
Tests run: 1, Failures: 0, Errors: 0, Skipped: 0, Time elapsed: 1.199 sec
Running org.jgrapht.alg.cycle.UndirectedCycleBaseTest
Tests run: 1, Failures: 0, Errors: 0, Skipped: 0, Time elapsed: 0.003 sec
Running org.jgrapht.alg.CycleDetectorTest
Tests run: 4, Failures: 0, Errors: 0, Skipped: 0, Time elapsed: 0.013 sec
Running org.jgrapht.alg.DijkstraShortestPathTest
Tests run: 2, Failures: 2, Errors: 0, Skipped: 0, Time elapsed: 0.009 sec <<< FAILURE!
Running org.jgrapht.alg.EdmondsBlossomShrinkingTest
Tests run: 1, Failures: 0, Errors: 0, Skipped: 0, Time elapsed: 0.003 sec
Running org.jgrapht.alg.EdmondsKarpMaximumFlowTest
Tests run: 2, Failures: 0, Errors: 0, Skipped: 0, Time elapsed: 0.009 sec
Running org.jgrapht.alg.EulerianCircuitTest
Tests run: 1, Failures: 0, Errors: 0, Skipped: 0, Time elapsed: 0.002 sec
Running org.jgrapht.alg.FloydWarshallShortestPathsTest
Tests run: 5, Failures: 0, Errors: 0, Skipped: 0, Time elapsed: 0.057 sec
Running org.jgrapht.alg.HamiltonianCycleTest
Tests run: 1, Failures: 0, Errors: 0, Skipped: 0, Time elapsed: 0.001 sec
Running org.jgrapht.alg.HopcroftKarpBipartiteMatchingTest
Tests run: 3, Failures: 0, Errors: 0, Skipped: 0, Time elapsed: 0.003 sec
Running org.jgrapht.alg.KShortestPathCostTest
Tests run: 4, Failures: 0, Errors: 0, Skipped: 0, Time elapsed: 0.984 sec
Running org.jgrapht.alg.KShortestPathKValuesTest
Tests run: 2, Failures: 0, Errors: 0, Skipped: 0, Time elapsed: 0.597 sec
Running org.jgrapht.alg.KSPDiscardsValidPathsTest
Tests run: 2, Failures: 1, Errors: 0, Skipped: 0, Time elapsed: 0.003 sec <<< FAILURE!
Running org.jgrapht.alg.KSPExampleTest
Tests run: 3, Failures: 0, Errors: 0, Skipped: 0, Time elapsed: 0.002 sec
Running org.jgrapht.alg.KuhnMunkresMinimalWeightBipartitePerfectMatchingTest
Tests run: 10, Failures: 0, Errors: 0, Skipped: 0, Time elapsed: 0.024 sec
Running org.jgrapht.alg.MinimumSpanningTreeTest
Tests run: 2, Failures: 1, Errors: 1, Skipped: 0, Time elapsed: 0.007 sec <<< FAILURE!
Running org.jgrapht.alg.MinSourceSinkCutTest
Tests run: 4, Failures: 3, Errors: 0, Skipped: 0, Time elapsed: 0.007 sec <<< FAILURE!
Running org.jgrapht.alg.NaiveLcaFinderTest
Tests run: 4, Failures: 0, Errors: 0, Skipped: 0, Time elapsed: 0.01 sec
Running org.jgrapht.alg.NeighborIndexTest
Tests run: 2, Failures: 0, Errors: 0, Skipped: 0, Time elapsed: 0.004 sec
Running org.jgrapht.alg.StoerWagnerMinimumCutTest
Tests run: 10, Failures: 0, Errors: 0, Skipped: 0, Time elapsed: 0.011 sec
Running org.jgrapht.alg.TarjanLowestCommonAncestorTest
Tests run: 3, Failures: 0, Errors: 0, Skipped: 0, Time elapsed: 0.004 sec
Running org.jgrapht.alg.TransitiveClosureTest
Tests run: 2, Failures: 0, Errors: 0, Skipped: 0, Time elapsed: 0.004 sec
Running org.jgrapht.alg.util.UnionFindTest
Tests run: 1, Failures: 0, Errors: 0, Skipped: 0, Time elapsed: 0.003 sec
Running org.jgrapht.alg.VertexCoversTest
Tests run: 2, Failures: 0, Errors: 0, Skipped: 0, Time elapsed: 2.271 sec
Running org.jgrapht.experimental.alg.ColoringTest
Tests run: 2, Failures: 0, Errors: 0, Skipped: 0, Time elapsed: 0.002 sec
Running org.jgrapht.experimental.dag.DirectedAcyclicGraphTest
Tests run: 5, Failures: 0, Errors: 0, Skipped: 0, Time elapsed: 0.664 sec
Running org.jgrapht.experimental.equivalence.EquivalenceGroupCreatorTest
Tests run: 4, Failures: 0, Errors: 0, Skipped: 0, Time elapsed: 0.007 sec
Running org.jgrapht.experimental.GraphReaderTest
Tests run: 2, Failures: 0, Errors: 0, Skipped: 0, Time elapsed: 0.005 sec
Running org.jgrapht.experimental.isomorphism.IsomorphismInspectorTest
Tests run: 4, Failures: 1, Errors: 0, Skipped: 0, Time elapsed: 0.027 sec <<< FAILURE!
Running org.jgrapht.experimental.permutation.CompoundPermutationIterTest
Tests run: 1, Failures: 0, Errors: 0, Skipped: 0, Time elapsed: 0.128 sec
Running org.jgrapht.generate.GraphGeneratorTest
Tests run: 9, Failures: 0, Errors: 0, Skipped: 0, Time elapsed: 0.038 sec
Running org.jgrapht.generate.RandomGraphGeneratorTest
Tests run: 3, Failures: 0, Errors: 0, Skipped: 0, Time elapsed: 0.006 sec
Running org.jgrapht.graph.AsUndirectedGraphTest
Tests run: 7, Failures: 0, Errors: 0, Skipped: 0, Time elapsed: 0.004 sec
Running org.jgrapht.graph.AsUnweightedGraphTest
Tests run: 2, Failures: 0, Errors: 2, Skipped: 0, Time elapsed: 0.006 sec <<< FAILURE!
Running org.jgrapht.graph.AsWeightedGraphTest
Tests run: 1, Failures: 0, Errors: 0, Skipped: 0, Time elapsed: 0.002 sec
Running org.jgrapht.graph.CloneTest
Tests run: 2, Failures: 1, Errors: 0, Skipped: 0, Time elapsed: 0.004 sec <<< FAILURE!
Running org.jgrapht.graph.DefaultDirectedGraphTest
Tests run: 6, Failures: 0, Errors: 0, Skipped: 0, Time elapsed: 0.004 sec
Running org.jgrapht.graph.EqualsAndHashCodeTest
Tests run: 6, Failures: 6, Errors: 0, Skipped: 0, Time elapsed: 0.007 sec <<< FAILURE!
Running org.jgrapht.graph.GenericGraphsTest
Tests run: 6, Failures: 0, Errors: 0, Skipped: 0, Time elapsed: 0.003 sec
Running org.jgrapht.graph.GraphBuilderTest
Tests run: 5, Failures: 4, Errors: 0, Skipped: 0, Time elapsed: 0.004 sec <<< FAILURE!
Running org.jgrapht.graph.ListenableGraphTest
Tests run: 3, Failures: 0, Errors: 0, Skipped: 0, Time elapsed: 0.002 sec
Running org.jgrapht.graph.SerializationTest
Tests run: 1, Failures: 0, Errors: 0, Skipped: 0, Time elapsed: 0.018 sec
Running org.jgrapht.graph.SimpleDirectedGraphTest
Tests run: 21, Failures: 1, Errors: 0, Skipped: 0, Time elapsed: 0.01 sec <<< FAILURE!
Running org.jgrapht.graph.SimpleGraphPathTest
Tests run: 6, Failures: 0, Errors: 0, Skipped: 0, Time elapsed: 0.003 sec
Running org.jgrapht.graph.SimpleIdentityDirectedGraphTest
Tests run: 21, Failures: 1, Errors: 0, Skipped: 0, Time elapsed: 0.011 sec <<< FAILURE!
Running org.jgrapht.graph.SubgraphTest
Tests run: 4, Failures: 0, Errors: 0, Skipped: 0, Time elapsed: 0.002 sec
Running org.jgrapht.traverse.BreadthFirstIteratorTest
Tests run: 1, Failures: 1, Errors: 0, Skipped: 0, Time elapsed: 0.007 sec <<< FAILURE!
Running org.jgrapht.traverse.ClosestFirstIteratorTest
Tests run: 3, Failures: 3, Errors: 0, Skipped: 0, Time elapsed: 0.004 sec <<< FAILURE!
Running org.jgrapht.traverse.DepthFirstIteratorTest
Tests run: 2, Failures: 1, Errors: 0, Skipped: 0, Time elapsed: 0.001 sec <<< FAILURE!
Running org.jgrapht.traverse.IgnoreDirectionTest
Tests run: 1, Failures: 1, Errors: 0, Skipped: 0, Time elapsed: 0 sec <<< FAILURE!
Running org.jgrapht.traverse.TopologicalOrderIteratorTest
Tests run: 2, Failures: 0, Errors: 0, Skipped: 0, Time elapsed: 0 sec
Running org.jgrapht.util.FibonacciHeapTest
Tests run: 2, Failures: 0, Errors: 0, Skipped: 0, Time elapsed: 0.049 sec
Running org.jgrapht.util.PrefetchIteratorTest
Tests run: 2, Failures: 0, Errors: 0, Skipped: 0, Time elapsed: 0.001 sec

Results :

Failed tests:   testConstructor(org.jgrapht.alg.BellmanFordShortestPathTest): expected:<[null, null, null, null]> but was:<null>
  testWithNegativeEdges(org.jgrapht.alg.BellmanFordShortestPathTest): expected:<[null, null]> but was:<null>
  testPathBetween(org.jgrapht.alg.BellmanFordShortestPathTest): expected:<[null]> but was:<null>
  testNotBiconnected(org.jgrapht.alg.BiconnectivityInspectorTest): expected:<2> but was:<1>
  testNotBiconnected(org.jgrapht.alg.BlockCutpointGraphTest): expected:<([0, 2], [{0,2}])> but was:<([0, 3], [{0,3}])>
  testSimpleGraph1(org.jgrapht.alg.CliqueMinimalSeparatorDecompositionTest): expected:<5> but was:<0>
  testPseudograph1(org.jgrapht.alg.CliqueMinimalSeparatorDecompositionTest)
  testSimpleGraph2(org.jgrapht.alg.CliqueMinimalSeparatorDecompositionTest): expected:<5> but was:<0>
  testBerry2010(org.jgrapht.alg.CliqueMinimalSeparatorDecompositionTest): expected:<23> but was:<0>
  testTarjan1985(org.jgrapht.alg.CliqueMinimalSeparatorDecompositionTest): expected:<4> but was:<11>
  testGraph1(org.jgrapht.alg.CliqueMinimalSeparatorDecompositionTest): expected:<23> but was:<0>
  testRandomGraphs(org.jgrapht.alg.CliqueMinimalSeparatorDecompositionTest): expected:<0> but was:<317>
  testConstructor(org.jgrapht.alg.DijkstraShortestPathTest): expected:<[null, null, null]> but was:<null>
  testPathBetween(org.jgrapht.alg.DijkstraShortestPathTest): expected:<[null]> but was:<null>
  testBrunoMaoili(org.jgrapht.alg.KSPDiscardsValidPathsTest)
  testKruskal(org.jgrapht.alg.MinimumSpanningTreeTest): expected:<15.0> but was:<0.0>
  testRealGraph(org.jgrapht.alg.MinSourceSinkCutTest): expected:<[0, 1, 2]> but was:<[0]>
  testRealGraph2(org.jgrapht.alg.MinSourceSinkCutTest): expected:<[0, 1, 4]> but was:<[0]>
  testGraphWithOneEdge(org.jgrapht.alg.MinSourceSinkCutTest): expected:<2.0> but was:<0.0>
  testEdgeComparator(org.jgrapht.experimental.isomorphism.IsomorphismInspectorTest)
  testCloneSpecificsBug(org.jgrapht.graph.CloneTest): expected:<2> but was:<0>
  testDefaultDirectedGraph(org.jgrapht.graph.EqualsAndHashCodeTest)
  testSimpleGraph(org.jgrapht.graph.EqualsAndHashCodeTest)
  testGraphsWithNonIntrusiveEdge(org.jgrapht.graph.EqualsAndHashCodeTest)
  testPseudograph(org.jgrapht.graph.EqualsAndHashCodeTest)
  testGrapshWithCustomEdges(org.jgrapht.graph.EqualsAndHashCodeTest)
  testAsWeightedGraphs(org.jgrapht.graph.EqualsAndHashCodeTest)
  testAddEdge(org.jgrapht.graph.GraphBuilderTest): expected:<5> but was:<4>
  testRemoveEdge(org.jgrapht.graph.GraphBuilderTest): expected:<2> but was:<0>
  testRemoveVertex(org.jgrapht.graph.GraphBuilderTest): expected:<1> but was:<0>
  testAddGraph(org.jgrapht.graph.GraphBuilderTest): expected:<2> but was:<1>
  testAddEdgeEdge(org.jgrapht.graph.SimpleDirectedGraphTest)
  testAddEdgeEdge(org.jgrapht.graph.SimpleIdentityDirectedGraphTest)
  testDirectedGraph(org.jgrapht.traverse.BreadthFirstIteratorTest): expected:<1,2[,3,4,5,6,7,8,9]> but was:<1,2[]>
  testRadius(org.jgrapht.traverse.ClosestFirstIteratorTest): expected:<1,2[,3,5,6,7]> but was:<1,2[]>
  testNoStart(org.jgrapht.traverse.ClosestFirstIteratorTest): expected:<1,2,3,5,6,[7,9,4],8,orphan> but was:<1,2,3,5,6,[4,7,9],8,orphan>
  testDirectedGraph(org.jgrapht.traverse.ClosestFirstIteratorTest): expected:<1,2[,3,5,6,7,9,4,8]> but was:<1,2[]>
  testDirectedGraph(org.jgrapht.traverse.DepthFirstIteratorTest): expected:<1,[3,6,5,7,9,4,8,]2> but was:<1,[]2>
  testDirectedGraph(org.jgrapht.traverse.IgnoreDirectionTest): expected:<4,9,7[,8,2,1,3,6,5]> but was:<4,9,7[]>

Tests in error: 
  testPrim(org.jgrapht.alg.MinimumSpanningTreeTest)
  testDirected(org.jgrapht.graph.AsUnweightedGraphTest)
  testUndirected(org.jgrapht.graph.AsUnweightedGraphTest)

Tests run: 231, Failures: 39, Errors: 3, Skipped: 0

[INFO] ------------------------------------------------------------------------
[INFO] BUILD FAILURE
[INFO] ------------------------------------------------------------------------
[INFO] Total time: 12.110 s
[INFO] Finished at: 2015-10-06T22:36:28+02:00
[INFO] Final Memory: 20M/283M
[INFO] ------------------------------------------------------------------------
[ERROR] Failed to execute goal org.apache.maven.plugins:maven-surefire-plugin:2.12:test (default-test) on project jgrapht-core: There are test failures.
[ERROR] 
[ERROR] Please refer to /Users/aliparsai/Study/LittleDarwin/Cases/jgrapht-0.9.1/source/jgrapht-core/target/surefire-reports for the individual test results.
[ERROR] -> [Help 1]
[ERROR] 
[ERROR] To see the full stack trace of the errors, re-run Maven with the -e switch.
[ERROR] Re-run Maven using the -X switch to enable full debug logging.
[ERROR] 
[ERROR] For more information about the errors and possible solutions, please read the following articles:
[ERROR] [Help 1] http://cwiki.apache.org/confluence/display/MAVEN/MojoFailureException
