[INFO] Scanning for projects...
[INFO]                                                                         
[INFO] ------------------------------------------------------------------------
[INFO] Building JGraphT - Core 0.9.1
[INFO] ------------------------------------------------------------------------
[INFO] 
[INFO] --- maven-enforcer-plugin:1.0:enforce (enforce-maven) @ jgrapht-core ---
[INFO] 
[INFO] --- maven-resources-plugin:2.6:resources (default-resources) @ jgrapht-core ---
[INFO] Using 'UTF-8' encoding to copy filtered resources.
[INFO] skip non existing resourceDirectory /Users/aliparsai/Study/LittleDarwin/Cases/jgrapht-0.9.1/source/jgrapht-core/src/main/resources
[INFO] 
[INFO] --- maven-compiler-plugin:3.1:compile (default-compile) @ jgrapht-core ---
[INFO] Changes detected - recompiling the module!
[INFO] Compiling 194 source files to /Users/aliparsai/Study/LittleDarwin/Cases/jgrapht-0.9.1/source/jgrapht-core/target/classes
[WARNING] /Users/aliparsai/Study/LittleDarwin/Cases/jgrapht-0.9.1/source/jgrapht-core/src/main/java/org/jgrapht/graph/DefaultListenableGraph.java: /Users/aliparsai/Study/LittleDarwin/Cases/jgrapht-0.9.1/source/jgrapht-core/src/main/java/org/jgrapht/graph/DefaultListenableGraph.java uses or overrides a deprecated API.
[WARNING] /Users/aliparsai/Study/LittleDarwin/Cases/jgrapht-0.9.1/source/jgrapht-core/src/main/java/org/jgrapht/graph/DefaultListenableGraph.java: Recompile with -Xlint:deprecation for details.
[WARNING] /Users/aliparsai/Study/LittleDarwin/Cases/jgrapht-0.9.1/source/jgrapht-core/src/main/java/org/jgrapht/experimental/isomorphism/GraphOrdering.java: Some input files use unchecked or unsafe operations.
[WARNING] /Users/aliparsai/Study/LittleDarwin/Cases/jgrapht-0.9.1/source/jgrapht-core/src/main/java/org/jgrapht/experimental/isomorphism/GraphOrdering.java: Recompile with -Xlint:unchecked for details.
[INFO] 
[INFO] --- maven-bundle-plugin:2.3.7:manifest (bundle-manifest) @ jgrapht-core ---
[INFO] 
[INFO] --- maven-resources-plugin:2.6:testResources (default-testResources) @ jgrapht-core ---
[INFO] Using 'UTF-8' encoding to copy filtered resources.
[INFO] Copying 1 resource
[INFO] 
[INFO] --- maven-compiler-plugin:3.1:testCompile (default-testCompile) @ jgrapht-core ---
[INFO] Nothing to compile - all classes are up to date
[INFO] 
[INFO] --- maven-surefire-plugin:2.12:test (default-test) @ jgrapht-core ---
[INFO] Surefire report directory: /Users/aliparsai/Study/LittleDarwin/Cases/jgrapht-0.9.1/source/jgrapht-core/target/surefire-reports

-------------------------------------------------------
 T E S T S
-------------------------------------------------------
Running org.jgrapht.alg.BellmanFordShortestPathTest
Tests run: 3, Failures: 0, Errors: 3, Skipped: 0, Time elapsed: 0.056 sec <<< FAILURE!
Running org.jgrapht.alg.BiconnectivityInspectorTest
Tests run: 3, Failures: 0, Errors: 3, Skipped: 0, Time elapsed: 0.013 sec <<< FAILURE!
Running org.jgrapht.alg.BlockCutpointGraphTest
Tests run: 3, Failures: 0, Errors: 3, Skipped: 0, Time elapsed: 0.009 sec <<< FAILURE!
Running org.jgrapht.alg.BronKerboschCliqueFinderTest
Tests run: 2, Failures: 0, Errors: 2, Skipped: 0, Time elapsed: 0.012 sec <<< FAILURE!
Running org.jgrapht.alg.ChromaticNumberTest
Tests run: 1, Failures: 0, Errors: 1, Skipped: 0, Time elapsed: 0.004 sec <<< FAILURE!
Running org.jgrapht.alg.CliqueMinimalSeparatorDecompositionTest
Tests run: 7, Failures: 0, Errors: 7, Skipped: 0, Time elapsed: 0.017 sec <<< FAILURE!
Running org.jgrapht.alg.ConnectivityInspectorTest
Tests run: 6, Failures: 0, Errors: 6, Skipped: 0, Time elapsed: 0.013 sec <<< FAILURE!
Running org.jgrapht.alg.cycle.DirectedSimpleCyclesTest
Tests run: 1, Failures: 0, Errors: 1, Skipped: 0, Time elapsed: 0.035 sec <<< FAILURE!
Running org.jgrapht.alg.cycle.UndirectedCycleBaseTest
Tests run: 1, Failures: 0, Errors: 1, Skipped: 0, Time elapsed: 0.007 sec <<< FAILURE!
Running org.jgrapht.alg.CycleDetectorTest
Tests run: 4, Failures: 0, Errors: 4, Skipped: 0, Time elapsed: 0.01 sec <<< FAILURE!
Running org.jgrapht.alg.DijkstraShortestPathTest
Tests run: 2, Failures: 0, Errors: 2, Skipped: 0, Time elapsed: 0.002 sec <<< FAILURE!
Running org.jgrapht.alg.EdmondsBlossomShrinkingTest
Tests run: 1, Failures: 0, Errors: 1, Skipped: 0, Time elapsed: 0.001 sec <<< FAILURE!
Running org.jgrapht.alg.EdmondsKarpMaximumFlowTest
Tests run: 2, Failures: 0, Errors: 2, Skipped: 0, Time elapsed: 0.003 sec <<< FAILURE!
Running org.jgrapht.alg.EulerianCircuitTest
Tests run: 1, Failures: 0, Errors: 1, Skipped: 0, Time elapsed: 0 sec <<< FAILURE!
Running org.jgrapht.alg.FloydWarshallShortestPathsTest
Tests run: 5, Failures: 0, Errors: 4, Skipped: 0, Time elapsed: 0.006 sec <<< FAILURE!
Running org.jgrapht.alg.HamiltonianCycleTest
Tests run: 1, Failures: 0, Errors: 1, Skipped: 0, Time elapsed: 0 sec <<< FAILURE!
Running org.jgrapht.alg.HopcroftKarpBipartiteMatchingTest
Tests run: 3, Failures: 0, Errors: 3, Skipped: 0, Time elapsed: 0.005 sec <<< FAILURE!
Running org.jgrapht.alg.KShortestPathCostTest
Tests run: 4, Failures: 0, Errors: 4, Skipped: 0, Time elapsed: 0.005 sec <<< FAILURE!
Running org.jgrapht.alg.KShortestPathKValuesTest
Tests run: 2, Failures: 0, Errors: 2, Skipped: 0, Time elapsed: 0.001 sec <<< FAILURE!
Running org.jgrapht.alg.KSPDiscardsValidPathsTest
Tests run: 2, Failures: 0, Errors: 2, Skipped: 0, Time elapsed: 0.002 sec <<< FAILURE!
Running org.jgrapht.alg.KSPExampleTest
Tests run: 3, Failures: 0, Errors: 3, Skipped: 0, Time elapsed: 0.003 sec <<< FAILURE!
Running org.jgrapht.alg.KuhnMunkresMinimalWeightBipartitePerfectMatchingTest
Tests run: 10, Failures: 0, Errors: 10, Skipped: 0, Time elapsed: 0.014 sec <<< FAILURE!
Running org.jgrapht.alg.MinimumSpanningTreeTest
Tests run: 2, Failures: 0, Errors: 2, Skipped: 0, Time elapsed: 0.002 sec <<< FAILURE!
Running org.jgrapht.alg.MinSourceSinkCutTest
Tests run: 4, Failures: 0, Errors: 4, Skipped: 0, Time elapsed: 0.004 sec <<< FAILURE!
Running org.jgrapht.alg.NaiveLcaFinderTest
Tests run: 4, Failures: 0, Errors: 4, Skipped: 0, Time elapsed: 0.019 sec <<< FAILURE!
Running org.jgrapht.alg.NeighborIndexTest
Tests run: 2, Failures: 0, Errors: 2, Skipped: 0, Time elapsed: 0.002 sec <<< FAILURE!
Running org.jgrapht.alg.StoerWagnerMinimumCutTest
Tests run: 10, Failures: 0, Errors: 9, Skipped: 0, Time elapsed: 0.009 sec <<< FAILURE!
Running org.jgrapht.alg.TarjanLowestCommonAncestorTest
Tests run: 3, Failures: 0, Errors: 3, Skipped: 0, Time elapsed: 0.004 sec <<< FAILURE!
Running org.jgrapht.alg.TransitiveClosureTest
Tests run: 2, Failures: 0, Errors: 2, Skipped: 0, Time elapsed: 0.009 sec <<< FAILURE!
Running org.jgrapht.alg.util.UnionFindTest
Tests run: 1, Failures: 0, Errors: 0, Skipped: 0, Time elapsed: 0.004 sec
Running org.jgrapht.alg.VertexCoversTest
Tests run: 2, Failures: 0, Errors: 2, Skipped: 0, Time elapsed: 0.002 sec <<< FAILURE!
Running org.jgrapht.experimental.alg.ColoringTest
Tests run: 2, Failures: 0, Errors: 2, Skipped: 0, Time elapsed: 0.005 sec <<< FAILURE!
Running org.jgrapht.experimental.dag.DirectedAcyclicGraphTest
Tests run: 5, Failures: 0, Errors: 5, Skipped: 0, Time elapsed: 0.041 sec <<< FAILURE!
Running org.jgrapht.experimental.equivalence.EquivalenceGroupCreatorTest
Tests run: 4, Failures: 0, Errors: 0, Skipped: 0, Time elapsed: 0.029 sec
Running org.jgrapht.experimental.GraphReaderTest
Tests run: 2, Failures: 0, Errors: 2, Skipped: 0, Time elapsed: 0.004 sec <<< FAILURE!
Running org.jgrapht.experimental.isomorphism.IsomorphismInspectorTest
Tests run: 4, Failures: 0, Errors: 4, Skipped: 0, Time elapsed: 0.005 sec <<< FAILURE!
Running org.jgrapht.experimental.permutation.CompoundPermutationIterTest
Tests run: 1, Failures: 0, Errors: 0, Skipped: 0, Time elapsed: 0.112 sec
Running org.jgrapht.generate.GraphGeneratorTest
Tests run: 9, Failures: 0, Errors: 9, Skipped: 0, Time elapsed: 0.008 sec <<< FAILURE!
Running org.jgrapht.generate.RandomGraphGeneratorTest
Tests run: 3, Failures: 0, Errors: 3, Skipped: 0, Time elapsed: 0.004 sec <<< FAILURE!
Running org.jgrapht.graph.AsUndirectedGraphTest
Tests run: 7, Failures: 0, Errors: 7, Skipped: 0, Time elapsed: 0.007 sec <<< FAILURE!
Running org.jgrapht.graph.AsUnweightedGraphTest
Tests run: 2, Failures: 0, Errors: 2, Skipped: 0, Time elapsed: 0.005 sec <<< FAILURE!
Running org.jgrapht.graph.AsWeightedGraphTest
Tests run: 1, Failures: 0, Errors: 1, Skipped: 0, Time elapsed: 0.002 sec <<< FAILURE!
Running org.jgrapht.graph.CloneTest
Tests run: 2, Failures: 0, Errors: 2, Skipped: 0, Time elapsed: 0.003 sec <<< FAILURE!
Running org.jgrapht.graph.DefaultDirectedGraphTest
Tests run: 6, Failures: 0, Errors: 6, Skipped: 0, Time elapsed: 0.003 sec <<< FAILURE!
Running org.jgrapht.graph.EqualsAndHashCodeTest
Tests run: 6, Failures: 0, Errors: 6, Skipped: 0, Time elapsed: 0.004 sec <<< FAILURE!
Running org.jgrapht.graph.GenericGraphsTest
Tests run: 6, Failures: 0, Errors: 6, Skipped: 0, Time elapsed: 0.006 sec <<< FAILURE!
Running org.jgrapht.graph.GraphBuilderTest
Tests run: 5, Failures: 0, Errors: 5, Skipped: 0, Time elapsed: 0.003 sec <<< FAILURE!
Running org.jgrapht.graph.ListenableGraphTest
Tests run: 3, Failures: 0, Errors: 3, Skipped: 0, Time elapsed: 0.003 sec <<< FAILURE!
Running org.jgrapht.graph.SerializationTest
Tests run: 1, Failures: 0, Errors: 1, Skipped: 0, Time elapsed: 0 sec <<< FAILURE!
Running org.jgrapht.graph.SimpleDirectedGraphTest
Tests run: 21, Failures: 0, Errors: 21, Skipped: 0, Time elapsed: 0.022 sec <<< FAILURE!
Running org.jgrapht.graph.SimpleGraphPathTest
Tests run: 6, Failures: 0, Errors: 6, Skipped: 0, Time elapsed: 0.004 sec <<< FAILURE!
Running org.jgrapht.graph.SimpleIdentityDirectedGraphTest
Tests run: 21, Failures: 0, Errors: 21, Skipped: 0, Time elapsed: 0.017 sec <<< FAILURE!
Running org.jgrapht.graph.SubgraphTest
Tests run: 4, Failures: 0, Errors: 4, Skipped: 0, Time elapsed: 0.002 sec <<< FAILURE!
Running org.jgrapht.traverse.BreadthFirstIteratorTest
Tests run: 1, Failures: 0, Errors: 1, Skipped: 0, Time elapsed: 0.002 sec <<< FAILURE!
Running org.jgrapht.traverse.ClosestFirstIteratorTest
Tests run: 3, Failures: 0, Errors: 3, Skipped: 0, Time elapsed: 0.003 sec <<< FAILURE!
Running org.jgrapht.traverse.DepthFirstIteratorTest
Tests run: 2, Failures: 0, Errors: 2, Skipped: 0, Time elapsed: 0.002 sec <<< FAILURE!
Running org.jgrapht.traverse.IgnoreDirectionTest
Tests run: 1, Failures: 0, Errors: 1, Skipped: 0, Time elapsed: 0 sec <<< FAILURE!
Running org.jgrapht.traverse.TopologicalOrderIteratorTest
Tests run: 2, Failures: 0, Errors: 1, Skipped: 0, Time elapsed: 0.007 sec <<< FAILURE!
Running org.jgrapht.util.FibonacciHeapTest
Tests run: 2, Failures: 0, Errors: 0, Skipped: 0, Time elapsed: 0.078 sec
Running org.jgrapht.util.PrefetchIteratorTest
Tests run: 2, Failures: 0, Errors: 0, Skipped: 0, Time elapsed: 0.003 sec

Results :

Tests in error: 
  testConstructor(org.jgrapht.alg.BellmanFordShortestPathTest)
  testWithNegativeEdges(org.jgrapht.alg.BellmanFordShortestPathTest)
  testPathBetween(org.jgrapht.alg.BellmanFordShortestPathTest)
  testBiconnected(org.jgrapht.alg.BiconnectivityInspectorTest)
  testLinearGraph(org.jgrapht.alg.BiconnectivityInspectorTest)
  testNotBiconnected(org.jgrapht.alg.BiconnectivityInspectorTest)
  testBiconnected(org.jgrapht.alg.BlockCutpointGraphTest)
  testLinearGraph(org.jgrapht.alg.BlockCutpointGraphTest)
  testNotBiconnected(org.jgrapht.alg.BlockCutpointGraphTest)
  testFindBiggest(org.jgrapht.alg.BronKerboschCliqueFinderTest)
  testFindAll(org.jgrapht.alg.BronKerboschCliqueFinderTest)
  testChromaticNumber(org.jgrapht.alg.ChromaticNumberTest)
  testSimpleGraph1(org.jgrapht.alg.CliqueMinimalSeparatorDecompositionTest)
  testPseudograph1(org.jgrapht.alg.CliqueMinimalSeparatorDecompositionTest)
  testSimpleGraph2(org.jgrapht.alg.CliqueMinimalSeparatorDecompositionTest)
  testBerry2010(org.jgrapht.alg.CliqueMinimalSeparatorDecompositionTest)
  testTarjan1985(org.jgrapht.alg.CliqueMinimalSeparatorDecompositionTest)
  testGraph1(org.jgrapht.alg.CliqueMinimalSeparatorDecompositionTest)
  testRandomGraphs(org.jgrapht.alg.CliqueMinimalSeparatorDecompositionTest)
  testDirectedGraph(org.jgrapht.alg.ConnectivityInspectorTest)
  testIsGraphConnected(org.jgrapht.alg.ConnectivityInspectorTest)
  testStronglyConnected1(org.jgrapht.alg.ConnectivityInspectorTest)
  testStronglyConnected2(org.jgrapht.alg.ConnectivityInspectorTest)
  testStronglyConnected3(org.jgrapht.alg.ConnectivityInspectorTest)
  testStronglyConnected4(org.jgrapht.alg.ConnectivityInspectorTest)
  test(org.jgrapht.alg.cycle.DirectedSimpleCyclesTest)
  test(org.jgrapht.alg.cycle.UndirectedCycleBaseTest)
  testDirectedWithCycle(org.jgrapht.alg.CycleDetectorTest)
  testDirectedWithoutCycle(org.jgrapht.alg.CycleDetectorTest)
  testDirectedWithDoubledCycle(org.jgrapht.alg.CycleDetectorTest)
  testVertexEquals(org.jgrapht.alg.CycleDetectorTest)
  testConstructor(org.jgrapht.alg.DijkstraShortestPathTest)
  testPathBetween(org.jgrapht.alg.DijkstraShortestPathTest)
  testOne(org.jgrapht.alg.EdmondsBlossomShrinkingTest)
  testCornerCases(org.jgrapht.alg.EdmondsKarpMaximumFlowTest)
  testLogic(org.jgrapht.alg.EdmondsKarpMaximumFlowTest)
  testEulerianCircuit(org.jgrapht.alg.EulerianCircuitTest)
  testCompareWithDijkstra(org.jgrapht.alg.FloydWarshallShortestPathsTest)
  testDiameter(org.jgrapht.alg.FloydWarshallShortestPathsTest)
  testEdgeLessDiameter(org.jgrapht.alg.FloydWarshallShortestPathsTest)
  testWeightedEdges(org.jgrapht.alg.FloydWarshallShortestPathsTest)
  testHamiltonianCycle(org.jgrapht.alg.HamiltonianCycleTest)
  testBipartiteMatching1(org.jgrapht.alg.HopcroftKarpBipartiteMatchingTest)
  testBipartiteMatching2(org.jgrapht.alg.HopcroftKarpBipartiteMatchingTest)
  testEmptyMatching(org.jgrapht.alg.HopcroftKarpBipartiteMatchingTest)
  testKShortestPathCompleteGraph4(org.jgrapht.alg.KShortestPathCostTest)
  testPicture1Graph(org.jgrapht.alg.KShortestPathCostTest)
  testShortestPathsInIncreasingOrder(org.jgrapht.alg.KShortestPathCostTest)
  testShortestPathsWeightsWithMaxSizeIncreases(org.jgrapht.alg.KShortestPathCostTest)
  testMaxSizeValueCompleteGraph6(org.jgrapht.alg.KShortestPathKValuesTest)
  testNbReturnedPaths(org.jgrapht.alg.KShortestPathKValuesTest)
  testNot3connectedGraph(org.jgrapht.alg.KSPDiscardsValidPathsTest)
  testBrunoMaoili(org.jgrapht.alg.KSPDiscardsValidPathsTest)
  testFourReturnedPathsJGraphT(org.jgrapht.alg.KSPExampleTest)
  testThreeReturnedPathsJGraphT(org.jgrapht.alg.KSPExampleTest)
  testTwoReturnedPathsJGraphT(org.jgrapht.alg.KSPExampleTest)
  test3x3SimpleAssignmentTask(org.jgrapht.alg.KuhnMunkresMinimalWeightBipartitePerfectMatchingTest)
  test3x3SimpleAssignmentTaskNo2(org.jgrapht.alg.KuhnMunkresMinimalWeightBipartitePerfectMatchingTest)
  test5x5AssignmentTask(org.jgrapht.alg.KuhnMunkresMinimalWeightBipartitePerfectMatchingTest)
  test5x5InvertedAssignmentTask(org.jgrapht.alg.KuhnMunkresMinimalWeightBipartitePerfectMatchingTest)
  test6x6DegeneratedAssignmentTask(org.jgrapht.alg.KuhnMunkresMinimalWeightBipartitePerfectMatchingTest)
  test6x6DegeneratedAssignmentTaskNo2(org.jgrapht.alg.KuhnMunkresMinimalWeightBipartitePerfectMatchingTest)
  test5x5DegeneratedAssignmentTask(org.jgrapht.alg.KuhnMunkresMinimalWeightBipartitePerfectMatchingTest)
  test8x8BulkyAssignmentTask(org.jgrapht.alg.KuhnMunkresMinimalWeightBipartitePerfectMatchingTest)
  test21x21BulkyAssignmentTask(org.jgrapht.alg.KuhnMunkresMinimalWeightBipartitePerfectMatchingTest)
  test20x20BulkyAssignmentTask(org.jgrapht.alg.KuhnMunkresMinimalWeightBipartitePerfectMatchingTest)
  testKruskal(org.jgrapht.alg.MinimumSpanningTreeTest)
  testPrim(org.jgrapht.alg.MinimumSpanningTreeTest)
  testRealGraph(org.jgrapht.alg.MinSourceSinkCutTest)
  testRealGraph2(org.jgrapht.alg.MinSourceSinkCutTest)
  testGraphWithOneEdge(org.jgrapht.alg.MinSourceSinkCutTest)
  testDisconnectedGraph(org.jgrapht.alg.MinSourceSinkCutTest)
  testNormalCases(org.jgrapht.alg.NaiveLcaFinderTest)
  testNoLca(org.jgrapht.alg.NaiveLcaFinderTest)
  testLoops(org.jgrapht.alg.NaiveLcaFinderTest)
  testArrivalOrder(org.jgrapht.alg.NaiveLcaFinderTest)
  testNeighborSet(org.jgrapht.alg.NeighborIndexTest)
  testDirectedNeighborSet(org.jgrapht.alg.NeighborIndexTest)
  testMinCut14(org.jgrapht.alg.StoerWagnerMinimumCutTest)
  testMinCutDisconnected(org.jgrapht.alg.StoerWagnerMinimumCutTest)
  testMinCut0Weight(org.jgrapht.alg.StoerWagnerMinimumCutTest)
  testMinCutSmallWeight(org.jgrapht.alg.StoerWagnerMinimumCutTest)
  testMinCutMultigraph(org.jgrapht.alg.StoerWagnerMinimumCutTest)
  testMinCutUnweighted(org.jgrapht.alg.StoerWagnerMinimumCutTest)
  testMinCutSingleton(org.jgrapht.alg.StoerWagnerMinimumCutTest)
  testMinCutDoubleton(org.jgrapht.alg.StoerWagnerMinimumCutTest)
  testMinCutSmall(org.jgrapht.alg.StoerWagnerMinimumCutTest)
  testBinaryTree(org.jgrapht.alg.TarjanLowestCommonAncestorTest)
  testNonBinaryTree(org.jgrapht.alg.TarjanLowestCommonAncestorTest)
  testOneNode(org.jgrapht.alg.TarjanLowestCommonAncestorTest)
  testRingGraph(org.jgrapht.alg.TransitiveClosureTest)
  testLinearGraph(org.jgrapht.alg.TransitiveClosureTest)
  testFindGreedyCover(org.jgrapht.alg.VertexCoversTest)
  testFind2ApproximationCover(org.jgrapht.alg.VertexCoversTest)
  testGreedyColoring(org.jgrapht.experimental.alg.ColoringTest)
  testBacktrackColoring(org.jgrapht.experimental.alg.ColoringTest)
  testCycleDetectionInRandomGraphBuild(org.jgrapht.experimental.dag.DirectedAcyclicGraphTest)
  testTopoIterationOrderLinearGraph(org.jgrapht.experimental.dag.DirectedAcyclicGraphTest)
  testTopoIterationOrderComplexGraph(org.jgrapht.experimental.dag.DirectedAcyclicGraphTest)
  testIterationBehaviors(org.jgrapht.experimental.dag.DirectedAcyclicGraphTest)
  testWhenVertexIsNotInGraph_Then_ThowException(org.jgrapht.experimental.dag.DirectedAcyclicGraphTest)
  testGraphReader(org.jgrapht.experimental.GraphReaderTest)
  testGraphReaderWeighted(org.jgrapht.experimental.GraphReaderTest)
  testWheelGraphAddRemoveParts(org.jgrapht.experimental.isomorphism.IsomorphismInspectorTest)
  testLinear4vertexIsomorphicGraph(org.jgrapht.experimental.isomorphism.IsomorphismInspectorTest)
  testLinear4vertexNonIsomorphicCauseOfVertexEqGroup(org.jgrapht.experimental.isomorphism.IsomorphismInspectorTest)
  testEdgeComparator(org.jgrapht.experimental.isomorphism.IsomorphismInspectorTest)
  testEmptyGraphGenerator(org.jgrapht.generate.GraphGeneratorTest)
  testLinearGraphGenerator(org.jgrapht.generate.GraphGeneratorTest)
  testRingGraphGenerator(org.jgrapht.generate.GraphGeneratorTest)
  testCompleteGraphGenerator(org.jgrapht.generate.GraphGeneratorTest)
  testScaleFreeGraphGenerator(org.jgrapht.generate.GraphGeneratorTest)
  testCompleteBipartiteGraphGenerator(org.jgrapht.generate.GraphGeneratorTest)
  testHyperCubeGraphGenerator(org.jgrapht.generate.GraphGeneratorTest)
  testStarGraphGenerator(org.jgrapht.generate.GraphGeneratorTest)
  testGridGraphGenerator(org.jgrapht.generate.GraphGeneratorTest)
  testGenerateDirectedGraph(org.jgrapht.generate.RandomGraphGeneratorTest)
  testGenerateListenableUndirectedGraph(org.jgrapht.generate.RandomGraphGeneratorTest)
  testBadVertexFactory(org.jgrapht.generate.RandomGraphGeneratorTest)
  testAddEdge(org.jgrapht.graph.AsUndirectedGraphTest)
  testAddVertex(org.jgrapht.graph.AsUndirectedGraphTest)
  testDegreeOf(org.jgrapht.graph.AsUndirectedGraphTest)
  testGetAllEdges(org.jgrapht.graph.AsUndirectedGraphTest)
  testGetEdge(org.jgrapht.graph.AsUndirectedGraphTest)
  testRemoveEdge(org.jgrapht.graph.AsUndirectedGraphTest)
  testRemoveVertex(org.jgrapht.graph.AsUndirectedGraphTest)
  testDirected(org.jgrapht.graph.AsUnweightedGraphTest)
  testUndirected(org.jgrapht.graph.AsUnweightedGraphTest)
  test1(org.jgrapht.graph.AsWeightedGraphTest)
  testCloneSpecificsBug(org.jgrapht.graph.CloneTest)
  testParanoidGraph(org.jgrapht.graph.CloneTest)
  testEdgeSetFactory(org.jgrapht.graph.DefaultDirectedGraphTest)
  testEdgeOrderDeterminism(org.jgrapht.graph.DefaultDirectedGraphTest)
  testEdgesOf(org.jgrapht.graph.DefaultDirectedGraphTest)
  testInDegreeOf(org.jgrapht.graph.DefaultDirectedGraphTest)
  testOutDegreeOf(org.jgrapht.graph.DefaultDirectedGraphTest)
  testVertexOrderDeterminism(org.jgrapht.graph.DefaultDirectedGraphTest)
  testDefaultDirectedGraph(org.jgrapht.graph.EqualsAndHashCodeTest)
  testSimpleGraph(org.jgrapht.graph.EqualsAndHashCodeTest)
  testGraphsWithNonIntrusiveEdge(org.jgrapht.graph.EqualsAndHashCodeTest)
  testPseudograph(org.jgrapht.graph.EqualsAndHashCodeTest)
  testGrapshWithCustomEdges(org.jgrapht.graph.EqualsAndHashCodeTest)
  testAsWeightedGraphs(org.jgrapht.graph.EqualsAndHashCodeTest)
  testLegalInsertStringGraph(org.jgrapht.graph.GenericGraphsTest)
  testLegalInsertFooGraph(org.jgrapht.graph.GenericGraphsTest)
  testLegalInsertBarGraph(org.jgrapht.graph.GenericGraphsTest)
  testLegalInsertFooBarGraph(org.jgrapht.graph.GenericGraphsTest)
  testAlissaHacker(org.jgrapht.graph.GenericGraphsTest)
  testEqualButNotSameVertex(org.jgrapht.graph.GenericGraphsTest)
  testAddEdge(org.jgrapht.graph.GraphBuilderTest)
  testAddVertex(org.jgrapht.graph.GraphBuilderTest)
  testRemoveEdge(org.jgrapht.graph.GraphBuilderTest)
  testRemoveVertex(org.jgrapht.graph.GraphBuilderTest)
  testAddGraph(org.jgrapht.graph.GraphBuilderTest)
  testGraphListener(org.jgrapht.graph.ListenableGraphTest)
  testVertexSetListener(org.jgrapht.graph.ListenableGraphTest)
  testListenableDirectedWeightedGraph(org.jgrapht.graph.ListenableGraphTest)
  testDirectedMultigraph(org.jgrapht.graph.SerializationTest)
  testAddVertex(org.jgrapht.graph.SimpleDirectedGraphTest)
  testGetAllEdges(org.jgrapht.graph.SimpleDirectedGraphTest)
  testGetEdge(org.jgrapht.graph.SimpleDirectedGraphTest)
  testRemoveVertex(org.jgrapht.graph.SimpleDirectedGraphTest)
  testEdgesOf(org.jgrapht.graph.SimpleDirectedGraphTest)
  testInDegreeOf(org.jgrapht.graph.SimpleDirectedGraphTest)
  testOutDegreeOf(org.jgrapht.graph.SimpleDirectedGraphTest)
  testAddEdgeEdge(org.jgrapht.graph.SimpleDirectedGraphTest)
  testAddEdgeObjectObject(org.jgrapht.graph.SimpleDirectedGraphTest)
  testContainsEdgeEdge(org.jgrapht.graph.SimpleDirectedGraphTest)
  testContainsEdgeObjectObject(org.jgrapht.graph.SimpleDirectedGraphTest)
  testContainsVertex(org.jgrapht.graph.SimpleDirectedGraphTest)
  testEdgeSet(org.jgrapht.graph.SimpleDirectedGraphTest)
  testGetEdgeFactory(org.jgrapht.graph.SimpleDirectedGraphTest)
  testIncomingOutgoingEdgesOf(org.jgrapht.graph.SimpleDirectedGraphTest)
  testOutgoingEdgesOf(org.jgrapht.graph.SimpleDirectedGraphTest)
  testRemoveEdgeEdge(org.jgrapht.graph.SimpleDirectedGraphTest)
  testRemoveEdgeObjectObject(org.jgrapht.graph.SimpleDirectedGraphTest)
  testRemoveAllEdgesObjectObject(org.jgrapht.graph.SimpleDirectedGraphTest)
  testVertexSet(org.jgrapht.graph.SimpleDirectedGraphTest)
  testReversedView(org.jgrapht.graph.SimpleDirectedGraphTest)
  testEdgeList(org.jgrapht.graph.SimpleGraphPathTest)
  testInvalidVertexList(org.jgrapht.graph.SimpleGraphPathTest)
  testSingleVertexList(org.jgrapht.graph.SimpleGraphPathTest)
  testStartVertex(org.jgrapht.graph.SimpleGraphPathTest)
  testEndVertex(org.jgrapht.graph.SimpleGraphPathTest)
  testPathWeight(org.jgrapht.graph.SimpleGraphPathTest)
  testAddVertex(org.jgrapht.graph.SimpleIdentityDirectedGraphTest)
  testGetAllEdges(org.jgrapht.graph.SimpleIdentityDirectedGraphTest)
  testGetEdge(org.jgrapht.graph.SimpleIdentityDirectedGraphTest)
  testRemoveVertex(org.jgrapht.graph.SimpleIdentityDirectedGraphTest)
  testEdgesOf(org.jgrapht.graph.SimpleIdentityDirectedGraphTest)
  testInDegreeOf(org.jgrapht.graph.SimpleIdentityDirectedGraphTest)
  testOutDegreeOf(org.jgrapht.graph.SimpleIdentityDirectedGraphTest)
  testAddEdgeEdge(org.jgrapht.graph.SimpleIdentityDirectedGraphTest)
  testAddEdgeObjectObject(org.jgrapht.graph.SimpleIdentityDirectedGraphTest)
  testContainsEdgeEdge(org.jgrapht.graph.SimpleIdentityDirectedGraphTest)
  testContainsEdgeObjectObject(org.jgrapht.graph.SimpleIdentityDirectedGraphTest)
  testContainsVertex(org.jgrapht.graph.SimpleIdentityDirectedGraphTest)
  testEdgeSet(org.jgrapht.graph.SimpleIdentityDirectedGraphTest)
  testGetEdgeFactory(org.jgrapht.graph.SimpleIdentityDirectedGraphTest)
  testIncomingOutgoingEdgesOf(org.jgrapht.graph.SimpleIdentityDirectedGraphTest)
  testOutgoingEdgesOf(org.jgrapht.graph.SimpleIdentityDirectedGraphTest)
  testRemoveEdgeEdge(org.jgrapht.graph.SimpleIdentityDirectedGraphTest)
  testRemoveEdgeObjectObject(org.jgrapht.graph.SimpleIdentityDirectedGraphTest)
  testRemoveAllEdgesObjectObject(org.jgrapht.graph.SimpleIdentityDirectedGraphTest)
  testVertexSet(org.jgrapht.graph.SimpleIdentityDirectedGraphTest)
  testReversedView(org.jgrapht.graph.SimpleIdentityDirectedGraphTest)
  testInducedSubgraphListener(org.jgrapht.graph.SubgraphTest)
  testSubgraph(org.jgrapht.graph.SubgraphTest)
  testSubgraphListener(org.jgrapht.graph.SubgraphTest)
  testInducedSubgraphUnderlyingEdgeAddition(org.jgrapht.graph.SubgraphTest)
  testDirectedGraph(org.jgrapht.traverse.BreadthFirstIteratorTest)
  testNoStart(org.jgrapht.traverse.ClosestFirstIteratorTest)
  testRadius(org.jgrapht.traverse.ClosestFirstIteratorTest)
  testDirectedGraph(org.jgrapht.traverse.ClosestFirstIteratorTest)
  testBug1169182(org.jgrapht.traverse.DepthFirstIteratorTest)
  testDirectedGraph(org.jgrapht.traverse.DepthFirstIteratorTest)
  testDirectedGraph(org.jgrapht.traverse.IgnoreDirectionTest)
  testRecipe(org.jgrapht.traverse.TopologicalOrderIteratorTest)

Tests run: 231, Failures: 0, Errors: 218, Skipped: 0

[INFO] ------------------------------------------------------------------------
[INFO] BUILD FAILURE
[INFO] ------------------------------------------------------------------------
[INFO] Total time: 6.325 s
[INFO] Finished at: 2015-10-06T22:31:27+02:00
[INFO] Final Memory: 20M/289M
[INFO] ------------------------------------------------------------------------
[ERROR] Failed to execute goal org.apache.maven.plugins:maven-surefire-plugin:2.12:test (default-test) on project jgrapht-core: There are test failures.
[ERROR] 
[ERROR] Please refer to /Users/aliparsai/Study/LittleDarwin/Cases/jgrapht-0.9.1/source/jgrapht-core/target/surefire-reports for the individual test results.
[ERROR] -> [Help 1]
[ERROR] 
[ERROR] To see the full stack trace of the errors, re-run Maven with the -e switch.
[ERROR] Re-run Maven using the -X switch to enable full debug logging.
[ERROR] 
[ERROR] For more information about the errors and possible solutions, please read the following articles:
[ERROR] [Help 1] http://cwiki.apache.org/confluence/display/MAVEN/MojoFailureException
