[INFO] Scanning for projects...
[INFO]                                                                         
[INFO] ------------------------------------------------------------------------
[INFO] Building JGraphT - Core 0.9.1
[INFO] ------------------------------------------------------------------------
[INFO] 
[INFO] --- maven-enforcer-plugin:1.0:enforce (enforce-maven) @ jgrapht-core ---
[INFO] 
[INFO] --- maven-resources-plugin:2.6:resources (default-resources) @ jgrapht-core ---
[INFO] Using 'UTF-8' encoding to copy filtered resources.
[INFO] skip non existing resourceDirectory /Users/aliparsai/Study/LittleDarwin/Cases/jgrapht-0.9.1/source/jgrapht-core/src/main/resources
[INFO] 
[INFO] --- maven-compiler-plugin:3.1:compile (default-compile) @ jgrapht-core ---
[INFO] Changes detected - recompiling the module!
[INFO] Compiling 194 source files to /Users/aliparsai/Study/LittleDarwin/Cases/jgrapht-0.9.1/source/jgrapht-core/target/classes
[WARNING] /Users/aliparsai/Study/LittleDarwin/Cases/jgrapht-0.9.1/source/jgrapht-core/src/main/java/org/jgrapht/graph/DefaultListenableGraph.java: /Users/aliparsai/Study/LittleDarwin/Cases/jgrapht-0.9.1/source/jgrapht-core/src/main/java/org/jgrapht/graph/DefaultListenableGraph.java uses or overrides a deprecated API.
[WARNING] /Users/aliparsai/Study/LittleDarwin/Cases/jgrapht-0.9.1/source/jgrapht-core/src/main/java/org/jgrapht/graph/DefaultListenableGraph.java: Recompile with -Xlint:deprecation for details.
[WARNING] /Users/aliparsai/Study/LittleDarwin/Cases/jgrapht-0.9.1/source/jgrapht-core/src/main/java/org/jgrapht/experimental/isomorphism/GraphOrdering.java: Some input files use unchecked or unsafe operations.
[WARNING] /Users/aliparsai/Study/LittleDarwin/Cases/jgrapht-0.9.1/source/jgrapht-core/src/main/java/org/jgrapht/experimental/isomorphism/GraphOrdering.java: Recompile with -Xlint:unchecked for details.
[INFO] 
[INFO] --- maven-bundle-plugin:2.3.7:manifest (bundle-manifest) @ jgrapht-core ---
[INFO] 
[INFO] --- maven-resources-plugin:2.6:testResources (default-testResources) @ jgrapht-core ---
[INFO] Using 'UTF-8' encoding to copy filtered resources.
[INFO] Copying 1 resource
[INFO] 
[INFO] --- maven-compiler-plugin:3.1:testCompile (default-testCompile) @ jgrapht-core ---
[INFO] Nothing to compile - all classes are up to date
[INFO] 
[INFO] --- maven-surefire-plugin:2.12:test (default-test) @ jgrapht-core ---
[INFO] Surefire report directory: /Users/aliparsai/Study/LittleDarwin/Cases/jgrapht-0.9.1/source/jgrapht-core/target/surefire-reports

-------------------------------------------------------
 T E S T S
-------------------------------------------------------
Running org.jgrapht.alg.BellmanFordShortestPathTest
Tests run: 3, Failures: 0, Errors: 0, Skipped: 0, Time elapsed: 0.057 sec
Running org.jgrapht.alg.BiconnectivityInspectorTest
Tests run: 3, Failures: 0, Errors: 3, Skipped: 0, Time elapsed: 0.015 sec <<< FAILURE!
Running org.jgrapht.alg.BlockCutpointGraphTest
Tests run: 3, Failures: 0, Errors: 3, Skipped: 0, Time elapsed: 0.004 sec <<< FAILURE!
Running org.jgrapht.alg.BronKerboschCliqueFinderTest
Tests run: 2, Failures: 0, Errors: 0, Skipped: 0, Time elapsed: 0.002 sec
Running org.jgrapht.alg.ChromaticNumberTest
Tests run: 1, Failures: 0, Errors: 1, Skipped: 0, Time elapsed: 0.005 sec <<< FAILURE!
Running org.jgrapht.alg.CliqueMinimalSeparatorDecompositionTest
Tests run: 7, Failures: 0, Errors: 7, Skipped: 0, Time elapsed: 0.042 sec <<< FAILURE!
Running org.jgrapht.alg.ConnectivityInspectorTest
Tests run: 6, Failures: 0, Errors: 4, Skipped: 0, Time elapsed: 0.039 sec <<< FAILURE!
Running org.jgrapht.alg.cycle.DirectedSimpleCyclesTest
Tests run: 1, Failures: 0, Errors: 0, Skipped: 0, Time elapsed: 1.041 sec
Running org.jgrapht.alg.cycle.UndirectedCycleBaseTest
Tests run: 1, Failures: 0, Errors: 0, Skipped: 0, Time elapsed: 0.006 sec
Running org.jgrapht.alg.CycleDetectorTest
Tests run: 4, Failures: 0, Errors: 1, Skipped: 0, Time elapsed: 0.012 sec <<< FAILURE!
Running org.jgrapht.alg.DijkstraShortestPathTest
Tests run: 2, Failures: 0, Errors: 0, Skipped: 0, Time elapsed: 0.007 sec
Running org.jgrapht.alg.EdmondsBlossomShrinkingTest
Tests run: 1, Failures: 0, Errors: 0, Skipped: 0, Time elapsed: 0.002 sec
Running org.jgrapht.alg.EdmondsKarpMaximumFlowTest
Tests run: 2, Failures: 0, Errors: 2, Skipped: 0, Time elapsed: 0.008 sec <<< FAILURE!
Running org.jgrapht.alg.EulerianCircuitTest
Tests run: 1, Failures: 0, Errors: 1, Skipped: 0, Time elapsed: 0.004 sec <<< FAILURE!
Running org.jgrapht.alg.FloydWarshallShortestPathsTest
Tests run: 5, Failures: 0, Errors: 5, Skipped: 0, Time elapsed: 0.008 sec <<< FAILURE!
Running org.jgrapht.alg.HamiltonianCycleTest
Tests run: 1, Failures: 0, Errors: 1, Skipped: 0, Time elapsed: 0.004 sec <<< FAILURE!
Running org.jgrapht.alg.HopcroftKarpBipartiteMatchingTest
Tests run: 3, Failures: 0, Errors: 0, Skipped: 0, Time elapsed: 0.005 sec
Running org.jgrapht.alg.KShortestPathCostTest
Tests run: 4, Failures: 0, Errors: 4, Skipped: 0, Time elapsed: 0.015 sec <<< FAILURE!
Running org.jgrapht.alg.KShortestPathKValuesTest
Tests run: 2, Failures: 0, Errors: 2, Skipped: 0, Time elapsed: 0.002 sec <<< FAILURE!
Running org.jgrapht.alg.KSPDiscardsValidPathsTest
Tests run: 2, Failures: 0, Errors: 2, Skipped: 0, Time elapsed: 0.003 sec <<< FAILURE!
Running org.jgrapht.alg.KSPExampleTest
Tests run: 3, Failures: 0, Errors: 3, Skipped: 0, Time elapsed: 0.004 sec <<< FAILURE!
Running org.jgrapht.alg.KuhnMunkresMinimalWeightBipartitePerfectMatchingTest
Tests run: 10, Failures: 0, Errors: 10, Skipped: 0, Time elapsed: 0.024 sec <<< FAILURE!
Running org.jgrapht.alg.MinimumSpanningTreeTest
Tests run: 2, Failures: 0, Errors: 2, Skipped: 0, Time elapsed: 0.004 sec <<< FAILURE!
Running org.jgrapht.alg.MinSourceSinkCutTest
Tests run: 4, Failures: 0, Errors: 4, Skipped: 0, Time elapsed: 0.005 sec <<< FAILURE!
Running org.jgrapht.alg.NaiveLcaFinderTest
Tests run: 4, Failures: 0, Errors: 0, Skipped: 0, Time elapsed: 0.003 sec
Running org.jgrapht.alg.NeighborIndexTest
Tests run: 2, Failures: 0, Errors: 0, Skipped: 0, Time elapsed: 0.003 sec
Running org.jgrapht.alg.StoerWagnerMinimumCutTest
Tests run: 10, Failures: 0, Errors: 8, Skipped: 0, Time elapsed: 0.008 sec <<< FAILURE!
Running org.jgrapht.alg.TarjanLowestCommonAncestorTest
Tests run: 3, Failures: 0, Errors: 0, Skipped: 0, Time elapsed: 0.002 sec
Running org.jgrapht.alg.TransitiveClosureTest
Tests run: 2, Failures: 0, Errors: 2, Skipped: 0, Time elapsed: 0.003 sec <<< FAILURE!
Running org.jgrapht.alg.util.UnionFindTest
Tests run: 1, Failures: 0, Errors: 0, Skipped: 0, Time elapsed: 0.002 sec
Running org.jgrapht.alg.VertexCoversTest
Tests run: 2, Failures: 0, Errors: 2, Skipped: 0, Time elapsed: 0.031 sec <<< FAILURE!
Running org.jgrapht.experimental.alg.ColoringTest
Tests run: 2, Failures: 0, Errors: 0, Skipped: 0, Time elapsed: 0.003 sec
Running org.jgrapht.experimental.dag.DirectedAcyclicGraphTest
Tests run: 5, Failures: 0, Errors: 1, Skipped: 0, Time elapsed: 0.399 sec <<< FAILURE!
Running org.jgrapht.experimental.equivalence.EquivalenceGroupCreatorTest
Tests run: 4, Failures: 0, Errors: 0, Skipped: 0, Time elapsed: 0.007 sec
Running org.jgrapht.experimental.GraphReaderTest
Tests run: 2, Failures: 0, Errors: 2, Skipped: 0, Time elapsed: 0.006 sec <<< FAILURE!
Running org.jgrapht.experimental.isomorphism.IsomorphismInspectorTest
Tests run: 4, Failures: 0, Errors: 4, Skipped: 0, Time elapsed: 0.016 sec <<< FAILURE!
Running org.jgrapht.experimental.permutation.CompoundPermutationIterTest
Tests run: 1, Failures: 0, Errors: 0, Skipped: 0, Time elapsed: 0.109 sec
Running org.jgrapht.generate.GraphGeneratorTest
Tests run: 9, Failures: 0, Errors: 8, Skipped: 0, Time elapsed: 0.041 sec <<< FAILURE!
Running org.jgrapht.generate.RandomGraphGeneratorTest
Tests run: 3, Failures: 0, Errors: 2, Skipped: 0, Time elapsed: 0.008 sec <<< FAILURE!
Running org.jgrapht.graph.AsUndirectedGraphTest
Tests run: 7, Failures: 0, Errors: 1, Skipped: 0, Time elapsed: 0.004 sec <<< FAILURE!
Running org.jgrapht.graph.AsUnweightedGraphTest
Tests run: 2, Failures: 0, Errors: 0, Skipped: 0, Time elapsed: 0.002 sec
Running org.jgrapht.graph.AsWeightedGraphTest
Tests run: 1, Failures: 0, Errors: 0, Skipped: 0, Time elapsed: 0.002 sec
Running org.jgrapht.graph.CloneTest
Tests run: 2, Failures: 0, Errors: 1, Skipped: 0, Time elapsed: 0.006 sec <<< FAILURE!
Running org.jgrapht.graph.DefaultDirectedGraphTest
Tests run: 6, Failures: 0, Errors: 1, Skipped: 0, Time elapsed: 0.004 sec <<< FAILURE!
Running org.jgrapht.graph.EqualsAndHashCodeTest
Tests run: 6, Failures: 0, Errors: 6, Skipped: 0, Time elapsed: 0.008 sec <<< FAILURE!
Running org.jgrapht.graph.GenericGraphsTest
Tests run: 6, Failures: 0, Errors: 0, Skipped: 0, Time elapsed: 0.004 sec
Running org.jgrapht.graph.GraphBuilderTest
Tests run: 5, Failures: 0, Errors: 5, Skipped: 0, Time elapsed: 0.006 sec <<< FAILURE!
Running org.jgrapht.graph.ListenableGraphTest
Tests run: 3, Failures: 0, Errors: 0, Skipped: 0, Time elapsed: 0.004 sec
Running org.jgrapht.graph.SerializationTest
Tests run: 1, Failures: 0, Errors: 0, Skipped: 0, Time elapsed: 0.021 sec
Running org.jgrapht.graph.SimpleDirectedGraphTest
Tests run: 21, Failures: 1, Errors: 3, Skipped: 0, Time elapsed: 0.008 sec <<< FAILURE!
Running org.jgrapht.graph.SimpleGraphPathTest
Tests run: 6, Failures: 0, Errors: 0, Skipped: 0, Time elapsed: 0.004 sec
Running org.jgrapht.graph.SimpleIdentityDirectedGraphTest
Tests run: 21, Failures: 1, Errors: 3, Skipped: 0, Time elapsed: 0.016 sec <<< FAILURE!
Running org.jgrapht.graph.SubgraphTest
Tests run: 4, Failures: 0, Errors: 4, Skipped: 0, Time elapsed: 0.004 sec <<< FAILURE!
Running org.jgrapht.traverse.BreadthFirstIteratorTest
Tests run: 1, Failures: 0, Errors: 0, Skipped: 0, Time elapsed: 0.002 sec
Running org.jgrapht.traverse.ClosestFirstIteratorTest
Tests run: 3, Failures: 0, Errors: 0, Skipped: 0, Time elapsed: 0.003 sec
Running org.jgrapht.traverse.DepthFirstIteratorTest
Tests run: 2, Failures: 0, Errors: 0, Skipped: 0, Time elapsed: 0.003 sec
Running org.jgrapht.traverse.IgnoreDirectionTest
Tests run: 1, Failures: 0, Errors: 0, Skipped: 0, Time elapsed: 0 sec
Running org.jgrapht.traverse.TopologicalOrderIteratorTest
Tests run: 2, Failures: 0, Errors: 0, Skipped: 0, Time elapsed: 0.001 sec
Running org.jgrapht.util.FibonacciHeapTest
Tests run: 2, Failures: 0, Errors: 0, Skipped: 0, Time elapsed: 0.047 sec
Running org.jgrapht.util.PrefetchIteratorTest
Tests run: 2, Failures: 0, Errors: 0, Skipped: 0, Time elapsed: 0.002 sec

Results :

Failed tests:   testReversedView(org.jgrapht.graph.SimpleDirectedGraphTest): expected:<null> but was:<[(v1 : v2)]>
  testReversedView(org.jgrapht.graph.SimpleIdentityDirectedGraphTest): expected:<null> but was:<[(org.jgrapht.graph.SimpleIdentityDirectedGraphTest$Holder@1731a : org.jgrapht.graph.SimpleIdentityDirectedGraphTest$Holder@1731b)]>

Tests in error: 
  testBiconnected(org.jgrapht.alg.BiconnectivityInspectorTest)
  testLinearGraph(org.jgrapht.alg.BiconnectivityInspectorTest)
  testNotBiconnected(org.jgrapht.alg.BiconnectivityInspectorTest)
  testBiconnected(org.jgrapht.alg.BlockCutpointGraphTest)
  testLinearGraph(org.jgrapht.alg.BlockCutpointGraphTest)
  testNotBiconnected(org.jgrapht.alg.BlockCutpointGraphTest)
  testChromaticNumber(org.jgrapht.alg.ChromaticNumberTest)
  testSimpleGraph1(org.jgrapht.alg.CliqueMinimalSeparatorDecompositionTest)
  testPseudograph1(org.jgrapht.alg.CliqueMinimalSeparatorDecompositionTest)
  testSimpleGraph2(org.jgrapht.alg.CliqueMinimalSeparatorDecompositionTest)
  testBerry2010(org.jgrapht.alg.CliqueMinimalSeparatorDecompositionTest)
  testTarjan1985(org.jgrapht.alg.CliqueMinimalSeparatorDecompositionTest)
  testGraph1(org.jgrapht.alg.CliqueMinimalSeparatorDecompositionTest)
  testRandomGraphs(org.jgrapht.alg.CliqueMinimalSeparatorDecompositionTest)
  testIsGraphConnected(org.jgrapht.alg.ConnectivityInspectorTest)
  testStronglyConnected1(org.jgrapht.alg.ConnectivityInspectorTest)
  testStronglyConnected2(org.jgrapht.alg.ConnectivityInspectorTest)
  testStronglyConnected3(org.jgrapht.alg.ConnectivityInspectorTest)
  testVertexEquals(org.jgrapht.alg.CycleDetectorTest)
  testCornerCases(org.jgrapht.alg.EdmondsKarpMaximumFlowTest)
  testLogic(org.jgrapht.alg.EdmondsKarpMaximumFlowTest)
  testEulerianCircuit(org.jgrapht.alg.EulerianCircuitTest)
  testCompareWithDijkstra(org.jgrapht.alg.FloydWarshallShortestPathsTest)
  testDiameter(org.jgrapht.alg.FloydWarshallShortestPathsTest)
  testEmptyDiameter(org.jgrapht.alg.FloydWarshallShortestPathsTest)
  testEdgeLessDiameter(org.jgrapht.alg.FloydWarshallShortestPathsTest)
  testWeightedEdges(org.jgrapht.alg.FloydWarshallShortestPathsTest)
  testHamiltonianCycle(org.jgrapht.alg.HamiltonianCycleTest)
  testKShortestPathCompleteGraph4(org.jgrapht.alg.KShortestPathCostTest)
  testPicture1Graph(org.jgrapht.alg.KShortestPathCostTest)
  testShortestPathsInIncreasingOrder(org.jgrapht.alg.KShortestPathCostTest)
  testShortestPathsWeightsWithMaxSizeIncreases(org.jgrapht.alg.KShortestPathCostTest)
  testMaxSizeValueCompleteGraph6(org.jgrapht.alg.KShortestPathKValuesTest)
  testNbReturnedPaths(org.jgrapht.alg.KShortestPathKValuesTest)
  testNot3connectedGraph(org.jgrapht.alg.KSPDiscardsValidPathsTest)
  testBrunoMaoili(org.jgrapht.alg.KSPDiscardsValidPathsTest)
  testFourReturnedPathsJGraphT(org.jgrapht.alg.KSPExampleTest)
  testThreeReturnedPathsJGraphT(org.jgrapht.alg.KSPExampleTest)
  testTwoReturnedPathsJGraphT(org.jgrapht.alg.KSPExampleTest)
  test3x3SimpleAssignmentTask(org.jgrapht.alg.KuhnMunkresMinimalWeightBipartitePerfectMatchingTest)
  test3x3SimpleAssignmentTaskNo2(org.jgrapht.alg.KuhnMunkresMinimalWeightBipartitePerfectMatchingTest)
  test5x5AssignmentTask(org.jgrapht.alg.KuhnMunkresMinimalWeightBipartitePerfectMatchingTest)
  test5x5InvertedAssignmentTask(org.jgrapht.alg.KuhnMunkresMinimalWeightBipartitePerfectMatchingTest)
  test6x6DegeneratedAssignmentTask(org.jgrapht.alg.KuhnMunkresMinimalWeightBipartitePerfectMatchingTest)
  test6x6DegeneratedAssignmentTaskNo2(org.jgrapht.alg.KuhnMunkresMinimalWeightBipartitePerfectMatchingTest)
  test5x5DegeneratedAssignmentTask(org.jgrapht.alg.KuhnMunkresMinimalWeightBipartitePerfectMatchingTest)
  test8x8BulkyAssignmentTask(org.jgrapht.alg.KuhnMunkresMinimalWeightBipartitePerfectMatchingTest)
  test21x21BulkyAssignmentTask(org.jgrapht.alg.KuhnMunkresMinimalWeightBipartitePerfectMatchingTest)
  test20x20BulkyAssignmentTask(org.jgrapht.alg.KuhnMunkresMinimalWeightBipartitePerfectMatchingTest)
  testKruskal(org.jgrapht.alg.MinimumSpanningTreeTest)
  testPrim(org.jgrapht.alg.MinimumSpanningTreeTest)
  testRealGraph(org.jgrapht.alg.MinSourceSinkCutTest)
  testRealGraph2(org.jgrapht.alg.MinSourceSinkCutTest)
  testGraphWithOneEdge(org.jgrapht.alg.MinSourceSinkCutTest)
  testDisconnectedGraph(org.jgrapht.alg.MinSourceSinkCutTest)
  testMinCut14(org.jgrapht.alg.StoerWagnerMinimumCutTest)
  testMinCutDisconnected(org.jgrapht.alg.StoerWagnerMinimumCutTest)
  testMinCut0Weight(org.jgrapht.alg.StoerWagnerMinimumCutTest)
  testMinCutSmallWeight(org.jgrapht.alg.StoerWagnerMinimumCutTest)
  testMinCutMultigraph(org.jgrapht.alg.StoerWagnerMinimumCutTest)
  testMinCutUnweighted(org.jgrapht.alg.StoerWagnerMinimumCutTest)
  testMinCutDoubleton(org.jgrapht.alg.StoerWagnerMinimumCutTest)
  testMinCutSmall(org.jgrapht.alg.StoerWagnerMinimumCutTest)
  testLinearGraph(org.jgrapht.alg.TransitiveClosureTest)
  testRingGraph(org.jgrapht.alg.TransitiveClosureTest)
  testFindGreedyCover(org.jgrapht.alg.VertexCoversTest)
  testFind2ApproximationCover(org.jgrapht.alg.VertexCoversTest)
  testCycleDetectionInRandomGraphBuild(org.jgrapht.experimental.dag.DirectedAcyclicGraphTest)
  testGraphReader(org.jgrapht.experimental.GraphReaderTest)
  testGraphReaderWeighted(org.jgrapht.experimental.GraphReaderTest)
  testWheelGraphAddRemoveParts(org.jgrapht.experimental.isomorphism.IsomorphismInspectorTest)
  testLinear4vertexIsomorphicGraph(org.jgrapht.experimental.isomorphism.IsomorphismInspectorTest)
  testLinear4vertexNonIsomorphicCauseOfVertexEqGroup(org.jgrapht.experimental.isomorphism.IsomorphismInspectorTest)
  testEdgeComparator(org.jgrapht.experimental.isomorphism.IsomorphismInspectorTest)
  testEmptyGraphGenerator(org.jgrapht.generate.GraphGeneratorTest)
  testLinearGraphGenerator(org.jgrapht.generate.GraphGeneratorTest)
  testRingGraphGenerator(org.jgrapht.generate.GraphGeneratorTest)
  testCompleteGraphGenerator(org.jgrapht.generate.GraphGeneratorTest)
  testCompleteBipartiteGraphGenerator(org.jgrapht.generate.GraphGeneratorTest)
  testHyperCubeGraphGenerator(org.jgrapht.generate.GraphGeneratorTest)
  testStarGraphGenerator(org.jgrapht.generate.GraphGeneratorTest)
  testGridGraphGenerator(org.jgrapht.generate.GraphGeneratorTest)
  testGenerateDirectedGraph(org.jgrapht.generate.RandomGraphGeneratorTest)
  testGenerateListenableUndirectedGraph(org.jgrapht.generate.RandomGraphGeneratorTest)
  testAddEdge(org.jgrapht.graph.AsUndirectedGraphTest)
  testCloneSpecificsBug(org.jgrapht.graph.CloneTest)
  testEdgeOrderDeterminism(org.jgrapht.graph.DefaultDirectedGraphTest)
  testDefaultDirectedGraph(org.jgrapht.graph.EqualsAndHashCodeTest)
  testSimpleGraph(org.jgrapht.graph.EqualsAndHashCodeTest)
  testGraphsWithNonIntrusiveEdge(org.jgrapht.graph.EqualsAndHashCodeTest)
  testPseudograph(org.jgrapht.graph.EqualsAndHashCodeTest)
  testGrapshWithCustomEdges(org.jgrapht.graph.EqualsAndHashCodeTest)
  testAsWeightedGraphs(org.jgrapht.graph.EqualsAndHashCodeTest)
  testAddEdge(org.jgrapht.graph.GraphBuilderTest)
  testAddVertex(org.jgrapht.graph.GraphBuilderTest)
  testRemoveEdge(org.jgrapht.graph.GraphBuilderTest)
  testRemoveVertex(org.jgrapht.graph.GraphBuilderTest)
  testAddGraph(org.jgrapht.graph.GraphBuilderTest)
  testRemoveVertex(org.jgrapht.graph.SimpleDirectedGraphTest)
  testRemoveEdgeEdge(org.jgrapht.graph.SimpleDirectedGraphTest)
  testRemoveAllEdgesObjectObject(org.jgrapht.graph.SimpleDirectedGraphTest)
  testRemoveVertex(org.jgrapht.graph.SimpleIdentityDirectedGraphTest)
  testRemoveEdgeEdge(org.jgrapht.graph.SimpleIdentityDirectedGraphTest)
  testRemoveAllEdgesObjectObject(org.jgrapht.graph.SimpleIdentityDirectedGraphTest)
  testInducedSubgraphListener(org.jgrapht.graph.SubgraphTest)
  testSubgraph(org.jgrapht.graph.SubgraphTest)
  testSubgraphListener(org.jgrapht.graph.SubgraphTest)
  testInducedSubgraphUnderlyingEdgeAddition(org.jgrapht.graph.SubgraphTest)

Tests run: 231, Failures: 2, Errors: 108, Skipped: 0

[INFO] ------------------------------------------------------------------------
[INFO] BUILD FAILURE
[INFO] ------------------------------------------------------------------------
[INFO] Total time: 7.385 s
[INFO] Finished at: 2015-10-06T22:31:19+02:00
[INFO] Final Memory: 20M/288M
[INFO] ------------------------------------------------------------------------
[ERROR] Failed to execute goal org.apache.maven.plugins:maven-surefire-plugin:2.12:test (default-test) on project jgrapht-core: There are test failures.
[ERROR] 
[ERROR] Please refer to /Users/aliparsai/Study/LittleDarwin/Cases/jgrapht-0.9.1/source/jgrapht-core/target/surefire-reports for the individual test results.
[ERROR] -> [Help 1]
[ERROR] 
[ERROR] To see the full stack trace of the errors, re-run Maven with the -e switch.
[ERROR] Re-run Maven using the -X switch to enable full debug logging.
[ERROR] 
[ERROR] For more information about the errors and possible solutions, please read the following articles:
[ERROR] [Help 1] http://cwiki.apache.org/confluence/display/MAVEN/MojoFailureException
