Buildfile: /Users/aliparsai/Study/LittleDarwin/Cases/jdepend-2.9.1/build.xml

clean:
   [delete] Deleting directory /Users/aliparsai/Study/LittleDarwin/Cases/jdepend-2.9.1/build

prepare:
    [mkdir] Created dir: /Users/aliparsai/Study/LittleDarwin/Cases/jdepend-2.9.1/build

compile:
    [javac] /Users/aliparsai/Study/LittleDarwin/Cases/jdepend-2.9.1/build.xml:43: warning: 'includeantruntime' was not set, defaulting to build.sysclasspath=last; set to false for repeatable builds
    [javac] Compiling 22 source files to /Users/aliparsai/Study/LittleDarwin/Cases/jdepend-2.9.1/build
    [javac] Note: /Users/aliparsai/Study/LittleDarwin/Cases/jdepend-2.9.1/src/jdepend/swingui/JDepend.java uses or overrides a deprecated API.
    [javac] Note: Recompile with -Xlint:deprecation for details.
    [javac] Note: Some input files use unchecked or unsafe operations.
    [javac] Note: Recompile with -Xlint:unchecked for details.

compile-tests:
    [javac] /Users/aliparsai/Study/LittleDarwin/Cases/jdepend-2.9.1/build.xml:62: warning: 'includeantruntime' was not set, defaulting to build.sysclasspath=last; set to false for repeatable builds
    [javac] Compiling 16 source files to /Users/aliparsai/Study/LittleDarwin/Cases/jdepend-2.9.1/build
    [javac] Note: /Users/aliparsai/Study/LittleDarwin/Cases/jdepend-2.9.1/test/jdepend/framework/FilterTest.java uses unchecked or unsafe operations.
    [javac] Note: Recompile with -Xlint:unchecked for details.

test:
    [junit] Testsuite: jdepend.framework.AllTests
    [junit] Tests run: 7, Failures: 1, Errors: 5, Time elapsed: 0.031 sec
    [junit] ------------- Standard Error -----------------
    [junit] 
    [junit] Invalid class file: null
    [junit] 
    [junit] Invalid class file: null
    [junit] 
    [junit] Invalid class file: null
    [junit] 
    [junit] Invalid class file: null
    [junit] 
    [junit] Invalid class file: null
    [junit] 
    [junit] Invalid class file: null
    [junit] 
    [junit] Invalid class file: null
    [junit] 
    [junit] Invalid class file: null
    [junit] 
    [junit] Invalid class file: null
    [junit] 
    [junit] Invalid class file: null
    [junit] 
    [junit] Invalid class file: null
    [junit] 
    [junit] Invalid class file: null
    [junit] 
    [junit] Invalid class file: null
    [junit] 
    [junit] Invalid class file: null
    [junit] 
    [junit] Invalid class file: null
    [junit] 
    [junit] Invalid class file: null
    [junit] 
    [junit] Invalid class file: null
    [junit] 
    [junit] Invalid class file: null
    [junit] 
    [junit] Invalid class file: null
    [junit] 
    [junit] Invalid class file: null
    [junit] 
    [junit] Invalid class file: null
    [junit] 
    [junit] Invalid class file: null
    [junit] 
    [junit] Invalid class file: null
    [junit] 
    [junit] Invalid class file: null
    [junit] 
    [junit] Invalid class file: null
    [junit] 
    [junit] Invalid class file: null
    [junit] 
    [junit] Invalid class file: null
    [junit] 
    [junit] Invalid class file: null
    [junit] 
    [junit] Invalid class file: null
    [junit] 
    [junit] Invalid class file: null
    [junit] 
    [junit] Invalid class file: null
    [junit] 
    [junit] Invalid class file: null
    [junit] 
    [junit] Invalid class file: null
    [junit] 
    [junit] Invalid class file: null
    [junit] 
    [junit] Invalid class file: null
    [junit] 
    [junit] Invalid class file: null
    [junit] 
    [junit] Invalid class file: null
    [junit] 
    [junit] Invalid class file: null
    [junit] 
    [junit] Invalid class file: null
    [junit] ------------- ---------------- ---------------
    [junit] 
    [junit] Testcase: testInvalidClassFile took 0.006 sec
    [junit] Testcase: testPackageClass took 0.001 sec
    [junit] 	Caused an ERROR
    [junit] Invalid class file: /Users/aliparsai/Study/LittleDarwin/Cases/jdepend-2.9.1/build/jdepend/framework/ExamplePackageClass.class
    [junit] java.io.IOException: Invalid class file: /Users/aliparsai/Study/LittleDarwin/Cases/jdepend-2.9.1/build/jdepend/framework/ExamplePackageClass.class
    [junit] 	at jdepend.framework.ClassFileParser.parseMagic(ClassFileParser.java:75)
    [junit] 	at jdepend.framework.ClassFileParser.parse(ClassFileParser.java:60)
    [junit] 	at jdepend.framework.ClassFileParser.parse(ClassFileParser.java:54)
    [junit] 	at jdepend.framework.ClassFileParserTest.testPackageClass(ClassFileParserTest.java:148)
    [junit] 
    [junit] Testcase: testAbstractClass took 0 sec
    [junit] 	Caused an ERROR
    [junit] Invalid class file: /Users/aliparsai/Study/LittleDarwin/Cases/jdepend-2.9.1/build/jdepend/framework/ExampleAbstractClass.class
    [junit] java.io.IOException: Invalid class file: /Users/aliparsai/Study/LittleDarwin/Cases/jdepend-2.9.1/build/jdepend/framework/ExampleAbstractClass.class
    [junit] 	at jdepend.framework.ClassFileParser.parseMagic(ClassFileParser.java:75)
    [junit] 	at jdepend.framework.ClassFileParser.parse(ClassFileParser.java:60)
    [junit] 	at jdepend.framework.ClassFileParser.parse(ClassFileParser.java:54)
    [junit] 	at jdepend.framework.ClassFileParserTest.testAbstractClass(ClassFileParserTest.java:75)
    [junit] 
    [junit] Testcase: testInnerClass took 0 sec
    [junit] 	Caused an ERROR
    [junit] Invalid class file: /Users/aliparsai/Study/LittleDarwin/Cases/jdepend-2.9.1/build/jdepend/framework/ExampleConcreteClass$ExampleInnerClass.class
    [junit] java.io.IOException: Invalid class file: /Users/aliparsai/Study/LittleDarwin/Cases/jdepend-2.9.1/build/jdepend/framework/ExampleConcreteClass$ExampleInnerClass.class
    [junit] 	at jdepend.framework.ClassFileParser.parseMagic(ClassFileParser.java:75)
    [junit] 	at jdepend.framework.ClassFileParser.parse(ClassFileParser.java:60)
    [junit] 	at jdepend.framework.ClassFileParser.parse(ClassFileParser.java:54)
    [junit] 	at jdepend.framework.ClassFileParserTest.testInnerClass(ClassFileParserTest.java:127)
    [junit] 
    [junit] Testcase: testConcreteClass took 0 sec
    [junit] 	Caused an ERROR
    [junit] Invalid class file: /Users/aliparsai/Study/LittleDarwin/Cases/jdepend-2.9.1/build/jdepend/framework/ExampleConcreteClass.class
    [junit] java.io.IOException: Invalid class file: /Users/aliparsai/Study/LittleDarwin/Cases/jdepend-2.9.1/build/jdepend/framework/ExampleConcreteClass.class
    [junit] 	at jdepend.framework.ClassFileParser.parseMagic(ClassFileParser.java:75)
    [junit] 	at jdepend.framework.ClassFileParser.parse(ClassFileParser.java:60)
    [junit] 	at jdepend.framework.ClassFileParser.parse(ClassFileParser.java:54)
    [junit] 	at jdepend.framework.ClassFileParserTest.testConcreteClass(ClassFileParserTest.java:100)
    [junit] 
    [junit] Testcase: testInterfaceClass took 0 sec
    [junit] 	Caused an ERROR
    [junit] Invalid class file: /Users/aliparsai/Study/LittleDarwin/Cases/jdepend-2.9.1/build/jdepend/framework/ExampleInterface.class
    [junit] java.io.IOException: Invalid class file: /Users/aliparsai/Study/LittleDarwin/Cases/jdepend-2.9.1/build/jdepend/framework/ExampleInterface.class
    [junit] 	at jdepend.framework.ClassFileParser.parseMagic(ClassFileParser.java:75)
    [junit] 	at jdepend.framework.ClassFileParser.parse(ClassFileParser.java:60)
    [junit] 	at jdepend.framework.ClassFileParser.parse(ClassFileParser.java:54)
    [junit] 	at jdepend.framework.ClassFileParserTest.testInterfaceClass(ClassFileParserTest.java:51)
    [junit] 
    [junit] Testcase: testJDependComponents took 0.013 sec
    [junit] 	FAILED
    [junit] expected:<4> but was:<0>
    [junit] junit.framework.AssertionFailedError: expected:<4> but was:<0>
    [junit] 	at jdepend.framework.ComponentTest.testJDependComponents(ComponentTest.java:45)
    [junit] 

BUILD FAILED
/Users/aliparsai/Study/LittleDarwin/Cases/jdepend-2.9.1/build.xml:70: Test jdepend.framework.AllTests failed

Total time: 2 seconds
