Buildfile: /Users/aliparsai/Study/LittleDarwin/Cases/jdepend-2.9.1/build.xml

clean:
   [delete] Deleting directory /Users/aliparsai/Study/LittleDarwin/Cases/jdepend-2.9.1/build

prepare:
    [mkdir] Created dir: /Users/aliparsai/Study/LittleDarwin/Cases/jdepend-2.9.1/build

compile:
    [javac] /Users/aliparsai/Study/LittleDarwin/Cases/jdepend-2.9.1/build.xml:43: warning: 'includeantruntime' was not set, defaulting to build.sysclasspath=last; set to false for repeatable builds
    [javac] Compiling 22 source files to /Users/aliparsai/Study/LittleDarwin/Cases/jdepend-2.9.1/build
    [javac] Note: /Users/aliparsai/Study/LittleDarwin/Cases/jdepend-2.9.1/src/jdepend/swingui/JDepend.java uses or overrides a deprecated API.
    [javac] Note: Recompile with -Xlint:deprecation for details.
    [javac] Note: Some input files use unchecked or unsafe operations.
    [javac] Note: Recompile with -Xlint:unchecked for details.

compile-tests:
    [javac] /Users/aliparsai/Study/LittleDarwin/Cases/jdepend-2.9.1/build.xml:62: warning: 'includeantruntime' was not set, defaulting to build.sysclasspath=last; set to false for repeatable builds
    [javac] Compiling 16 source files to /Users/aliparsai/Study/LittleDarwin/Cases/jdepend-2.9.1/build
    [javac] Note: /Users/aliparsai/Study/LittleDarwin/Cases/jdepend-2.9.1/test/jdepend/framework/FilterTest.java uses unchecked or unsafe operations.
    [javac] Note: Recompile with -Xlint:unchecked for details.

test:
    [junit] Testsuite: jdepend.framework.AllTests
    [junit] Tests run: 7, Failures: 1, Errors: 5, Time elapsed: 0.031 sec
    [junit] ------------- Standard Error -----------------
    [junit] 
    [junit] Illegal constant pool index : 15626
    [junit] 
    [junit] Illegal constant pool index : 5120
    [junit] 
    [junit] Illegal constant pool index : 14337
    [junit] 
    [junit] Illegal constant pool index : 15616
    [junit] 
    [junit] Illegal constant pool index : 5888
    [junit] 
    [junit] Illegal constant pool index : 12544
    [junit] 
    [junit] Illegal constant pool index : 6144
    [junit] 
    [junit] Illegal constant pool index : 8704
    [junit] 
    [junit] Illegal constant pool index : 6912
    [junit] 
    [junit] Illegal constant pool index : 768
    [junit] 
    [junit] Illegal constant pool index : 2816
    [junit] 
    [junit] Illegal constant pool index : 4103
    [junit] 
    [junit] Illegal constant pool index : 768
    [junit] 
    [junit] Illegal constant pool index : 10752
    [junit] 
    [junit] Illegal constant pool index : 11520
    [junit] 
    [junit] Illegal constant pool index : 10752
    [junit] 
    [junit] Illegal constant pool index : 10240
    [junit] 
    [junit] Illegal constant pool index : 11520
    [junit] 
    [junit] Illegal constant pool index : 4864
    [junit] 
    [junit] Illegal constant pool index : 30474
    [junit] 
    [junit] Illegal constant pool index : 5120
    [junit] 
    [junit] Illegal constant pool index : 40714
    [junit] 
    [junit] Illegal constant pool index : 6400
    [junit] 
    [junit] Illegal constant pool index : 14592
    [junit] 
    [junit] Illegal constant pool index : 2304
    [junit] 
    [junit] Illegal constant pool index : 14602
    [junit] 
    [junit] Illegal constant pool index : 1799
    [junit] 
    [junit] Illegal constant pool index : 9472
    [junit] 
    [junit] Illegal constant pool index : 10240
    [junit] 
    [junit] Illegal constant pool index : 12800
    [junit] 
    [junit] Illegal constant pool index : 4352
    [junit] 
    [junit] Illegal constant pool index : 20487
    [junit] 
    [junit] Illegal constant pool index : 4096
    [junit] 
    [junit] Illegal constant pool index : 4608
    [junit] 
    [junit] Illegal constant pool index : 51457
    [junit] 
    [junit] Illegal constant pool index : 15616
    [junit] 
    [junit] Illegal constant pool index : 2560
    [junit] 
    [junit] Illegal constant pool index : 12297
    [junit] 
    [junit] Illegal constant pool index : 33289
    [junit] ------------- ---------------- ---------------
    [junit] 
    [junit] Testcase: testInvalidClassFile took 0.003 sec
    [junit] Testcase: testPackageClass took 0.001 sec
    [junit] 	Caused an ERROR
    [junit] Illegal constant pool index : 768
    [junit] java.io.IOException: Illegal constant pool index : 768
    [junit] 	at jdepend.framework.ClassFileParser.getConstantPoolEntry(ClassFileParser.java:185)
    [junit] 	at jdepend.framework.ClassFileParser.getClassConstantName(ClassFileParser.java:193)
    [junit] 	at jdepend.framework.ClassFileParser.parseClassName(ClassFileParser.java:94)
    [junit] 	at jdepend.framework.ClassFileParser.parse(ClassFileParser.java:65)
    [junit] 	at jdepend.framework.ClassFileParser.parse(ClassFileParser.java:54)
    [junit] 	at jdepend.framework.ClassFileParserTest.testPackageClass(ClassFileParserTest.java:148)
    [junit] 
    [junit] Testcase: testAbstractClass took 0.001 sec
    [junit] 	Caused an ERROR
    [junit] Illegal constant pool index : 768
    [junit] java.io.IOException: Illegal constant pool index : 768
    [junit] 	at jdepend.framework.ClassFileParser.getConstantPoolEntry(ClassFileParser.java:185)
    [junit] 	at jdepend.framework.ClassFileParser.getClassConstantName(ClassFileParser.java:193)
    [junit] 	at jdepend.framework.ClassFileParser.parseClassName(ClassFileParser.java:94)
    [junit] 	at jdepend.framework.ClassFileParser.parse(ClassFileParser.java:65)
    [junit] 	at jdepend.framework.ClassFileParser.parse(ClassFileParser.java:54)
    [junit] 	at jdepend.framework.ClassFileParserTest.testAbstractClass(ClassFileParserTest.java:75)
    [junit] 
    [junit] Testcase: testInnerClass took 0 sec
    [junit] 	Caused an ERROR
    [junit] Illegal constant pool index : 768
    [junit] java.io.IOException: Illegal constant pool index : 768
    [junit] 	at jdepend.framework.ClassFileParser.getConstantPoolEntry(ClassFileParser.java:185)
    [junit] 	at jdepend.framework.ClassFileParser.getClassConstantName(ClassFileParser.java:193)
    [junit] 	at jdepend.framework.ClassFileParser.parseClassName(ClassFileParser.java:94)
    [junit] 	at jdepend.framework.ClassFileParser.parse(ClassFileParser.java:65)
    [junit] 	at jdepend.framework.ClassFileParser.parse(ClassFileParser.java:54)
    [junit] 	at jdepend.framework.ClassFileParserTest.testInnerClass(ClassFileParserTest.java:127)
    [junit] 
    [junit] Testcase: testConcreteClass took 0 sec
    [junit] 	Caused an ERROR
    [junit] Illegal constant pool index : 2816
    [junit] java.io.IOException: Illegal constant pool index : 2816
    [junit] 	at jdepend.framework.ClassFileParser.getConstantPoolEntry(ClassFileParser.java:185)
    [junit] 	at jdepend.framework.ClassFileParser.getClassConstantName(ClassFileParser.java:193)
    [junit] 	at jdepend.framework.ClassFileParser.parseClassName(ClassFileParser.java:94)
    [junit] 	at jdepend.framework.ClassFileParser.parse(ClassFileParser.java:65)
    [junit] 	at jdepend.framework.ClassFileParser.parse(ClassFileParser.java:54)
    [junit] 	at jdepend.framework.ClassFileParserTest.testConcreteClass(ClassFileParserTest.java:100)
    [junit] 
    [junit] Testcase: testInterfaceClass took 0 sec
    [junit] 	Caused an ERROR
    [junit] Illegal constant pool index : 4103
    [junit] java.io.IOException: Illegal constant pool index : 4103
    [junit] 	at jdepend.framework.ClassFileParser.getConstantPoolEntry(ClassFileParser.java:185)
    [junit] 	at jdepend.framework.ClassFileParser.getClassConstantName(ClassFileParser.java:193)
    [junit] 	at jdepend.framework.ClassFileParser.parseClassName(ClassFileParser.java:94)
    [junit] 	at jdepend.framework.ClassFileParser.parse(ClassFileParser.java:65)
    [junit] 	at jdepend.framework.ClassFileParser.parse(ClassFileParser.java:54)
    [junit] 	at jdepend.framework.ClassFileParserTest.testInterfaceClass(ClassFileParserTest.java:51)
    [junit] 
    [junit] Testcase: testJDependComponents took 0.015 sec
    [junit] 	FAILED
    [junit] expected:<4> but was:<0>
    [junit] junit.framework.AssertionFailedError: expected:<4> but was:<0>
    [junit] 	at jdepend.framework.ComponentTest.testJDependComponents(ComponentTest.java:45)
    [junit] 

BUILD FAILED
/Users/aliparsai/Study/LittleDarwin/Cases/jdepend-2.9.1/build.xml:70: Test jdepend.framework.AllTests failed

Total time: 2 seconds
