Buildfile: /Users/aliparsai/Study/LittleDarwin/Cases/jdepend-2.9.1/build.xml

clean:
   [delete] Deleting directory /Users/aliparsai/Study/LittleDarwin/Cases/jdepend-2.9.1/build

prepare:
    [mkdir] Created dir: /Users/aliparsai/Study/LittleDarwin/Cases/jdepend-2.9.1/build

compile:
    [javac] /Users/aliparsai/Study/LittleDarwin/Cases/jdepend-2.9.1/build.xml:43: warning: 'includeantruntime' was not set, defaulting to build.sysclasspath=last; set to false for repeatable builds
    [javac] Compiling 22 source files to /Users/aliparsai/Study/LittleDarwin/Cases/jdepend-2.9.1/build
    [javac] Note: /Users/aliparsai/Study/LittleDarwin/Cases/jdepend-2.9.1/src/jdepend/swingui/JDepend.java uses or overrides a deprecated API.
    [javac] Note: Recompile with -Xlint:deprecation for details.
    [javac] Note: Some input files use unchecked or unsafe operations.
    [javac] Note: Recompile with -Xlint:unchecked for details.

compile-tests:
    [javac] /Users/aliparsai/Study/LittleDarwin/Cases/jdepend-2.9.1/build.xml:62: warning: 'includeantruntime' was not set, defaulting to build.sysclasspath=last; set to false for repeatable builds
    [javac] Compiling 16 source files to /Users/aliparsai/Study/LittleDarwin/Cases/jdepend-2.9.1/build
    [javac] Note: /Users/aliparsai/Study/LittleDarwin/Cases/jdepend-2.9.1/test/jdepend/framework/FilterTest.java uses unchecked or unsafe operations.
    [javac] Note: Recompile with -Xlint:unchecked for details.

test:
    [junit] Testsuite: jdepend.framework.AllTests
    [junit] Tests run: 7, Failures: 1, Errors: 5, Time elapsed: 0.039 sec
    [junit] ------------- Standard Error -----------------
    [junit] 
    [junit] Illegal constant pool index : 3411
    [junit] 
    [junit] Illegal constant pool index : 1121
    [junit] 
    [junit] Illegal constant pool index : 3937
    [junit] 
    [junit] Illegal constant pool index : 3700
    [junit] 
    [junit] Illegal constant pool index : 4193
    [junit] 
    [junit] Illegal constant pool index : 16128
    [junit] 
    [junit] Illegal constant pool index : 2405
    [junit] 
    [junit] Illegal constant pool index : 5196
    [junit] 
    [junit] Illegal constant pool index : 16680
    [junit] 
    [junit] Illegal constant pool index : 6220
    [junit] 
    [junit] Illegal constant pool index : 6952
    [junit] 
    [junit] Illegal constant pool index : 356
    [junit] 
    [junit] Illegal constant pool index : 1140
    [junit] 
    [junit] Illegal constant pool index : 12032
    [junit] 
    [junit] Illegal constant pool index : 329
    [junit] 
    [junit] Illegal constant pool index : 1908
    [junit] 
    [junit] Illegal constant pool index : 3910
    [junit] 
    [junit] Illegal constant pool index : 7796
    [junit] 
    [junit] Illegal constant pool index : 4967
    [junit] 
    [junit] Illegal constant pool index : 1893
    [junit] 
    [junit] Illegal constant pool index : 8744
    [junit] 
    [junit] Illegal constant pool index : 2156
    [junit] 
    [junit] Illegal constant pool index : 5160
    [junit] 
    [junit] Illegal constant pool index : 3917
    [junit] 
    [junit] Illegal constant pool index : 624
    [junit] 
    [junit] Illegal constant pool index : 3411
    [junit] 
    [junit] Illegal constant pool index : 2643
    [junit] 
    [junit] Illegal constant pool index : 1126
    [junit] 
    [junit] Illegal constant pool index : 12800
    [junit] 
    [junit] Illegal constant pool index : 7500
    [junit] 
    [junit] Illegal constant pool index : 2643
    [junit] 
    [junit] Illegal constant pool index : 3908
    [junit] 
    [junit] Illegal constant pool index : 4982
    [junit] 
    [junit] Illegal constant pool index : 5160
    [junit] 
    [junit] Illegal constant pool index : 6407
    [junit] 
    [junit] Illegal constant pool index : 326
    [junit] 
    [junit] Illegal constant pool index : 2643
    [junit] 
    [junit] Illegal constant pool index : 4464
    [junit] 
    [junit] Illegal constant pool index : 4955
    [junit] ------------- ---------------- ---------------
    [junit] 
    [junit] Testcase: testInvalidClassFile took 0.004 sec
    [junit] Testcase: testPackageClass took 0.001 sec
    [junit] 	Caused an ERROR
    [junit] Illegal constant pool index : 1140
    [junit] java.io.IOException: Illegal constant pool index : 1140
    [junit] 	at jdepend.framework.ClassFileParser.getConstantPoolEntry(ClassFileParser.java:185)
    [junit] 	at jdepend.framework.ClassFileParser.getClassConstantName(ClassFileParser.java:193)
    [junit] 	at jdepend.framework.ClassFileParser.parseClassName(ClassFileParser.java:94)
    [junit] 	at jdepend.framework.ClassFileParser.parse(ClassFileParser.java:65)
    [junit] 	at jdepend.framework.ClassFileParser.parse(ClassFileParser.java:54)
    [junit] 	at jdepend.framework.ClassFileParserTest.testPackageClass(ClassFileParserTest.java:148)
    [junit] 
    [junit] Testcase: testAbstractClass took 0.001 sec
    [junit] 	Caused an ERROR
    [junit] Illegal constant pool index : 6220
    [junit] java.io.IOException: Illegal constant pool index : 6220
    [junit] 	at jdepend.framework.ClassFileParser.getConstantPoolEntry(ClassFileParser.java:185)
    [junit] 	at jdepend.framework.ClassFileParser.getClassConstantName(ClassFileParser.java:193)
    [junit] 	at jdepend.framework.ClassFileParser.parseClassName(ClassFileParser.java:94)
    [junit] 	at jdepend.framework.ClassFileParser.parse(ClassFileParser.java:65)
    [junit] 	at jdepend.framework.ClassFileParser.parse(ClassFileParser.java:54)
    [junit] 	at jdepend.framework.ClassFileParserTest.testAbstractClass(ClassFileParserTest.java:75)
    [junit] 
    [junit] Testcase: testInnerClass took 0 sec
    [junit] 	Caused an ERROR
    [junit] Illegal constant pool index : 4421
    [junit] java.io.IOException: Illegal constant pool index : 4421
    [junit] 	at jdepend.framework.ClassFileParser.getConstantPoolEntry(ClassFileParser.java:185)
    [junit] 	at jdepend.framework.ClassFileParser.getClassConstantName(ClassFileParser.java:193)
    [junit] 	at jdepend.framework.ClassFileParser.parseClassName(ClassFileParser.java:94)
    [junit] 	at jdepend.framework.ClassFileParser.parse(ClassFileParser.java:65)
    [junit] 	at jdepend.framework.ClassFileParser.parse(ClassFileParser.java:54)
    [junit] 	at jdepend.framework.ClassFileParserTest.testInnerClass(ClassFileParserTest.java:127)
    [junit] 
    [junit] Testcase: testConcreteClass took 0 sec
    [junit] 	Caused an ERROR
    [junit] Illegal constant pool index : 6952
    [junit] java.io.IOException: Illegal constant pool index : 6952
    [junit] 	at jdepend.framework.ClassFileParser.getConstantPoolEntry(ClassFileParser.java:185)
    [junit] 	at jdepend.framework.ClassFileParser.getClassConstantName(ClassFileParser.java:193)
    [junit] 	at jdepend.framework.ClassFileParser.parseClassName(ClassFileParser.java:94)
    [junit] 	at jdepend.framework.ClassFileParser.parse(ClassFileParser.java:65)
    [junit] 	at jdepend.framework.ClassFileParser.parse(ClassFileParser.java:54)
    [junit] 	at jdepend.framework.ClassFileParserTest.testConcreteClass(ClassFileParserTest.java:100)
    [junit] 
    [junit] Testcase: testInterfaceClass took 0 sec
    [junit] 	Caused an ERROR
    [junit] Illegal constant pool index : 356
    [junit] java.io.IOException: Illegal constant pool index : 356
    [junit] 	at jdepend.framework.ClassFileParser.getConstantPoolEntry(ClassFileParser.java:185)
    [junit] 	at jdepend.framework.ClassFileParser.getClassConstantName(ClassFileParser.java:193)
    [junit] 	at jdepend.framework.ClassFileParser.parseClassName(ClassFileParser.java:94)
    [junit] 	at jdepend.framework.ClassFileParser.parse(ClassFileParser.java:65)
    [junit] 	at jdepend.framework.ClassFileParser.parse(ClassFileParser.java:54)
    [junit] 	at jdepend.framework.ClassFileParserTest.testInterfaceClass(ClassFileParserTest.java:51)
    [junit] 
    [junit] Testcase: testJDependComponents took 0.023 sec
    [junit] 	FAILED
    [junit] expected:<4> but was:<0>
    [junit] junit.framework.AssertionFailedError: expected:<4> but was:<0>
    [junit] 	at jdepend.framework.ComponentTest.testJDependComponents(ComponentTest.java:45)
    [junit] 

BUILD FAILED
/Users/aliparsai/Study/LittleDarwin/Cases/jdepend-2.9.1/build.xml:70: Test jdepend.framework.AllTests failed

Total time: 2 seconds
