Buildfile: /Users/aliparsai/Study/LittleDarwin/Cases/jdepend-2.9.1/build.xml

clean:
   [delete] Deleting directory /Users/aliparsai/Study/LittleDarwin/Cases/jdepend-2.9.1/build

prepare:
    [mkdir] Created dir: /Users/aliparsai/Study/LittleDarwin/Cases/jdepend-2.9.1/build

compile:
    [javac] /Users/aliparsai/Study/LittleDarwin/Cases/jdepend-2.9.1/build.xml:43: warning: 'includeantruntime' was not set, defaulting to build.sysclasspath=last; set to false for repeatable builds
    [javac] Compiling 22 source files to /Users/aliparsai/Study/LittleDarwin/Cases/jdepend-2.9.1/build
    [javac] Note: /Users/aliparsai/Study/LittleDarwin/Cases/jdepend-2.9.1/src/jdepend/swingui/JDepend.java uses or overrides a deprecated API.
    [javac] Note: Recompile with -Xlint:deprecation for details.
    [javac] Note: Some input files use unchecked or unsafe operations.
    [javac] Note: Recompile with -Xlint:unchecked for details.

compile-tests:
    [javac] /Users/aliparsai/Study/LittleDarwin/Cases/jdepend-2.9.1/build.xml:62: warning: 'includeantruntime' was not set, defaulting to build.sysclasspath=last; set to false for repeatable builds
    [javac] Compiling 16 source files to /Users/aliparsai/Study/LittleDarwin/Cases/jdepend-2.9.1/build
    [javac] Note: /Users/aliparsai/Study/LittleDarwin/Cases/jdepend-2.9.1/test/jdepend/framework/FilterTest.java uses unchecked or unsafe operations.
    [javac] Note: Recompile with -Xlint:unchecked for details.

test:
    [junit] Testsuite: jdepend.framework.AllTests
    [junit] Tests run: 7, Failures: 1, Errors: 5, Time elapsed: 0.13 sec
    [junit] ------------- Standard Error -----------------
    [junit] 
    [junit] Illegal constant pool index : 65596
    [junit] 
    [junit] Illegal constant pool index : 65572
    [junit] 
    [junit] Illegal constant pool index : 65895
    [junit] 
    [junit] Illegal constant pool index : 65634
    [junit] 
    [junit] Illegal constant pool index : 65597
    [junit] 
    [junit] Illegal constant pool index : 65621
    [junit] 
    [junit] Illegal constant pool index : 65588
    [junit] 
    [junit] Illegal constant pool index : 65614
    [junit] 
    [junit] Illegal constant pool index : 65611
    [junit] 
    [junit] Illegal constant pool index : 65569
    [junit] 
    [junit] Illegal constant pool index : 65588
    [junit] 
    [junit] Illegal constant pool index : 65551
    [junit] 
    [junit] Illegal constant pool index : 65548
    [junit] 
    [junit] Illegal constant pool index : 65620
    [junit] 
    [junit] Illegal constant pool index : 65634
    [junit] 
    [junit] Illegal constant pool index : 65614
    [junit] 
    [junit] Illegal constant pool index : 65603
    [junit] 
    [junit] Illegal constant pool index : 65625
    [junit] 
    [junit] Illegal constant pool index : 65599
    [junit] 
    [junit] Illegal constant pool index : 65654
    [junit] 
    [junit] Illegal constant pool index : 65653
    [junit] 
    [junit] Illegal constant pool index : 65694
    [junit] 
    [junit] Illegal constant pool index : 65588
    [junit] 
    [junit] Illegal constant pool index : 65631
    [junit] 
    [junit] Illegal constant pool index : 65572
    [junit] 
    [junit] Illegal constant pool index : 65592
    [junit] 
    [junit] Illegal constant pool index : 65542
    [junit] 
    [junit] Illegal constant pool index : 65641
    [junit] 
    [junit] Illegal constant pool index : 65606
    [junit] 
    [junit] Illegal constant pool index : 65620
    [junit] 
    [junit] Illegal constant pool index : 65573
    [junit] 
    [junit] Illegal constant pool index : 65615
    [junit] 
    [junit] Illegal constant pool index : 65600
    [junit] 
    [junit] Illegal constant pool index : 65576
    [junit] 
    [junit] Illegal constant pool index : 65917
    [junit] 
    [junit] Illegal constant pool index : 65646
    [junit] 
    [junit] Illegal constant pool index : 65559
    [junit] 
    [junit] Illegal constant pool index : 65839
    [junit] 
    [junit] Illegal constant pool index : 65665
    [junit] ------------- ---------------- ---------------
    [junit] 
    [junit] Testcase: testInvalidClassFile took 0.003 sec
    [junit] Testcase: testPackageClass took 0.002 sec
    [junit] 	Caused an ERROR
    [junit] Illegal constant pool index : 65548
    [junit] java.io.IOException: Illegal constant pool index : 65548
    [junit] 	at jdepend.framework.ClassFileParser.getConstantPoolEntry(ClassFileParser.java:185)
    [junit] 	at jdepend.framework.ClassFileParser.toUTF8(ClassFileParser.java:196)
    [junit] 	at jdepend.framework.ClassFileParser.parseAttributes(ClassFileParser.java:173)
    [junit] 	at jdepend.framework.ClassFileParser.parse(ClassFileParser.java:70)
    [junit] 	at jdepend.framework.ClassFileParser.parse(ClassFileParser.java:54)
    [junit] 	at jdepend.framework.ClassFileParserTest.testPackageClass(ClassFileParserTest.java:148)
    [junit] 
    [junit] Testcase: testAbstractClass took 0.001 sec
    [junit] 	Caused an ERROR
    [junit] Illegal constant pool index : 65569
    [junit] java.io.IOException: Illegal constant pool index : 65569
    [junit] 	at jdepend.framework.ClassFileParser.getConstantPoolEntry(ClassFileParser.java:185)
    [junit] 	at jdepend.framework.ClassFileParser.toUTF8(ClassFileParser.java:196)
    [junit] 	at jdepend.framework.ClassFileParser.parseAttributes(ClassFileParser.java:173)
    [junit] 	at jdepend.framework.ClassFileParser.parse(ClassFileParser.java:70)
    [junit] 	at jdepend.framework.ClassFileParser.parse(ClassFileParser.java:54)
    [junit] 	at jdepend.framework.ClassFileParserTest.testAbstractClass(ClassFileParserTest.java:75)
    [junit] 
    [junit] Testcase: testInnerClass took 0.001 sec
    [junit] 	Caused an ERROR
    [junit] Illegal constant pool index : 65553
    [junit] java.io.IOException: Illegal constant pool index : 65553
    [junit] 	at jdepend.framework.ClassFileParser.getConstantPoolEntry(ClassFileParser.java:185)
    [junit] 	at jdepend.framework.ClassFileParser.toUTF8(ClassFileParser.java:196)
    [junit] 	at jdepend.framework.ClassFileParser.parseAttributes(ClassFileParser.java:173)
    [junit] 	at jdepend.framework.ClassFileParser.parse(ClassFileParser.java:70)
    [junit] 	at jdepend.framework.ClassFileParser.parse(ClassFileParser.java:54)
    [junit] 	at jdepend.framework.ClassFileParserTest.testInnerClass(ClassFileParserTest.java:127)
    [junit] 
    [junit] Testcase: testConcreteClass took 0.001 sec
    [junit] 	Caused an ERROR
    [junit] Illegal constant pool index : 65588
    [junit] java.io.IOException: Illegal constant pool index : 65588
    [junit] 	at jdepend.framework.ClassFileParser.getConstantPoolEntry(ClassFileParser.java:185)
    [junit] 	at jdepend.framework.ClassFileParser.toUTF8(ClassFileParser.java:196)
    [junit] 	at jdepend.framework.ClassFileParser.parseAttributes(ClassFileParser.java:173)
    [junit] 	at jdepend.framework.ClassFileParser.parse(ClassFileParser.java:70)
    [junit] 	at jdepend.framework.ClassFileParser.parse(ClassFileParser.java:54)
    [junit] 	at jdepend.framework.ClassFileParserTest.testConcreteClass(ClassFileParserTest.java:100)
    [junit] 
    [junit] Testcase: testInterfaceClass took 0.001 sec
    [junit] 	Caused an ERROR
    [junit] Illegal constant pool index : 65551
    [junit] java.io.IOException: Illegal constant pool index : 65551
    [junit] 	at jdepend.framework.ClassFileParser.getConstantPoolEntry(ClassFileParser.java:185)
    [junit] 	at jdepend.framework.ClassFileParser.toUTF8(ClassFileParser.java:196)
    [junit] 	at jdepend.framework.ClassFileParser.parseAttributes(ClassFileParser.java:173)
    [junit] 	at jdepend.framework.ClassFileParser.parse(ClassFileParser.java:70)
    [junit] 	at jdepend.framework.ClassFileParser.parse(ClassFileParser.java:54)
    [junit] 	at jdepend.framework.ClassFileParserTest.testInterfaceClass(ClassFileParserTest.java:51)
    [junit] 
    [junit] Testcase: testJDependComponents took 0.104 sec
    [junit] 	FAILED
    [junit] expected:<4> but was:<0>
    [junit] junit.framework.AssertionFailedError: expected:<4> but was:<0>
    [junit] 	at jdepend.framework.ComponentTest.testJDependComponents(ComponentTest.java:45)
    [junit] 

BUILD FAILED
/Users/aliparsai/Study/LittleDarwin/Cases/jdepend-2.9.1/build.xml:70: Test jdepend.framework.AllTests failed

Total time: 3 seconds
