Buildfile: /Users/aliparsai/Study/LittleDarwin/Cases/jdepend-2.9.1/build.xml

clean:
   [delete] Deleting directory /Users/aliparsai/Study/LittleDarwin/Cases/jdepend-2.9.1/build

prepare:
    [mkdir] Created dir: /Users/aliparsai/Study/LittleDarwin/Cases/jdepend-2.9.1/build

compile:
    [javac] /Users/aliparsai/Study/LittleDarwin/Cases/jdepend-2.9.1/build.xml:43: warning: 'includeantruntime' was not set, defaulting to build.sysclasspath=last; set to false for repeatable builds
    [javac] Compiling 22 source files to /Users/aliparsai/Study/LittleDarwin/Cases/jdepend-2.9.1/build
    [javac] Note: /Users/aliparsai/Study/LittleDarwin/Cases/jdepend-2.9.1/src/jdepend/swingui/JDepend.java uses or overrides a deprecated API.
    [javac] Note: Recompile with -Xlint:deprecation for details.
    [javac] Note: Some input files use unchecked or unsafe operations.
    [javac] Note: Recompile with -Xlint:unchecked for details.

compile-tests:
    [javac] /Users/aliparsai/Study/LittleDarwin/Cases/jdepend-2.9.1/build.xml:62: warning: 'includeantruntime' was not set, defaulting to build.sysclasspath=last; set to false for repeatable builds
    [javac] Compiling 16 source files to /Users/aliparsai/Study/LittleDarwin/Cases/jdepend-2.9.1/build
    [javac] Note: /Users/aliparsai/Study/LittleDarwin/Cases/jdepend-2.9.1/test/jdepend/framework/FilterTest.java uses unchecked or unsafe operations.
    [javac] Note: Recompile with -Xlint:unchecked for details.

test:
    [junit] Testsuite: jdepend.framework.AllTests
    [junit] Tests run: 7, Failures: 1, Errors: 5, Time elapsed: 0.158 sec
    [junit] ------------- Standard Error -----------------
    [junit] 
    [junit] Illegal constant pool index : 316
    [junit] 
    [junit] Illegal constant pool index : 292
    [junit] 
    [junit] Illegal constant pool index : 615
    [junit] 
    [junit] Illegal constant pool index : 354
    [junit] 
    [junit] Illegal constant pool index : 317
    [junit] 
    [junit] Illegal constant pool index : 341
    [junit] 
    [junit] Illegal constant pool index : 308
    [junit] 
    [junit] Illegal constant pool index : 334
    [junit] 
    [junit] Illegal constant pool index : 331
    [junit] 
    [junit] Illegal constant pool index : 289
    [junit] 
    [junit] Illegal constant pool index : 308
    [junit] 
    [junit] Illegal constant pool index : 271
    [junit] 
    [junit] Illegal constant pool index : 268
    [junit] 
    [junit] Illegal constant pool index : 340
    [junit] 
    [junit] Illegal constant pool index : 354
    [junit] 
    [junit] Illegal constant pool index : 334
    [junit] 
    [junit] Illegal constant pool index : 323
    [junit] 
    [junit] Illegal constant pool index : 345
    [junit] 
    [junit] Illegal constant pool index : 319
    [junit] 
    [junit] Illegal constant pool index : 374
    [junit] 
    [junit] Illegal constant pool index : 373
    [junit] 
    [junit] Illegal constant pool index : -98
    [junit] 
    [junit] Illegal constant pool index : 308
    [junit] 
    [junit] Illegal constant pool index : 351
    [junit] 
    [junit] Illegal constant pool index : 292
    [junit] 
    [junit] Illegal constant pool index : 312
    [junit] 
    [junit] Illegal constant pool index : 262
    [junit] 
    [junit] Illegal constant pool index : 361
    [junit] 
    [junit] Illegal constant pool index : 326
    [junit] 
    [junit] Illegal constant pool index : 340
    [junit] 
    [junit] Illegal constant pool index : 293
    [junit] 
    [junit] Illegal constant pool index : 335
    [junit] 
    [junit] Illegal constant pool index : 320
    [junit] 
    [junit] Illegal constant pool index : 296
    [junit] 
    [junit] Illegal constant pool index : 366
    [junit] 
    [junit] Illegal constant pool index : 279
    [junit] 
    [junit] Illegal constant pool index : 559
    [junit] 
    [junit] Illegal constant pool index : -127
    [junit] ------------- ---------------- ---------------
    [junit] 
    [junit] Testcase: testInvalidClassFile took 0.004 sec
    [junit] Testcase: testPackageClass took 0.002 sec
    [junit] 	Caused an ERROR
    [junit] Illegal constant pool index : 268
    [junit] java.io.IOException: Illegal constant pool index : 268
    [junit] 	at jdepend.framework.ClassFileParser.getConstantPoolEntry(ClassFileParser.java:185)
    [junit] 	at jdepend.framework.ClassFileParser.toUTF8(ClassFileParser.java:196)
    [junit] 	at jdepend.framework.ClassFileParser.parseAttributes(ClassFileParser.java:173)
    [junit] 	at jdepend.framework.ClassFileParser.parse(ClassFileParser.java:70)
    [junit] 	at jdepend.framework.ClassFileParser.parse(ClassFileParser.java:54)
    [junit] 	at jdepend.framework.ClassFileParserTest.testPackageClass(ClassFileParserTest.java:148)
    [junit] 
    [junit] Testcase: testAbstractClass took 0.002 sec
    [junit] 	Caused an ERROR
    [junit] Illegal constant pool index : 289
    [junit] java.io.IOException: Illegal constant pool index : 289
    [junit] 	at jdepend.framework.ClassFileParser.getConstantPoolEntry(ClassFileParser.java:185)
    [junit] 	at jdepend.framework.ClassFileParser.toUTF8(ClassFileParser.java:196)
    [junit] 	at jdepend.framework.ClassFileParser.parseAttributes(ClassFileParser.java:173)
    [junit] 	at jdepend.framework.ClassFileParser.parse(ClassFileParser.java:70)
    [junit] 	at jdepend.framework.ClassFileParser.parse(ClassFileParser.java:54)
    [junit] 	at jdepend.framework.ClassFileParserTest.testAbstractClass(ClassFileParserTest.java:75)
    [junit] 
    [junit] Testcase: testInnerClass took 0.001 sec
    [junit] 	Caused an ERROR
    [junit] Illegal constant pool index : 273
    [junit] java.io.IOException: Illegal constant pool index : 273
    [junit] 	at jdepend.framework.ClassFileParser.getConstantPoolEntry(ClassFileParser.java:185)
    [junit] 	at jdepend.framework.ClassFileParser.toUTF8(ClassFileParser.java:196)
    [junit] 	at jdepend.framework.ClassFileParser.parseAttributes(ClassFileParser.java:173)
    [junit] 	at jdepend.framework.ClassFileParser.parse(ClassFileParser.java:70)
    [junit] 	at jdepend.framework.ClassFileParser.parse(ClassFileParser.java:54)
    [junit] 	at jdepend.framework.ClassFileParserTest.testInnerClass(ClassFileParserTest.java:127)
    [junit] 
    [junit] Testcase: testConcreteClass took 0.002 sec
    [junit] 	Caused an ERROR
    [junit] Illegal constant pool index : 308
    [junit] java.io.IOException: Illegal constant pool index : 308
    [junit] 	at jdepend.framework.ClassFileParser.getConstantPoolEntry(ClassFileParser.java:185)
    [junit] 	at jdepend.framework.ClassFileParser.toUTF8(ClassFileParser.java:196)
    [junit] 	at jdepend.framework.ClassFileParser.parseAttributes(ClassFileParser.java:173)
    [junit] 	at jdepend.framework.ClassFileParser.parse(ClassFileParser.java:70)
    [junit] 	at jdepend.framework.ClassFileParser.parse(ClassFileParser.java:54)
    [junit] 	at jdepend.framework.ClassFileParserTest.testConcreteClass(ClassFileParserTest.java:100)
    [junit] 
    [junit] Testcase: testInterfaceClass took 0.001 sec
    [junit] 	Caused an ERROR
    [junit] Illegal constant pool index : 271
    [junit] java.io.IOException: Illegal constant pool index : 271
    [junit] 	at jdepend.framework.ClassFileParser.getConstantPoolEntry(ClassFileParser.java:185)
    [junit] 	at jdepend.framework.ClassFileParser.toUTF8(ClassFileParser.java:196)
    [junit] 	at jdepend.framework.ClassFileParser.parseAttributes(ClassFileParser.java:173)
    [junit] 	at jdepend.framework.ClassFileParser.parse(ClassFileParser.java:70)
    [junit] 	at jdepend.framework.ClassFileParser.parse(ClassFileParser.java:54)
    [junit] 	at jdepend.framework.ClassFileParserTest.testInterfaceClass(ClassFileParserTest.java:51)
    [junit] 
    [junit] Testcase: testJDependComponents took 0.133 sec
    [junit] 	FAILED
    [junit] expected:<4> but was:<3>
    [junit] junit.framework.AssertionFailedError: expected:<4> but was:<3>
    [junit] 	at jdepend.framework.ComponentTest.testJDependComponents(ComponentTest.java:45)
    [junit] 

BUILD FAILED
/Users/aliparsai/Study/LittleDarwin/Cases/jdepend-2.9.1/build.xml:70: Test jdepend.framework.AllTests failed

Total time: 2 seconds
