Buildfile: /Users/aliparsai/Study/LittleDarwin/Cases/jdepend-2.9.1/build.xml

clean:
   [delete] Deleting directory /Users/aliparsai/Study/LittleDarwin/Cases/jdepend-2.9.1/build

prepare:
    [mkdir] Created dir: /Users/aliparsai/Study/LittleDarwin/Cases/jdepend-2.9.1/build

compile:
    [javac] /Users/aliparsai/Study/LittleDarwin/Cases/jdepend-2.9.1/build.xml:43: warning: 'includeantruntime' was not set, defaulting to build.sysclasspath=last; set to false for repeatable builds
    [javac] Compiling 22 source files to /Users/aliparsai/Study/LittleDarwin/Cases/jdepend-2.9.1/build
    [javac] Note: /Users/aliparsai/Study/LittleDarwin/Cases/jdepend-2.9.1/src/jdepend/swingui/JDepend.java uses or overrides a deprecated API.
    [javac] Note: Recompile with -Xlint:deprecation for details.
    [javac] Note: Some input files use unchecked or unsafe operations.
    [javac] Note: Recompile with -Xlint:unchecked for details.

compile-tests:
    [javac] /Users/aliparsai/Study/LittleDarwin/Cases/jdepend-2.9.1/build.xml:62: warning: 'includeantruntime' was not set, defaulting to build.sysclasspath=last; set to false for repeatable builds
    [javac] Compiling 16 source files to /Users/aliparsai/Study/LittleDarwin/Cases/jdepend-2.9.1/build
    [javac] Note: /Users/aliparsai/Study/LittleDarwin/Cases/jdepend-2.9.1/test/jdepend/framework/FilterTest.java uses unchecked or unsafe operations.
    [javac] Note: Recompile with -Xlint:unchecked for details.

test:
    [junit] Testsuite: jdepend.framework.AllTests
    [junit] Tests run: 7, Failures: 1, Errors: 5, Time elapsed: 0.052 sec
    [junit] ------------- Standard Error -----------------
    [junit] 
    [junit] Illegal constant pool index : 19
    [junit] 
    [junit] Illegal constant pool index : 19
    [junit] 
    [junit] Illegal constant pool index : 56
    [junit] 
    [junit] Illegal constant pool index : 60
    [junit] 
    [junit] Illegal constant pool index : 22
    [junit] 
    [junit] Illegal constant pool index : 48
    [junit] 
    [junit] Illegal constant pool index : 23
    [junit] 
    [junit] Illegal constant pool index : 33
    [junit] 
    [junit] Illegal constant pool index : 26
    [junit] 
    [junit] Illegal constant pool index : 2
    [junit] 
    [junit] Illegal constant pool index : 10
    [junit] 
    [junit] Illegal constant pool index : 1
    [junit] 
    [junit] Illegal constant pool index : 2
    [junit] 
    [junit] Illegal constant pool index : 40
    [junit] 
    [junit] Illegal constant pool index : 44
    [junit] 
    [junit] Illegal constant pool index : 41
    [junit] 
    [junit] Illegal constant pool index : 39
    [junit] 
    [junit] Illegal constant pool index : 44
    [junit] 
    [junit] Illegal constant pool index : 16
    [junit] 
    [junit] Illegal constant pool index : 11
    [junit] 
    [junit] Illegal constant pool index : 20
    [junit] 
    [junit] Illegal constant pool index : 72
    [junit] 
    [junit] Illegal constant pool index : 24
    [junit] 
    [junit] Illegal constant pool index : 56
    [junit] 
    [junit] Illegal constant pool index : 9
    [junit] 
    [junit] Illegal constant pool index : 23
    [junit] 
    [junit] Illegal constant pool index : 1
    [junit] 
    [junit] Illegal constant pool index : 37
    [junit] 
    [junit] Illegal constant pool index : 39
    [junit] 
    [junit] Illegal constant pool index : 49
    [junit] 
    [junit] Illegal constant pool index : 2
    [junit] 
    [junit] Illegal constant pool index : 41
    [junit] 
    [junit] Illegal constant pool index : 15
    [junit] 
    [junit] Illegal constant pool index : 2
    [junit] 
    [junit] Illegal constant pool index : 201
    [junit] 
    [junit] Illegal constant pool index : 60
    [junit] 
    [junit] Illegal constant pool index : 9
    [junit] 
    [junit] Illegal constant pool index : 170
    [junit] 
    [junit] Illegal constant pool index : 74
    [junit] ------------- ---------------- ---------------
    [junit] 
    [junit] Testcase: testInvalidClassFile took 0.004 sec
    [junit] Testcase: testPackageClass took 0.001 sec
    [junit] 	Caused an ERROR
    [junit] Illegal constant pool index : 2
    [junit] java.io.IOException: Illegal constant pool index : 2
    [junit] 	at jdepend.framework.ClassFileParser.getConstantPoolEntry(ClassFileParser.java:185)
    [junit] 	at jdepend.framework.ClassFileParser.getClassConstantName(ClassFileParser.java:193)
    [junit] 	at jdepend.framework.ClassFileParser.parseClassName(ClassFileParser.java:94)
    [junit] 	at jdepend.framework.ClassFileParser.parse(ClassFileParser.java:65)
    [junit] 	at jdepend.framework.ClassFileParser.parse(ClassFileParser.java:54)
    [junit] 	at jdepend.framework.ClassFileParserTest.testPackageClass(ClassFileParserTest.java:148)
    [junit] 
    [junit] Testcase: testAbstractClass took 0 sec
    [junit] 	Caused an ERROR
    [junit] Illegal constant pool index : 2
    [junit] java.io.IOException: Illegal constant pool index : 2
    [junit] 	at jdepend.framework.ClassFileParser.getConstantPoolEntry(ClassFileParser.java:185)
    [junit] 	at jdepend.framework.ClassFileParser.getClassConstantName(ClassFileParser.java:193)
    [junit] 	at jdepend.framework.ClassFileParser.parseClassName(ClassFileParser.java:94)
    [junit] 	at jdepend.framework.ClassFileParser.parse(ClassFileParser.java:65)
    [junit] 	at jdepend.framework.ClassFileParser.parse(ClassFileParser.java:54)
    [junit] 	at jdepend.framework.ClassFileParserTest.testAbstractClass(ClassFileParserTest.java:75)
    [junit] 
    [junit] Testcase: testInnerClass took 0 sec
    [junit] 	Caused an ERROR
    [junit] Illegal constant pool index : 3
    [junit] java.io.IOException: Illegal constant pool index : 3
    [junit] 	at jdepend.framework.ClassFileParser.getConstantPoolEntry(ClassFileParser.java:185)
    [junit] 	at jdepend.framework.ClassFileParser.getClassConstantName(ClassFileParser.java:193)
    [junit] 	at jdepend.framework.ClassFileParser.parseClassName(ClassFileParser.java:94)
    [junit] 	at jdepend.framework.ClassFileParser.parse(ClassFileParser.java:65)
    [junit] 	at jdepend.framework.ClassFileParser.parse(ClassFileParser.java:54)
    [junit] 	at jdepend.framework.ClassFileParserTest.testInnerClass(ClassFileParserTest.java:127)
    [junit] 
    [junit] Testcase: testConcreteClass took 0.001 sec
    [junit] 	Caused an ERROR
    [junit] Illegal constant pool index : 10
    [junit] java.io.IOException: Illegal constant pool index : 10
    [junit] 	at jdepend.framework.ClassFileParser.getConstantPoolEntry(ClassFileParser.java:185)
    [junit] 	at jdepend.framework.ClassFileParser.getClassConstantName(ClassFileParser.java:193)
    [junit] 	at jdepend.framework.ClassFileParser.parseClassName(ClassFileParser.java:94)
    [junit] 	at jdepend.framework.ClassFileParser.parse(ClassFileParser.java:65)
    [junit] 	at jdepend.framework.ClassFileParser.parse(ClassFileParser.java:54)
    [junit] 	at jdepend.framework.ClassFileParserTest.testConcreteClass(ClassFileParserTest.java:100)
    [junit] 
    [junit] Testcase: testInterfaceClass took 0 sec
    [junit] 	Caused an ERROR
    [junit] Illegal constant pool index : 1
    [junit] java.io.IOException: Illegal constant pool index : 1
    [junit] 	at jdepend.framework.ClassFileParser.getConstantPoolEntry(ClassFileParser.java:185)
    [junit] 	at jdepend.framework.ClassFileParser.getClassConstantName(ClassFileParser.java:193)
    [junit] 	at jdepend.framework.ClassFileParser.parseClassName(ClassFileParser.java:94)
    [junit] 	at jdepend.framework.ClassFileParser.parse(ClassFileParser.java:65)
    [junit] 	at jdepend.framework.ClassFileParser.parse(ClassFileParser.java:54)
    [junit] 	at jdepend.framework.ClassFileParserTest.testInterfaceClass(ClassFileParserTest.java:51)
    [junit] 
    [junit] Testcase: testJDependComponents took 0.035 sec
    [junit] 	FAILED
    [junit] expected:<4> but was:<0>
    [junit] junit.framework.AssertionFailedError: expected:<4> but was:<0>
    [junit] 	at jdepend.framework.ComponentTest.testJDependComponents(ComponentTest.java:45)
    [junit] 

BUILD FAILED
/Users/aliparsai/Study/LittleDarwin/Cases/jdepend-2.9.1/build.xml:70: Test jdepend.framework.AllTests failed

Total time: 2 seconds
