Buildfile: /Users/aliparsai/Study/LittleDarwin/Cases/jdepend-2.9.1/build.xml

clean:
   [delete] Deleting directory /Users/aliparsai/Study/LittleDarwin/Cases/jdepend-2.9.1/build

prepare:
    [mkdir] Created dir: /Users/aliparsai/Study/LittleDarwin/Cases/jdepend-2.9.1/build

compile:
    [javac] /Users/aliparsai/Study/LittleDarwin/Cases/jdepend-2.9.1/build.xml:43: warning: 'includeantruntime' was not set, defaulting to build.sysclasspath=last; set to false for repeatable builds
    [javac] Compiling 22 source files to /Users/aliparsai/Study/LittleDarwin/Cases/jdepend-2.9.1/build
    [javac] Note: /Users/aliparsai/Study/LittleDarwin/Cases/jdepend-2.9.1/src/jdepend/swingui/JDepend.java uses or overrides a deprecated API.
    [javac] Note: Recompile with -Xlint:deprecation for details.
    [javac] Note: Some input files use unchecked or unsafe operations.
    [javac] Note: Recompile with -Xlint:unchecked for details.

compile-tests:
    [javac] /Users/aliparsai/Study/LittleDarwin/Cases/jdepend-2.9.1/build.xml:62: warning: 'includeantruntime' was not set, defaulting to build.sysclasspath=last; set to false for repeatable builds
    [javac] Compiling 16 source files to /Users/aliparsai/Study/LittleDarwin/Cases/jdepend-2.9.1/build
    [javac] Note: /Users/aliparsai/Study/LittleDarwin/Cases/jdepend-2.9.1/test/jdepend/framework/FilterTest.java uses unchecked or unsafe operations.
    [javac] Note: Recompile with -Xlint:unchecked for details.

test:
    [junit] Testsuite: jdepend.framework.AllTests
    [junit] Tests run: 7, Failures: 1, Errors: 5, Time elapsed: 0.054 sec
    [junit] ------------- Standard Error -----------------
    [junit] 
    [junit] Constant pool entry is not a UTF8 type: 80
    [junit] 
    [junit] Constant pool entry is not a UTF8 type: 56
    [junit] 
    [junit] Constant pool entry is not a UTF8 type: 413
    [junit] 
    [junit] Constant pool entry is not a UTF8 type: 157
    [junit] 
    [junit] Constant pool entry is not a UTF8 type: 83
    [junit] 
    [junit] Constant pool entry is not a UTF8 type: 132
    [junit] 
    [junit] Constant pool entry is not a UTF8 type: 73
    [junit] 
    [junit] Constant pool entry is not a UTF8 type: 113
    [junit] 
    [junit] Constant pool entry is not a UTF8 type: 101
    [junit] 
    [junit] Constant pool entry is not a UTF8 type: 35
    [junit] 
    [junit] Constant pool entry is not a UTF8 type: 61
    [junit] 
    [junit] Constant pool entry is not a UTF8 type: 16
    [junit] 
    [junit] Constant pool entry is not a UTF8 type: 14
    [junit] 
    [junit] Constant pool entry is not a UTF8 type: 125
    [junit] 
    [junit] Constant pool entry is not a UTF8 type: 141
    [junit] 
    [junit] Constant pool entry is not a UTF8 type: 118
    [junit] 
    [junit] Constant pool entry is not a UTF8 type: 105
    [junit] 
    [junit] Constant pool entry is not a UTF8 type: 129
    [junit] 
    [junit] Constant pool entry is not a UTF8 type: 80
    [junit] 
    [junit] Constant pool entry is not a UTF8 type: 127
    [junit] 
    [junit] Constant pool entry is not a UTF8 type: 138
    [junit] 
    [junit] Constant pool entry is not a UTF8 type: 225
    [junit] 
    [junit] Constant pool entry is not a UTF8 type: 78
    [junit] 
    [junit] Constant pool entry is not a UTF8 type: 147
    [junit] 
    [junit] Constant pool entry is not a UTF8 type: 46
    [junit] 
    [junit] Constant pool entry is not a UTF8 type: 79
    [junit] 
    [junit] Constant pool entry is not a UTF8 type: 7
    [junit] 
    [junit] Constant pool entry is not a UTF8 type: 142
    [junit] 
    [junit] Constant pool entry is not a UTF8 type: 109
    [junit] 
    [junit] Constant pool entry is not a UTF8 type: 128
    [junit] 
    [junit] Constant pool entry is not a UTF8 type: 39
    [junit] 
    [junit] Constant pool entry is not a UTF8 type: 122
    [junit] 
    [junit] Constant pool entry is not a UTF8 type: 79
    [junit] 
    [junit] Constant pool entry is not a UTF8 type: 42
    [junit] 
    [junit] Constant pool entry is not a UTF8 type: 568
    [junit] 
    [junit] Constant pool entry is not a UTF8 type: 170
    [junit] 
    [junit] Constant pool entry is not a UTF8 type: 32
    [junit] 
    [junit] Constant pool entry is not a UTF8 type: 469
    [junit] 
    [junit] Constant pool entry is not a UTF8 type: 206
    [junit] ------------- ---------------- ---------------
    [junit] 
    [junit] Testcase: testInvalidClassFile took 0.004 sec
    [junit] Testcase: testPackageClass took 0.001 sec
    [junit] 	Caused an ERROR
    [junit] Constant pool entry is not a UTF8 type: 14
    [junit] java.io.IOException: Constant pool entry is not a UTF8 type: 14
    [junit] 	at jdepend.framework.ClassFileParser.toUTF8(ClassFileParser.java:198)
    [junit] 	at jdepend.framework.ClassFileParser.getClassConstantName(ClassFileParser.java:195)
    [junit] 	at jdepend.framework.ClassFileParser.parseClassName(ClassFileParser.java:94)
    [junit] 	at jdepend.framework.ClassFileParser.parse(ClassFileParser.java:65)
    [junit] 	at jdepend.framework.ClassFileParser.parse(ClassFileParser.java:54)
    [junit] 	at jdepend.framework.ClassFileParserTest.testPackageClass(ClassFileParserTest.java:148)
    [junit] 
    [junit] Testcase: testAbstractClass took 0 sec
    [junit] 	Caused an ERROR
    [junit] Constant pool entry is not a UTF8 type: 35
    [junit] java.io.IOException: Constant pool entry is not a UTF8 type: 35
    [junit] 	at jdepend.framework.ClassFileParser.toUTF8(ClassFileParser.java:198)
    [junit] 	at jdepend.framework.ClassFileParser.getClassConstantName(ClassFileParser.java:195)
    [junit] 	at jdepend.framework.ClassFileParser.parseClassName(ClassFileParser.java:94)
    [junit] 	at jdepend.framework.ClassFileParser.parse(ClassFileParser.java:65)
    [junit] 	at jdepend.framework.ClassFileParser.parse(ClassFileParser.java:54)
    [junit] 	at jdepend.framework.ClassFileParserTest.testAbstractClass(ClassFileParserTest.java:75)
    [junit] 
    [junit] Testcase: testInnerClass took 0.001 sec
    [junit] 	Caused an ERROR
    [junit] Constant pool entry is not a UTF8 type: 21
    [junit] java.io.IOException: Constant pool entry is not a UTF8 type: 21
    [junit] 	at jdepend.framework.ClassFileParser.toUTF8(ClassFileParser.java:198)
    [junit] 	at jdepend.framework.ClassFileParser.getClassConstantName(ClassFileParser.java:195)
    [junit] 	at jdepend.framework.ClassFileParser.parseClassName(ClassFileParser.java:94)
    [junit] 	at jdepend.framework.ClassFileParser.parse(ClassFileParser.java:65)
    [junit] 	at jdepend.framework.ClassFileParser.parse(ClassFileParser.java:54)
    [junit] 	at jdepend.framework.ClassFileParserTest.testInnerClass(ClassFileParserTest.java:127)
    [junit] 
    [junit] Testcase: testConcreteClass took 0.001 sec
    [junit] 	Caused an ERROR
    [junit] Constant pool entry is not a UTF8 type: 61
    [junit] java.io.IOException: Constant pool entry is not a UTF8 type: 61
    [junit] 	at jdepend.framework.ClassFileParser.toUTF8(ClassFileParser.java:198)
    [junit] 	at jdepend.framework.ClassFileParser.getClassConstantName(ClassFileParser.java:195)
    [junit] 	at jdepend.framework.ClassFileParser.parseClassName(ClassFileParser.java:94)
    [junit] 	at jdepend.framework.ClassFileParser.parse(ClassFileParser.java:65)
    [junit] 	at jdepend.framework.ClassFileParser.parse(ClassFileParser.java:54)
    [junit] 	at jdepend.framework.ClassFileParserTest.testConcreteClass(ClassFileParserTest.java:100)
    [junit] 
    [junit] Testcase: testInterfaceClass took 0.001 sec
    [junit] 	Caused an ERROR
    [junit] Constant pool entry is not a UTF8 type: 16
    [junit] java.io.IOException: Constant pool entry is not a UTF8 type: 16
    [junit] 	at jdepend.framework.ClassFileParser.toUTF8(ClassFileParser.java:198)
    [junit] 	at jdepend.framework.ClassFileParser.getClassConstantName(ClassFileParser.java:195)
    [junit] 	at jdepend.framework.ClassFileParser.parseClassName(ClassFileParser.java:94)
    [junit] 	at jdepend.framework.ClassFileParser.parse(ClassFileParser.java:65)
    [junit] 	at jdepend.framework.ClassFileParser.parse(ClassFileParser.java:54)
    [junit] 	at jdepend.framework.ClassFileParserTest.testInterfaceClass(ClassFileParserTest.java:51)
    [junit] 
    [junit] Testcase: testJDependComponents took 0.037 sec
    [junit] 	FAILED
    [junit] expected:<4> but was:<0>
    [junit] junit.framework.AssertionFailedError: expected:<4> but was:<0>
    [junit] 	at jdepend.framework.ComponentTest.testJDependComponents(ComponentTest.java:45)
    [junit] 

BUILD FAILED
/Users/aliparsai/Study/LittleDarwin/Cases/jdepend-2.9.1/build.xml:70: Test jdepend.framework.AllTests failed

Total time: 2 seconds
