Buildfile: /Users/aliparsai/Study/LittleDarwin/Cases/jdepend-2.9.1/build.xml

clean:
   [delete] Deleting directory /Users/aliparsai/Study/LittleDarwin/Cases/jdepend-2.9.1/build

prepare:
    [mkdir] Created dir: /Users/aliparsai/Study/LittleDarwin/Cases/jdepend-2.9.1/build

compile:
    [javac] /Users/aliparsai/Study/LittleDarwin/Cases/jdepend-2.9.1/build.xml:43: warning: 'includeantruntime' was not set, defaulting to build.sysclasspath=last; set to false for repeatable builds
    [javac] Compiling 22 source files to /Users/aliparsai/Study/LittleDarwin/Cases/jdepend-2.9.1/build
    [javac] Note: /Users/aliparsai/Study/LittleDarwin/Cases/jdepend-2.9.1/src/jdepend/swingui/JDepend.java uses or overrides a deprecated API.
    [javac] Note: Recompile with -Xlint:deprecation for details.
    [javac] Note: Some input files use unchecked or unsafe operations.
    [javac] Note: Recompile with -Xlint:unchecked for details.

compile-tests:
    [javac] /Users/aliparsai/Study/LittleDarwin/Cases/jdepend-2.9.1/build.xml:62: warning: 'includeantruntime' was not set, defaulting to build.sysclasspath=last; set to false for repeatable builds
    [javac] Compiling 16 source files to /Users/aliparsai/Study/LittleDarwin/Cases/jdepend-2.9.1/build
    [javac] Note: /Users/aliparsai/Study/LittleDarwin/Cases/jdepend-2.9.1/test/jdepend/framework/FilterTest.java uses unchecked or unsafe operations.
    [javac] Note: Recompile with -Xlint:unchecked for details.

test:
    [junit] Testsuite: jdepend.framework.AllTests
    [junit] Tests run: 7, Failures: 1, Errors: 5, Time elapsed: 0.113 sec
    [junit] ------------- Standard Error -----------------
    [junit] 
    [junit] Illegal constant pool index : -60
    [junit] 
    [junit] Illegal constant pool index : -36
    [junit] 
    [junit] Constant pool entry is not a UTF8 type: 153
    [junit] 
    [junit] Illegal constant pool index : -98
    [junit] 
    [junit] Illegal constant pool index : -61
    [junit] 
    [junit] Illegal constant pool index : -85
    [junit] 
    [junit] Illegal constant pool index : -52
    [junit] 
    [junit] Illegal constant pool index : -78
    [junit] 
    [junit] Illegal constant pool index : -75
    [junit] 
    [junit] Illegal constant pool index : -33
    [junit] 
    [junit] Illegal constant pool index : -52
    [junit] 
    [junit] Illegal constant pool index : -15
    [junit] 
    [junit] Illegal constant pool index : -12
    [junit] 
    [junit] Illegal constant pool index : -84
    [junit] 
    [junit] Illegal constant pool index : -98
    [junit] 
    [junit] Illegal constant pool index : -78
    [junit] 
    [junit] Illegal constant pool index : -67
    [junit] 
    [junit] Illegal constant pool index : -89
    [junit] 
    [junit] Illegal constant pool index : -63
    [junit] 
    [junit] Illegal constant pool index : -118
    [junit] 
    [junit] Illegal constant pool index : -117
    [junit] 
    [junit] Illegal constant pool index : -158
    [junit] 
    [junit] Illegal constant pool index : -52
    [junit] 
    [junit] Illegal constant pool index : -95
    [junit] 
    [junit] Illegal constant pool index : -36
    [junit] 
    [junit] Illegal constant pool index : -56
    [junit] 
    [junit] Illegal constant pool index : -6
    [junit] 
    [junit] Illegal constant pool index : -105
    [junit] 
    [junit] Illegal constant pool index : -70
    [junit] 
    [junit] Illegal constant pool index : -84
    [junit] 
    [junit] Illegal constant pool index : -37
    [junit] 
    [junit] Illegal constant pool index : -79
    [junit] 
    [junit] Illegal constant pool index : -64
    [junit] 
    [junit] Illegal constant pool index : -40
    [junit] 
    [junit] Constant pool entry is not a UTF8 type: 131
    [junit] 
    [junit] Illegal constant pool index : -110
    [junit] 
    [junit] Illegal constant pool index : -23
    [junit] 
    [junit] Illegal constant pool index : -129
    [junit] ------------- ---------------- ---------------
    [junit] 
    [junit] Testcase: testInvalidClassFile took 0.003 sec
    [junit] Testcase: testPackageClass took 0.002 sec
    [junit] 	Caused an ERROR
    [junit] Illegal constant pool index : -12
    [junit] java.io.IOException: Illegal constant pool index : -12
    [junit] 	at jdepend.framework.ClassFileParser.getConstantPoolEntry(ClassFileParser.java:185)
    [junit] 	at jdepend.framework.ClassFileParser.toUTF8(ClassFileParser.java:196)
    [junit] 	at jdepend.framework.ClassFileParser.parseAttributes(ClassFileParser.java:173)
    [junit] 	at jdepend.framework.ClassFileParser.parse(ClassFileParser.java:70)
    [junit] 	at jdepend.framework.ClassFileParser.parse(ClassFileParser.java:54)
    [junit] 	at jdepend.framework.ClassFileParserTest.testPackageClass(ClassFileParserTest.java:148)
    [junit] 
    [junit] Testcase: testAbstractClass took 0.001 sec
    [junit] 	Caused an ERROR
    [junit] Illegal constant pool index : -33
    [junit] java.io.IOException: Illegal constant pool index : -33
    [junit] 	at jdepend.framework.ClassFileParser.getConstantPoolEntry(ClassFileParser.java:185)
    [junit] 	at jdepend.framework.ClassFileParser.toUTF8(ClassFileParser.java:196)
    [junit] 	at jdepend.framework.ClassFileParser.parseAttributes(ClassFileParser.java:173)
    [junit] 	at jdepend.framework.ClassFileParser.parse(ClassFileParser.java:70)
    [junit] 	at jdepend.framework.ClassFileParser.parse(ClassFileParser.java:54)
    [junit] 	at jdepend.framework.ClassFileParserTest.testAbstractClass(ClassFileParserTest.java:75)
    [junit] 
    [junit] Testcase: testInnerClass took 0.001 sec
    [junit] 	Caused an ERROR
    [junit] Illegal constant pool index : -17
    [junit] java.io.IOException: Illegal constant pool index : -17
    [junit] 	at jdepend.framework.ClassFileParser.getConstantPoolEntry(ClassFileParser.java:185)
    [junit] 	at jdepend.framework.ClassFileParser.toUTF8(ClassFileParser.java:196)
    [junit] 	at jdepend.framework.ClassFileParser.parseAttributes(ClassFileParser.java:173)
    [junit] 	at jdepend.framework.ClassFileParser.parse(ClassFileParser.java:70)
    [junit] 	at jdepend.framework.ClassFileParser.parse(ClassFileParser.java:54)
    [junit] 	at jdepend.framework.ClassFileParserTest.testInnerClass(ClassFileParserTest.java:127)
    [junit] 
    [junit] Testcase: testConcreteClass took 0.002 sec
    [junit] 	Caused an ERROR
    [junit] Illegal constant pool index : -52
    [junit] java.io.IOException: Illegal constant pool index : -52
    [junit] 	at jdepend.framework.ClassFileParser.getConstantPoolEntry(ClassFileParser.java:185)
    [junit] 	at jdepend.framework.ClassFileParser.toUTF8(ClassFileParser.java:196)
    [junit] 	at jdepend.framework.ClassFileParser.parseAttributes(ClassFileParser.java:173)
    [junit] 	at jdepend.framework.ClassFileParser.parse(ClassFileParser.java:70)
    [junit] 	at jdepend.framework.ClassFileParser.parse(ClassFileParser.java:54)
    [junit] 	at jdepend.framework.ClassFileParserTest.testConcreteClass(ClassFileParserTest.java:100)
    [junit] 
    [junit] Testcase: testInterfaceClass took 0.001 sec
    [junit] 	Caused an ERROR
    [junit] Illegal constant pool index : -15
    [junit] java.io.IOException: Illegal constant pool index : -15
    [junit] 	at jdepend.framework.ClassFileParser.getConstantPoolEntry(ClassFileParser.java:185)
    [junit] 	at jdepend.framework.ClassFileParser.toUTF8(ClassFileParser.java:196)
    [junit] 	at jdepend.framework.ClassFileParser.parseAttributes(ClassFileParser.java:173)
    [junit] 	at jdepend.framework.ClassFileParser.parse(ClassFileParser.java:70)
    [junit] 	at jdepend.framework.ClassFileParser.parse(ClassFileParser.java:54)
    [junit] 	at jdepend.framework.ClassFileParserTest.testInterfaceClass(ClassFileParserTest.java:51)
    [junit] 
    [junit] Testcase: testJDependComponents took 0.094 sec
    [junit] 	FAILED
    [junit] expected:<4> but was:<2>
    [junit] junit.framework.AssertionFailedError: expected:<4> but was:<2>
    [junit] 	at jdepend.framework.ComponentTest.testJDependComponents(ComponentTest.java:45)
    [junit] 

BUILD FAILED
/Users/aliparsai/Study/LittleDarwin/Cases/jdepend-2.9.1/build.xml:70: Test jdepend.framework.AllTests failed

Total time: 2 seconds
