-------------------------------------------------------------------------------
Test set: org.apache.commons.lang3.tuple.MutableTripleTest
-------------------------------------------------------------------------------
Tests run: 8, Failures: 1, Errors: 0, Skipped: 0, Time elapsed: 0.016 sec <<< FAILURE! - in org.apache.commons.lang3.tuple.MutableTripleTest
testEquals(org.apache.commons.lang3.tuple.MutableTripleTest)  Time elapsed: 0.003 sec  <<< FAILURE!
java.lang.AssertionError: null
	at org.junit.Assert.fail(Assert.java:86)
	at org.junit.Assert.assertTrue(Assert.java:41)
	at org.junit.Assert.assertFalse(Assert.java:64)
	at org.junit.Assert.assertFalse(Assert.java:74)
	at org.apache.commons.lang3.tuple.MutableTripleTest.testEquals(MutableTripleTest.java:83)

