[INFO] Scanning for projects...
[INFO]                                                                         
[INFO] ------------------------------------------------------------------------
[INFO] Building Apache Commons Lang 3.4
[INFO] ------------------------------------------------------------------------
[INFO] 
[INFO] --- maven-enforcer-plugin:1.3.1:enforce (enforce-maven-3) @ commons-lang3 ---
[INFO] 
[INFO] --- build-helper-maven-plugin:1.8:parse-version (parse-version) @ commons-lang3 ---
[INFO] 
[INFO] --- maven-antrun-plugin:1.8:run (javadoc.resources) @ commons-lang3 ---
[INFO] Executing tasks

main:
[INFO] Executed tasks
[INFO] 
[INFO] --- maven-remote-resources-plugin:1.5:process (default) @ commons-lang3 ---
[INFO] 
[INFO] --- buildnumber-maven-plugin:1.3:create (default) @ commons-lang3 ---
[INFO] Executing: /bin/sh -c cd /home/perham/Study/LittleDarwin/Cases/commons-lang3-3.4-src && svn --non-interactive info
[INFO] Working directory: /home/perham/Study/LittleDarwin/Cases/commons-lang3-3.4-src
[INFO] Storing buildNumber: ?????? at timestamp: 1438770476297
[INFO] Executing: /bin/sh -c cd /home/perham/Study/LittleDarwin/Cases/commons-lang3-3.4-src && svn --non-interactive info
[INFO] Working directory: /home/perham/Study/LittleDarwin/Cases/commons-lang3-3.4-src
[INFO] Storing buildScmBranch: UNKNOWN_BRANCH
[INFO] 
[INFO] --- maven-resources-plugin:2.7:resources (default-resources) @ commons-lang3 ---
[INFO] Using 'ISO-8859-1' encoding to copy filtered resources.
[INFO] Copying 0 resource
[INFO] Copying 2 resources to META-INF
[INFO] 
[INFO] --- maven-compiler-plugin:3.2:compile (default-compile) @ commons-lang3 ---
[INFO] Changes detected - recompiling the module!
[INFO] Compiling 133 source files to /home/perham/Study/LittleDarwin/Cases/commons-lang3-3.4-src/target/classes
[INFO] /home/perham/Study/LittleDarwin/Cases/commons-lang3-3.4-src/src/main/java/org/apache/commons/lang3/SerializationUtils.java: /home/perham/Study/LittleDarwin/Cases/commons-lang3-3.4-src/src/main/java/org/apache/commons/lang3/SerializationUtils.java uses unchecked or unsafe operations.
[INFO] /home/perham/Study/LittleDarwin/Cases/commons-lang3-3.4-src/src/main/java/org/apache/commons/lang3/SerializationUtils.java: Recompile with -Xlint:unchecked for details.
[INFO] 
[INFO] --- maven-bundle-plugin:2.5.3:manifest (bundle-manifest) @ commons-lang3 ---
[INFO] 
[INFO] --- animal-sniffer-maven-plugin:1.13:check (checkAPIcompatibility) @ commons-lang3 ---
[INFO] Checking unresolved references to org.codehaus.mojo.signature:java16:1.0
[INFO] 
[INFO] --- maven-resources-plugin:2.7:testResources (default-testResources) @ commons-lang3 ---
[INFO] Using 'ISO-8859-1' encoding to copy filtered resources.
[INFO] Copying 2 resources
[INFO] Copying 2 resources to META-INF
[INFO] 
[INFO] --- maven-compiler-plugin:3.2:testCompile (default-testCompile) @ commons-lang3 ---
[INFO] Nothing to compile - all classes are up to date
[INFO] 
[INFO] --- maven-surefire-plugin:2.18:test (default-test) @ commons-lang3 ---
[INFO] Surefire report directory: /home/perham/Study/LittleDarwin/Cases/commons-lang3-3.4-src/target/surefire-reports

-------------------------------------------------------
 T E S T S
-------------------------------------------------------
Running org.apache.commons.lang3.ValidateTest
Tests run: 63, Failures: 0, Errors: 0, Skipped: 0, Time elapsed: 0.13 sec - in org.apache.commons.lang3.ValidateTest
Running org.apache.commons.lang3.LocaleUtilsTest
Tests run: 15, Failures: 0, Errors: 0, Skipped: 0, Time elapsed: 0.039 sec - in org.apache.commons.lang3.LocaleUtilsTest
Running org.apache.commons.lang3.tuple.MutableTripleTest
Tests run: 8, Failures: 0, Errors: 0, Skipped: 0, Time elapsed: 0.035 sec - in org.apache.commons.lang3.tuple.MutableTripleTest
Running org.apache.commons.lang3.tuple.TripleTest
Tests run: 10, Failures: 0, Errors: 0, Skipped: 0, Time elapsed: 0.011 sec - in org.apache.commons.lang3.tuple.TripleTest
Running org.apache.commons.lang3.tuple.ImmutablePairTest
Tests run: 6, Failures: 0, Errors: 0, Skipped: 0, Time elapsed: 0 sec - in org.apache.commons.lang3.tuple.ImmutablePairTest
Running org.apache.commons.lang3.tuple.MutablePairTest
Tests run: 8, Failures: 0, Errors: 0, Skipped: 0, Time elapsed: 0.001 sec - in org.apache.commons.lang3.tuple.MutablePairTest
Running org.apache.commons.lang3.tuple.ImmutableTripleTest
Tests run: 6, Failures: 0, Errors: 0, Skipped: 0, Time elapsed: 0 sec - in org.apache.commons.lang3.tuple.ImmutableTripleTest
Running org.apache.commons.lang3.tuple.PairTest
Tests run: 9, Failures: 0, Errors: 0, Skipped: 0, Time elapsed: 0.021 sec - in org.apache.commons.lang3.tuple.PairTest
Running org.apache.commons.lang3.StringUtilsIsTest
Tests run: 8, Failures: 0, Errors: 0, Skipped: 0, Time elapsed: 0 sec - in org.apache.commons.lang3.StringUtilsIsTest
Running org.apache.commons.lang3.JavaVersionTest
Tests run: 3, Failures: 0, Errors: 0, Skipped: 0, Time elapsed: 0 sec - in org.apache.commons.lang3.JavaVersionTest
Running org.apache.commons.lang3.builder.NoFieldNamesToStringStyleTest
Tests run: 8, Failures: 0, Errors: 0, Skipped: 0, Time elapsed: 0 sec - in org.apache.commons.lang3.builder.NoFieldNamesToStringStyleTest
Running org.apache.commons.lang3.builder.ShortPrefixToStringStyleTest
Tests run: 8, Failures: 0, Errors: 0, Skipped: 0, Time elapsed: 0.009 sec - in org.apache.commons.lang3.builder.ShortPrefixToStringStyleTest
Running org.apache.commons.lang3.builder.DiffResultTest
Tests run: 9, Failures: 0, Errors: 0, Skipped: 0, Time elapsed: 0.007 sec - in org.apache.commons.lang3.builder.DiffResultTest
Running org.apache.commons.lang3.builder.CompareToBuilderTest
Tests run: 48, Failures: 0, Errors: 0, Skipped: 0, Time elapsed: 0.045 sec - in org.apache.commons.lang3.builder.CompareToBuilderTest
Running org.apache.commons.lang3.builder.MultilineRecursiveToStringStyleTest
Tests run: 10, Failures: 0, Errors: 0, Skipped: 0, Time elapsed: 0.014 sec - in org.apache.commons.lang3.builder.MultilineRecursiveToStringStyleTest
Running org.apache.commons.lang3.builder.RecursiveToStringStyleTest
Tests run: 8, Failures: 0, Errors: 0, Skipped: 0, Time elapsed: 0.027 sec - in org.apache.commons.lang3.builder.RecursiveToStringStyleTest
Running org.apache.commons.lang3.builder.DefaultToStringStyleTest
Tests run: 8, Failures: 0, Errors: 0, Skipped: 0, Time elapsed: 0.005 sec - in org.apache.commons.lang3.builder.DefaultToStringStyleTest
Running org.apache.commons.lang3.builder.ReflectionToStringBuilderExcludeTest
Tests run: 11, Failures: 0, Errors: 0, Skipped: 0, Time elapsed: 0 sec - in org.apache.commons.lang3.builder.ReflectionToStringBuilderExcludeTest
Running org.apache.commons.lang3.builder.StandardToStringStyleTest
Tests run: 8, Failures: 0, Errors: 0, Skipped: 0, Time elapsed: 0.004 sec - in org.apache.commons.lang3.builder.StandardToStringStyleTest
Running org.apache.commons.lang3.builder.ToStringStyleTest
Tests run: 12, Failures: 0, Errors: 0, Skipped: 0, Time elapsed: 0.013 sec - in org.apache.commons.lang3.builder.ToStringStyleTest
Running org.apache.commons.lang3.builder.DiffTest
Tests run: 4, Failures: 0, Errors: 0, Skipped: 0, Time elapsed: 0.003 sec - in org.apache.commons.lang3.builder.DiffTest
Running org.apache.commons.lang3.builder.SimpleToStringStyleTest
Tests run: 8, Failures: 0, Errors: 0, Skipped: 0, Time elapsed: 0.006 sec - in org.apache.commons.lang3.builder.SimpleToStringStyleTest
Running org.apache.commons.lang3.builder.MultiLineToStringStyleTest
Tests run: 8, Failures: 0, Errors: 0, Skipped: 0, Time elapsed: 0.011 sec - in org.apache.commons.lang3.builder.MultiLineToStringStyleTest
Running org.apache.commons.lang3.builder.ToStringStyleConcurrencyTest
Tests run: 3, Failures: 0, Errors: 0, Skipped: 0, Time elapsed: 7.669 sec - in org.apache.commons.lang3.builder.ToStringStyleConcurrencyTest
Running org.apache.commons.lang3.builder.ReflectionToStringBuilderMutateInspectConcurrencyTest
Tests run: 1, Failures: 0, Errors: 0, Skipped: 1, Time elapsed: 0 sec - in org.apache.commons.lang3.builder.ReflectionToStringBuilderMutateInspectConcurrencyTest
Running org.apache.commons.lang3.builder.ToStringBuilderTest
Tests run: 74, Failures: 0, Errors: 0, Skipped: 1, Time elapsed: 0.073 sec - in org.apache.commons.lang3.builder.ToStringBuilderTest
Running org.apache.commons.lang3.builder.EqualsBuilderTest
Tests run: 48, Failures: 0, Errors: 0, Skipped: 0, Time elapsed: 0.048 sec - in org.apache.commons.lang3.builder.EqualsBuilderTest
Running org.apache.commons.lang3.builder.HashCodeBuilderAndEqualsBuilderTest
Tests run: 4, Failures: 0, Errors: 0, Skipped: 0, Time elapsed: 0.024 sec - in org.apache.commons.lang3.builder.HashCodeBuilderAndEqualsBuilderTest
Running org.apache.commons.lang3.builder.ReflectionToStringBuilderConcurrencyTest
Tests run: 3, Failures: 0, Errors: 0, Skipped: 3, Time elapsed: 0 sec - in org.apache.commons.lang3.builder.ReflectionToStringBuilderConcurrencyTest
Running org.apache.commons.lang3.builder.JsonToStringStyleTest
Tests run: 9, Failures: 0, Errors: 0, Skipped: 0, Time elapsed: 0.004 sec - in org.apache.commons.lang3.builder.JsonToStringStyleTest
Running org.apache.commons.lang3.builder.NoClassNameToStringStyleTest
Tests run: 8, Failures: 0, Errors: 0, Skipped: 0, Time elapsed: 0.003 sec - in org.apache.commons.lang3.builder.NoClassNameToStringStyleTest
Running org.apache.commons.lang3.builder.DiffBuilderTest
Tests run: 30, Failures: 0, Errors: 0, Skipped: 0, Time elapsed: 0.041 sec - in org.apache.commons.lang3.builder.DiffBuilderTest
Running org.apache.commons.lang3.builder.HashCodeBuilderTest
Tests run: 44, Failures: 0, Errors: 0, Skipped: 0, Time elapsed: 0.016 sec - in org.apache.commons.lang3.builder.HashCodeBuilderTest
Running org.apache.commons.lang3.concurrent.AtomicInitializerTest
Tests run: 3, Failures: 0, Errors: 0, Skipped: 0, Time elapsed: 0.024 sec - in org.apache.commons.lang3.concurrent.AtomicInitializerTest
Running org.apache.commons.lang3.concurrent.CallableBackgroundInitializerTest
Tests run: 4, Failures: 0, Errors: 0, Skipped: 0, Time elapsed: 0.002 sec - in org.apache.commons.lang3.concurrent.CallableBackgroundInitializerTest
Running org.apache.commons.lang3.concurrent.BackgroundInitializerTest
Tests run: 15, Failures: 0, Errors: 0, Skipped: 0, Time elapsed: 0.033 sec - in org.apache.commons.lang3.concurrent.BackgroundInitializerTest
Running org.apache.commons.lang3.concurrent.LazyInitializerTest
Tests run: 3, Failures: 0, Errors: 0, Skipped: 0, Time elapsed: 0.014 sec - in org.apache.commons.lang3.concurrent.LazyInitializerTest
Running org.apache.commons.lang3.concurrent.BasicThreadFactoryTest
Tests run: 15, Failures: 0, Errors: 0, Skipped: 0, Time elapsed: 0.042 sec - in org.apache.commons.lang3.concurrent.BasicThreadFactoryTest
Running org.apache.commons.lang3.concurrent.ConstantInitializerTest
Tests run: 7, Failures: 0, Errors: 0, Skipped: 0, Time elapsed: 0.002 sec - in org.apache.commons.lang3.concurrent.ConstantInitializerTest
Running org.apache.commons.lang3.concurrent.MultiBackgroundInitializerTest
Tests run: 17, Failures: 0, Errors: 0, Skipped: 0, Time elapsed: 0.167 sec - in org.apache.commons.lang3.concurrent.MultiBackgroundInitializerTest
Running org.apache.commons.lang3.concurrent.AtomicSafeInitializerTest
Tests run: 4, Failures: 0, Errors: 0, Skipped: 0, Time elapsed: 0.035 sec - in org.apache.commons.lang3.concurrent.AtomicSafeInitializerTest
Running org.apache.commons.lang3.concurrent.ConcurrentUtilsTest
Tests run: 40, Failures: 0, Errors: 0, Skipped: 0, Time elapsed: 0.021 sec - in org.apache.commons.lang3.concurrent.ConcurrentUtilsTest
Running org.apache.commons.lang3.concurrent.TimedSemaphoreTest
Tests run: 15, Failures: 0, Errors: 0, Skipped: 0, Time elapsed: 1.219 sec - in org.apache.commons.lang3.concurrent.TimedSemaphoreTest
Running org.apache.commons.lang3.StringUtilsSubstringTest
Tests run: 14, Failures: 0, Errors: 0, Skipped: 0, Time elapsed: 0.011 sec - in org.apache.commons.lang3.StringUtilsSubstringTest
Running org.apache.commons.lang3.SystemUtilsTest
Tests run: 12, Failures: 0, Errors: 0, Skipped: 0, Time elapsed: 0.004 sec - in org.apache.commons.lang3.SystemUtilsTest
Running org.apache.commons.lang3.CharRangeTest
Tests run: 16, Failures: 0, Errors: 0, Skipped: 0, Time elapsed: 0.045 sec - in org.apache.commons.lang3.CharRangeTest
Running org.apache.commons.lang3.CharSetTest
Tests run: 14, Failures: 0, Errors: 0, Skipped: 0, Time elapsed: 0.015 sec - in org.apache.commons.lang3.CharSetTest
Running org.apache.commons.lang3.StringUtilsStartsEndsWithTest
Tests run: 6, Failures: 0, Errors: 0, Skipped: 0, Time elapsed: 0.005 sec - in org.apache.commons.lang3.StringUtilsStartsEndsWithTest
Running org.apache.commons.lang3.RandomStringUtilsTest
Tests run: 11, Failures: 0, Errors: 0, Skipped: 0, Time elapsed: 0.057 sec - in org.apache.commons.lang3.RandomStringUtilsTest
Running org.apache.commons.lang3.SerializationUtilsTest
Tests run: 26, Failures: 0, Errors: 0, Skipped: 0, Time elapsed: 0.086 sec - in org.apache.commons.lang3.SerializationUtilsTest
Running org.apache.commons.lang3.time.StopWatchTest
Tests run: 8, Failures: 0, Errors: 0, Skipped: 0, Time elapsed: 4.763 sec - in org.apache.commons.lang3.time.StopWatchTest
Running org.apache.commons.lang3.time.DateUtilsRoundingTest
Tests run: 22, Failures: 0, Errors: 22, Skipped: 0, Time elapsed: 0.02 sec <<< FAILURE! - in org.apache.commons.lang3.time.DateUtilsRoundingTest
testRoundMilliSecond(org.apache.commons.lang3.time.DateUtilsRoundingTest)  Time elapsed: 0.007 sec  <<< ERROR!
java.lang.ExceptionInInitializerError: null
	at java.util.concurrent.ConcurrentHashMap.hash(ConcurrentHashMap.java:333)
	at java.util.concurrent.ConcurrentHashMap.get(ConcurrentHashMap.java:988)
	at java.text.DateFormatSymbols.initializeData(DateFormatSymbols.java:656)
	at java.text.DateFormatSymbols.<init>(DateFormatSymbols.java:141)
	at org.apache.commons.lang3.time.FastDatePrinter.parsePattern(FastDatePrinter.java:182)
	at org.apache.commons.lang3.time.FastDatePrinter.init(FastDatePrinter.java:162)
	at org.apache.commons.lang3.time.FastDatePrinter.<init>(FastDatePrinter.java:155)
	at org.apache.commons.lang3.time.FastDateFormat.<init>(FastDateFormat.java:394)
	at org.apache.commons.lang3.time.FastDateFormat.<init>(FastDateFormat.java:379)
	at org.apache.commons.lang3.time.FastDateFormat$1.createInstance(FastDateFormat.java:101)
	at org.apache.commons.lang3.time.FastDateFormat$1.createInstance(FastDateFormat.java:98)
	at org.apache.commons.lang3.time.FormatCache.getInstance(FormatCache.java:26)
	at org.apache.commons.lang3.time.FastDateFormat.getInstance(FastDateFormat.java:129)
	at org.apache.commons.lang3.time.DateFormatUtils.<clinit>(DateFormatUtils.java:47)
	at org.apache.commons.lang3.time.DateUtilsRoundingTest.<init>(DateUtilsRoundingTest.java:55)

testRoundDayOfMonth(org.apache.commons.lang3.time.DateUtilsRoundingTest)  Time elapsed: 0 sec  <<< ERROR!
java.lang.NoClassDefFoundError: Could not initialize class org.apache.commons.lang3.time.DateFormatUtils
	at org.apache.commons.lang3.time.DateUtilsRoundingTest.<init>(DateUtilsRoundingTest.java:55)

testRoundMinute(org.apache.commons.lang3.time.DateUtilsRoundingTest)  Time elapsed: 0 sec  <<< ERROR!
java.lang.NoClassDefFoundError: Could not initialize class org.apache.commons.lang3.time.DateFormatUtils
	at org.apache.commons.lang3.time.DateUtilsRoundingTest.<init>(DateUtilsRoundingTest.java:55)

testRoundSecond(org.apache.commons.lang3.time.DateUtilsRoundingTest)  Time elapsed: 0 sec  <<< ERROR!
java.lang.NoClassDefFoundError: Could not initialize class org.apache.commons.lang3.time.DateFormatUtils
	at org.apache.commons.lang3.time.DateUtilsRoundingTest.<init>(DateUtilsRoundingTest.java:55)

testRoundMonth(org.apache.commons.lang3.time.DateUtilsRoundingTest)  Time elapsed: 0 sec  <<< ERROR!
java.lang.NoClassDefFoundError: Could not initialize class org.apache.commons.lang3.time.DateFormatUtils
	at org.apache.commons.lang3.time.DateUtilsRoundingTest.<init>(DateUtilsRoundingTest.java:55)

testTruncateSemiMonth(org.apache.commons.lang3.time.DateUtilsRoundingTest)  Time elapsed: 0.001 sec  <<< ERROR!
java.lang.NoClassDefFoundError: Could not initialize class org.apache.commons.lang3.time.DateFormatUtils
	at org.apache.commons.lang3.time.DateUtilsRoundingTest.<init>(DateUtilsRoundingTest.java:55)

testTruncateMinute(org.apache.commons.lang3.time.DateUtilsRoundingTest)  Time elapsed: 0 sec  <<< ERROR!
java.lang.NoClassDefFoundError: Could not initialize class org.apache.commons.lang3.time.DateFormatUtils
	at org.apache.commons.lang3.time.DateUtilsRoundingTest.<init>(DateUtilsRoundingTest.java:55)

testRoundSemiMonth(org.apache.commons.lang3.time.DateUtilsRoundingTest)  Time elapsed: 0 sec  <<< ERROR!
java.lang.NoClassDefFoundError: Could not initialize class org.apache.commons.lang3.time.DateFormatUtils
	at org.apache.commons.lang3.time.DateUtilsRoundingTest.<init>(DateUtilsRoundingTest.java:55)

testTruncateSecond(org.apache.commons.lang3.time.DateUtilsRoundingTest)  Time elapsed: 0 sec  <<< ERROR!
java.lang.NoClassDefFoundError: Could not initialize class org.apache.commons.lang3.time.DateFormatUtils
	at org.apache.commons.lang3.time.DateUtilsRoundingTest.<init>(DateUtilsRoundingTest.java:55)

testRoundAmPm(org.apache.commons.lang3.time.DateUtilsRoundingTest)  Time elapsed: 0 sec  <<< ERROR!
java.lang.NoClassDefFoundError: Could not initialize class org.apache.commons.lang3.time.DateFormatUtils
	at org.apache.commons.lang3.time.DateUtilsRoundingTest.<init>(DateUtilsRoundingTest.java:55)

testRoundDate(org.apache.commons.lang3.time.DateUtilsRoundingTest)  Time elapsed: 0 sec  <<< ERROR!
java.lang.NoClassDefFoundError: Could not initialize class org.apache.commons.lang3.time.DateFormatUtils
	at org.apache.commons.lang3.time.DateUtilsRoundingTest.<init>(DateUtilsRoundingTest.java:55)

testRoundHour(org.apache.commons.lang3.time.DateUtilsRoundingTest)  Time elapsed: 0 sec  <<< ERROR!
java.lang.NoClassDefFoundError: Could not initialize class org.apache.commons.lang3.time.DateFormatUtils
	at org.apache.commons.lang3.time.DateUtilsRoundingTest.<init>(DateUtilsRoundingTest.java:55)

testRoundYear(org.apache.commons.lang3.time.DateUtilsRoundingTest)  Time elapsed: 0.001 sec  <<< ERROR!
java.lang.NoClassDefFoundError: Could not initialize class org.apache.commons.lang3.time.DateFormatUtils
	at org.apache.commons.lang3.time.DateUtilsRoundingTest.<init>(DateUtilsRoundingTest.java:55)

testTruncateMilliSecond(org.apache.commons.lang3.time.DateUtilsRoundingTest)  Time elapsed: 0 sec  <<< ERROR!
java.lang.NoClassDefFoundError: Could not initialize class org.apache.commons.lang3.time.DateFormatUtils
	at org.apache.commons.lang3.time.DateUtilsRoundingTest.<init>(DateUtilsRoundingTest.java:55)

testTruncateHourOfDay(org.apache.commons.lang3.time.DateUtilsRoundingTest)  Time elapsed: 0 sec  <<< ERROR!
java.lang.NoClassDefFoundError: Could not initialize class org.apache.commons.lang3.time.DateFormatUtils
	at org.apache.commons.lang3.time.DateUtilsRoundingTest.<init>(DateUtilsRoundingTest.java:55)

testTruncateMonth(org.apache.commons.lang3.time.DateUtilsRoundingTest)  Time elapsed: 0 sec  <<< ERROR!
java.lang.NoClassDefFoundError: Could not initialize class org.apache.commons.lang3.time.DateFormatUtils
	at org.apache.commons.lang3.time.DateUtilsRoundingTest.<init>(DateUtilsRoundingTest.java:55)

testRoundHourOfDay(org.apache.commons.lang3.time.DateUtilsRoundingTest)  Time elapsed: 0.003 sec  <<< ERROR!
java.lang.NoClassDefFoundError: Could not initialize class org.apache.commons.lang3.time.DateFormatUtils
	at org.apache.commons.lang3.time.DateUtilsRoundingTest.<init>(DateUtilsRoundingTest.java:55)

testTruncateAmPm(org.apache.commons.lang3.time.DateUtilsRoundingTest)  Time elapsed: 0 sec  <<< ERROR!
java.lang.NoClassDefFoundError: Could not initialize class org.apache.commons.lang3.time.DateFormatUtils
	at org.apache.commons.lang3.time.DateUtilsRoundingTest.<init>(DateUtilsRoundingTest.java:55)

testTruncateDate(org.apache.commons.lang3.time.DateUtilsRoundingTest)  Time elapsed: 0 sec  <<< ERROR!
java.lang.NoClassDefFoundError: Could not initialize class org.apache.commons.lang3.time.DateFormatUtils
	at org.apache.commons.lang3.time.DateUtilsRoundingTest.<init>(DateUtilsRoundingTest.java:55)

testTruncateHour(org.apache.commons.lang3.time.DateUtilsRoundingTest)  Time elapsed: 0 sec  <<< ERROR!
java.lang.NoClassDefFoundError: Could not initialize class org.apache.commons.lang3.time.DateFormatUtils
	at org.apache.commons.lang3.time.DateUtilsRoundingTest.<init>(DateUtilsRoundingTest.java:55)

testTruncateYear(org.apache.commons.lang3.time.DateUtilsRoundingTest)  Time elapsed: 0 sec  <<< ERROR!
java.lang.NoClassDefFoundError: Could not initialize class org.apache.commons.lang3.time.DateFormatUtils
	at org.apache.commons.lang3.time.DateUtilsRoundingTest.<init>(DateUtilsRoundingTest.java:55)

testTruncateDayOfMonth(org.apache.commons.lang3.time.DateUtilsRoundingTest)  Time elapsed: 0 sec  <<< ERROR!
java.lang.NoClassDefFoundError: Could not initialize class org.apache.commons.lang3.time.DateFormatUtils
	at org.apache.commons.lang3.time.DateUtilsRoundingTest.<init>(DateUtilsRoundingTest.java:55)

Running org.apache.commons.lang3.time.FastDateParserTest
Tests run: 33, Failures: 0, Errors: 0, Skipped: 0, Time elapsed: 2.685 sec - in org.apache.commons.lang3.time.FastDateParserTest
Running org.apache.commons.lang3.time.FastDateFormat_ParserTest
Tests run: 33, Failures: 10, Errors: 0, Skipped: 0, Time elapsed: 0.67 sec <<< FAILURE! - in org.apache.commons.lang3.time.FastDateFormat_ParserTest
testLocaleMatches(org.apache.commons.lang3.time.FastDateFormat_ParserTest)  Time elapsed: 0.002 sec  <<< FAILURE!
java.lang.AssertionError: expected:<sv_SE> but was:<en_US>
	at org.junit.Assert.fail(Assert.java:88)
	at org.junit.Assert.failNotEquals(Assert.java:834)
	at org.junit.Assert.assertEquals(Assert.java:118)
	at org.junit.Assert.assertEquals(Assert.java:144)
	at org.apache.commons.lang3.time.FastDateParserTest.testLocaleMatches(FastDateParserTest.java:564)
	at sun.reflect.NativeMethodAccessorImpl.invoke0(Native Method)
	at sun.reflect.NativeMethodAccessorImpl.invoke(NativeMethodAccessorImpl.java:57)
	at sun.reflect.DelegatingMethodAccessorImpl.invoke(DelegatingMethodAccessorImpl.java:43)
	at java.lang.reflect.Method.invoke(Method.java:606)
	at org.junit.runners.model.FrameworkMethod$1.runReflectiveCall(FrameworkMethod.java:50)
	at org.junit.internal.runners.model.ReflectiveCallable.run(ReflectiveCallable.java:12)
	at org.junit.runners.model.FrameworkMethod.invokeExplosively(FrameworkMethod.java:47)
	at org.junit.internal.runners.statements.InvokeMethod.evaluate(InvokeMethod.java:17)
	at org.junit.runners.ParentRunner.runLeaf(ParentRunner.java:325)
	at org.junit.runners.BlockJUnit4ClassRunner.runChild(BlockJUnit4ClassRunner.java:78)
	at org.junit.runners.BlockJUnit4ClassRunner.runChild(BlockJUnit4ClassRunner.java:57)
	at org.junit.runners.ParentRunner$3.run(ParentRunner.java:290)
	at org.junit.runners.ParentRunner$1.schedule(ParentRunner.java:71)
	at org.junit.runners.ParentRunner.runChildren(ParentRunner.java:288)
	at org.junit.runners.ParentRunner.access$000(ParentRunner.java:58)
	at org.junit.runners.ParentRunner$2.evaluate(ParentRunner.java:268)
	at org.junit.runners.ParentRunner.run(ParentRunner.java:363)
	at org.apache.maven.surefire.junit4.JUnit4Provider.execute(JUnit4Provider.java:283)
	at org.apache.maven.surefire.junit4.JUnit4Provider.executeWithRerun(JUnit4Provider.java:173)
	at org.apache.maven.surefire.junit4.JUnit4Provider.executeTestSet(JUnit4Provider.java:153)
	at org.apache.maven.surefire.junit4.JUnit4Provider.invoke(JUnit4Provider.java:128)
	at org.apache.maven.surefire.booter.ForkedBooter.invokeProviderInSameClassLoader(ForkedBooter.java:203)
	at org.apache.maven.surefire.booter.ForkedBooter.runSuitesInProcess(ForkedBooter.java:155)
	at org.apache.maven.surefire.booter.ForkedBooter.main(ForkedBooter.java:103)

testLocales_Long_AD(org.apache.commons.lang3.time.FastDateFormat_ParserTest)  Time elapsed: 0.001 sec  <<< FAILURE!
java.lang.AssertionError: Locale ms_MY failed with GGGG/yyyy/MMMM/dddd/hhhh/mmmm/ss/aaaa/EEEE era AD
java.text.ParseException: Unparseable date: "CE/2003/Februari/0010/0012/0000/00/AM/Isnin" does not m...
	at org.junit.Assert.fail(Assert.java:88)
	at org.apache.commons.lang3.time.FastDateParserTest.testLocales(FastDateParserTest.java:340)
	at org.apache.commons.lang3.time.FastDateParserTest.testLocales_Long_AD(FastDateParserTest.java:283)
	at sun.reflect.NativeMethodAccessorImpl.invoke0(Native Method)
	at sun.reflect.NativeMethodAccessorImpl.invoke(NativeMethodAccessorImpl.java:57)
	at sun.reflect.DelegatingMethodAccessorImpl.invoke(DelegatingMethodAccessorImpl.java:43)
	at java.lang.reflect.Method.invoke(Method.java:606)
	at org.junit.runners.model.FrameworkMethod$1.runReflectiveCall(FrameworkMethod.java:50)
	at org.junit.internal.runners.model.ReflectiveCallable.run(ReflectiveCallable.java:12)
	at org.junit.runners.model.FrameworkMethod.invokeExplosively(FrameworkMethod.java:47)
	at org.junit.internal.runners.statements.InvokeMethod.evaluate(InvokeMethod.java:17)
	at org.junit.runners.ParentRunner.runLeaf(ParentRunner.java:325)
	at org.junit.runners.BlockJUnit4ClassRunner.runChild(BlockJUnit4ClassRunner.java:78)
	at org.junit.runners.BlockJUnit4ClassRunner.runChild(BlockJUnit4ClassRunner.java:57)
	at org.junit.runners.ParentRunner$3.run(ParentRunner.java:290)
	at org.junit.runners.ParentRunner$1.schedule(ParentRunner.java:71)
	at org.junit.runners.ParentRunner.runChildren(ParentRunner.java:288)
	at org.junit.runners.ParentRunner.access$000(ParentRunner.java:58)
	at org.junit.runners.ParentRunner$2.evaluate(ParentRunner.java:268)
	at org.junit.runners.ParentRunner.run(ParentRunner.java:363)
	at org.apache.maven.surefire.junit4.JUnit4Provider.execute(JUnit4Provider.java:283)
	at org.apache.maven.surefire.junit4.JUnit4Provider.executeWithRerun(JUnit4Provider.java:173)
	at org.apache.maven.surefire.junit4.JUnit4Provider.executeTestSet(JUnit4Provider.java:153)
	at org.apache.maven.surefire.junit4.JUnit4Provider.invoke(JUnit4Provider.java:128)
	at org.apache.maven.surefire.booter.ForkedBooter.invokeProviderInSameClassLoader(ForkedBooter.java:203)
	at org.apache.maven.surefire.booter.ForkedBooter.runSuitesInProcess(ForkedBooter.java:155)
	at org.apache.maven.surefire.booter.ForkedBooter.main(ForkedBooter.java:103)

testLocales_Long_BC(org.apache.commons.lang3.time.FastDateFormat_ParserTest)  Time elapsed: 0.001 sec  <<< FAILURE!
java.lang.AssertionError: Locale ms_MY failed with GGGG/yyyy/MMMM/dddd/hhhh/mmmm/ss/aaaa/EEEE era BC
java.text.ParseException: Unparseable date: "BCE/2003/Februari/0010/0012/0000/00/AM/Sabtu" does not ...
	at org.junit.Assert.fail(Assert.java:88)
	at org.apache.commons.lang3.time.FastDateParserTest.testLocales(FastDateParserTest.java:340)
	at org.apache.commons.lang3.time.FastDateParserTest.testLocales_Long_BC(FastDateParserTest.java:288)
	at sun.reflect.NativeMethodAccessorImpl.invoke0(Native Method)
	at sun.reflect.NativeMethodAccessorImpl.invoke(NativeMethodAccessorImpl.java:57)
	at sun.reflect.DelegatingMethodAccessorImpl.invoke(DelegatingMethodAccessorImpl.java:43)
	at java.lang.reflect.Method.invoke(Method.java:606)
	at org.junit.runners.model.FrameworkMethod$1.runReflectiveCall(FrameworkMethod.java:50)
	at org.junit.internal.runners.model.ReflectiveCallable.run(ReflectiveCallable.java:12)
	at org.junit.runners.model.FrameworkMethod.invokeExplosively(FrameworkMethod.java:47)
	at org.junit.internal.runners.statements.InvokeMethod.evaluate(InvokeMethod.java:17)
	at org.junit.runners.ParentRunner.runLeaf(ParentRunner.java:325)
	at org.junit.runners.BlockJUnit4ClassRunner.runChild(BlockJUnit4ClassRunner.java:78)
	at org.junit.runners.BlockJUnit4ClassRunner.runChild(BlockJUnit4ClassRunner.java:57)
	at org.junit.runners.ParentRunner$3.run(ParentRunner.java:290)
	at org.junit.runners.ParentRunner$1.schedule(ParentRunner.java:71)
	at org.junit.runners.ParentRunner.runChildren(ParentRunner.java:288)
	at org.junit.runners.ParentRunner.access$000(ParentRunner.java:58)
	at org.junit.runners.ParentRunner$2.evaluate(ParentRunner.java:268)
	at org.junit.runners.ParentRunner.run(ParentRunner.java:363)
	at org.apache.maven.surefire.junit4.JUnit4Provider.execute(JUnit4Provider.java:283)
	at org.apache.maven.surefire.junit4.JUnit4Provider.executeWithRerun(JUnit4Provider.java:173)
	at org.apache.maven.surefire.junit4.JUnit4Provider.executeTestSet(JUnit4Provider.java:153)
	at org.apache.maven.surefire.junit4.JUnit4Provider.invoke(JUnit4Provider.java:128)
	at org.apache.maven.surefire.booter.ForkedBooter.invokeProviderInSameClassLoader(ForkedBooter.java:203)
	at org.apache.maven.surefire.booter.ForkedBooter.runSuitesInProcess(ForkedBooter.java:155)
	at org.apache.maven.surefire.booter.ForkedBooter.main(ForkedBooter.java:103)

test_Equality_Hash(org.apache.commons.lang3.time.FastDateFormat_ParserTest)  Time elapsed: 0.001 sec  <<< FAILURE!
java.lang.AssertionError: expected:<5> but was:<6>
	at org.junit.Assert.fail(Assert.java:88)
	at org.junit.Assert.failNotEquals(Assert.java:834)
	at org.junit.Assert.assertEquals(Assert.java:645)
	at org.junit.Assert.assertEquals(Assert.java:631)
	at org.apache.commons.lang3.time.FastDateParserTest.test_Equality_Hash(FastDateParserTest.java:112)
	at sun.reflect.NativeMethodAccessorImpl.invoke0(Native Method)
	at sun.reflect.NativeMethodAccessorImpl.invoke(NativeMethodAccessorImpl.java:57)
	at sun.reflect.DelegatingMethodAccessorImpl.invoke(DelegatingMethodAccessorImpl.java:43)
	at java.lang.reflect.Method.invoke(Method.java:606)
	at org.junit.runners.model.FrameworkMethod$1.runReflectiveCall(FrameworkMethod.java:50)
	at org.junit.internal.runners.model.ReflectiveCallable.run(ReflectiveCallable.java:12)
	at org.junit.runners.model.FrameworkMethod.invokeExplosively(FrameworkMethod.java:47)
	at org.junit.internal.runners.statements.InvokeMethod.evaluate(InvokeMethod.java:17)
	at org.junit.runners.ParentRunner.runLeaf(ParentRunner.java:325)
	at org.junit.runners.BlockJUnit4ClassRunner.runChild(BlockJUnit4ClassRunner.java:78)
	at org.junit.runners.BlockJUnit4ClassRunner.runChild(BlockJUnit4ClassRunner.java:57)
	at org.junit.runners.ParentRunner$3.run(ParentRunner.java:290)
	at org.junit.runners.ParentRunner$1.schedule(ParentRunner.java:71)
	at org.junit.runners.ParentRunner.runChildren(ParentRunner.java:288)
	at org.junit.runners.ParentRunner.access$000(ParentRunner.java:58)
	at org.junit.runners.ParentRunner$2.evaluate(ParentRunner.java:268)
	at org.junit.runners.ParentRunner.run(ParentRunner.java:363)
	at org.apache.maven.surefire.junit4.JUnit4Provider.execute(JUnit4Provider.java:283)
	at org.apache.maven.surefire.junit4.JUnit4Provider.executeWithRerun(JUnit4Provider.java:173)
	at org.apache.maven.surefire.junit4.JUnit4Provider.executeTestSet(JUnit4Provider.java:153)
	at org.apache.maven.surefire.junit4.JUnit4Provider.invoke(JUnit4Provider.java:128)
	at org.apache.maven.surefire.booter.ForkedBooter.invokeProviderInSameClassLoader(ForkedBooter.java:203)
	at org.apache.maven.surefire.booter.ForkedBooter.runSuitesInProcess(ForkedBooter.java:155)
	at org.apache.maven.surefire.booter.ForkedBooter.main(ForkedBooter.java:103)

testLocales_ShortNoEra_AD(org.apache.commons.lang3.time.FastDateFormat_ParserTest)  Time elapsed: 0.001 sec  <<< FAILURE!
java.lang.AssertionError: Locale ms_MY failed with y/M/d/h/a/m/s/E era AD
java.text.ParseException: Unparseable date: "2003/2/10/12/AM/0/0/Isn" does not match (\p{Nd}++)\Q/\E...
	at org.junit.Assert.fail(Assert.java:88)
	at org.apache.commons.lang3.time.FastDateParserTest.testLocales(FastDateParserTest.java:340)
	at org.apache.commons.lang3.time.FastDateParserTest.testLocales_ShortNoEra_AD(FastDateParserTest.java:313)
	at sun.reflect.NativeMethodAccessorImpl.invoke0(Native Method)
	at sun.reflect.NativeMethodAccessorImpl.invoke(NativeMethodAccessorImpl.java:57)
	at sun.reflect.DelegatingMethodAccessorImpl.invoke(DelegatingMethodAccessorImpl.java:43)
	at java.lang.reflect.Method.invoke(Method.java:606)
	at org.junit.runners.model.FrameworkMethod$1.runReflectiveCall(FrameworkMethod.java:50)
	at org.junit.internal.runners.model.ReflectiveCallable.run(ReflectiveCallable.java:12)
	at org.junit.runners.model.FrameworkMethod.invokeExplosively(FrameworkMethod.java:47)
	at org.junit.internal.runners.statements.InvokeMethod.evaluate(InvokeMethod.java:17)
	at org.junit.runners.ParentRunner.runLeaf(ParentRunner.java:325)
	at org.junit.runners.BlockJUnit4ClassRunner.runChild(BlockJUnit4ClassRunner.java:78)
	at org.junit.runners.BlockJUnit4ClassRunner.runChild(BlockJUnit4ClassRunner.java:57)
	at org.junit.runners.ParentRunner$3.run(ParentRunner.java:290)
	at org.junit.runners.ParentRunner$1.schedule(ParentRunner.java:71)
	at org.junit.runners.ParentRunner.runChildren(ParentRunner.java:288)
	at org.junit.runners.ParentRunner.access$000(ParentRunner.java:58)
	at org.junit.runners.ParentRunner$2.evaluate(ParentRunner.java:268)
	at org.junit.runners.ParentRunner.run(ParentRunner.java:363)
	at org.apache.maven.surefire.junit4.JUnit4Provider.execute(JUnit4Provider.java:283)
	at org.apache.maven.surefire.junit4.JUnit4Provider.executeWithRerun(JUnit4Provider.java:173)
	at org.apache.maven.surefire.junit4.JUnit4Provider.executeTestSet(JUnit4Provider.java:153)
	at org.apache.maven.surefire.junit4.JUnit4Provider.invoke(JUnit4Provider.java:128)
	at org.apache.maven.surefire.booter.ForkedBooter.invokeProviderInSameClassLoader(ForkedBooter.java:203)
	at org.apache.maven.surefire.booter.ForkedBooter.runSuitesInProcess(ForkedBooter.java:155)
	at org.apache.maven.surefire.booter.ForkedBooter.main(ForkedBooter.java:103)

testLocales_ShortNoEra_BC(org.apache.commons.lang3.time.FastDateFormat_ParserTest)  Time elapsed: 0.001 sec  <<< FAILURE!
java.lang.AssertionError: Locale ms_MY failed with y/M/d/h/a/m/s/E era BC
java.text.ParseException: Unparseable date: "2003/2/10/12/AM/0/0/Sab" does not match (\p{Nd}++)\Q/\E...
	at org.junit.Assert.fail(Assert.java:88)
	at org.apache.commons.lang3.time.FastDateParserTest.testLocales(FastDateParserTest.java:340)
	at org.apache.commons.lang3.time.FastDateParserTest.testLocales_ShortNoEra_BC(FastDateParserTest.java:318)
	at sun.reflect.NativeMethodAccessorImpl.invoke0(Native Method)
	at sun.reflect.NativeMethodAccessorImpl.invoke(NativeMethodAccessorImpl.java:57)
	at sun.reflect.DelegatingMethodAccessorImpl.invoke(DelegatingMethodAccessorImpl.java:43)
	at java.lang.reflect.Method.invoke(Method.java:606)
	at org.junit.runners.model.FrameworkMethod$1.runReflectiveCall(FrameworkMethod.java:50)
	at org.junit.internal.runners.model.ReflectiveCallable.run(ReflectiveCallable.java:12)
	at org.junit.runners.model.FrameworkMethod.invokeExplosively(FrameworkMethod.java:47)
	at org.junit.internal.runners.statements.InvokeMethod.evaluate(InvokeMethod.java:17)
	at org.junit.runners.ParentRunner.runLeaf(ParentRunner.java:325)
	at org.junit.runners.BlockJUnit4ClassRunner.runChild(BlockJUnit4ClassRunner.java:78)
	at org.junit.runners.BlockJUnit4ClassRunner.runChild(BlockJUnit4ClassRunner.java:57)
	at org.junit.runners.ParentRunner$3.run(ParentRunner.java:290)
	at org.junit.runners.ParentRunner$1.schedule(ParentRunner.java:71)
	at org.junit.runners.ParentRunner.runChildren(ParentRunner.java:288)
	at org.junit.runners.ParentRunner.access$000(ParentRunner.java:58)
	at org.junit.runners.ParentRunner$2.evaluate(ParentRunner.java:268)
	at org.junit.runners.ParentRunner.run(ParentRunner.java:363)
	at org.apache.maven.surefire.junit4.JUnit4Provider.execute(JUnit4Provider.java:283)
	at org.apache.maven.surefire.junit4.JUnit4Provider.executeWithRerun(JUnit4Provider.java:173)
	at org.apache.maven.surefire.junit4.JUnit4Provider.executeTestSet(JUnit4Provider.java:153)
	at org.apache.maven.surefire.junit4.JUnit4Provider.invoke(JUnit4Provider.java:128)
	at org.apache.maven.surefire.booter.ForkedBooter.invokeProviderInSameClassLoader(ForkedBooter.java:203)
	at org.apache.maven.surefire.booter.ForkedBooter.runSuitesInProcess(ForkedBooter.java:155)
	at org.apache.maven.surefire.booter.ForkedBooter.main(ForkedBooter.java:103)

testLocales_LongNoEra_AD(org.apache.commons.lang3.time.FastDateFormat_ParserTest)  Time elapsed: 0.001 sec  <<< FAILURE!
java.lang.AssertionError: Locale ms_MY failed with yyyy/MMMM/dddd/hhhh/mmmm/ss/aaaa/EEEE era AD
java.text.ParseException: Unparseable date: "2003/Februari/0010/0012/0000/00/AM/Isnin" does not matc...
	at org.junit.Assert.fail(Assert.java:88)
	at org.apache.commons.lang3.time.FastDateParserTest.testLocales(FastDateParserTest.java:340)
	at org.apache.commons.lang3.time.FastDateParserTest.testLocales_LongNoEra_AD(FastDateParserTest.java:303)
	at sun.reflect.NativeMethodAccessorImpl.invoke0(Native Method)
	at sun.reflect.NativeMethodAccessorImpl.invoke(NativeMethodAccessorImpl.java:57)
	at sun.reflect.DelegatingMethodAccessorImpl.invoke(DelegatingMethodAccessorImpl.java:43)
	at java.lang.reflect.Method.invoke(Method.java:606)
	at org.junit.runners.model.FrameworkMethod$1.runReflectiveCall(FrameworkMethod.java:50)
	at org.junit.internal.runners.model.ReflectiveCallable.run(ReflectiveCallable.java:12)
	at org.junit.runners.model.FrameworkMethod.invokeExplosively(FrameworkMethod.java:47)
	at org.junit.internal.runners.statements.InvokeMethod.evaluate(InvokeMethod.java:17)
	at org.junit.runners.ParentRunner.runLeaf(ParentRunner.java:325)
	at org.junit.runners.BlockJUnit4ClassRunner.runChild(BlockJUnit4ClassRunner.java:78)
	at org.junit.runners.BlockJUnit4ClassRunner.runChild(BlockJUnit4ClassRunner.java:57)
	at org.junit.runners.ParentRunner$3.run(ParentRunner.java:290)
	at org.junit.runners.ParentRunner$1.schedule(ParentRunner.java:71)
	at org.junit.runners.ParentRunner.runChildren(ParentRunner.java:288)
	at org.junit.runners.ParentRunner.access$000(ParentRunner.java:58)
	at org.junit.runners.ParentRunner$2.evaluate(ParentRunner.java:268)
	at org.junit.runners.ParentRunner.run(ParentRunner.java:363)
	at org.apache.maven.surefire.junit4.JUnit4Provider.execute(JUnit4Provider.java:283)
	at org.apache.maven.surefire.junit4.JUnit4Provider.executeWithRerun(JUnit4Provider.java:173)
	at org.apache.maven.surefire.junit4.JUnit4Provider.executeTestSet(JUnit4Provider.java:153)
	at org.apache.maven.surefire.junit4.JUnit4Provider.invoke(JUnit4Provider.java:128)
	at org.apache.maven.surefire.booter.ForkedBooter.invokeProviderInSameClassLoader(ForkedBooter.java:203)
	at org.apache.maven.surefire.booter.ForkedBooter.runSuitesInProcess(ForkedBooter.java:155)
	at org.apache.maven.surefire.booter.ForkedBooter.main(ForkedBooter.java:103)

testLocales_LongNoEra_BC(org.apache.commons.lang3.time.FastDateFormat_ParserTest)  Time elapsed: 0 sec  <<< FAILURE!
java.lang.AssertionError: Locale ms_MY failed with yyyy/MMMM/dddd/hhhh/mmmm/ss/aaaa/EEEE era BC
java.text.ParseException: Unparseable date: "2003/Februari/0010/0012/0000/00/AM/Sabtu" does not matc...
	at org.junit.Assert.fail(Assert.java:88)
	at org.apache.commons.lang3.time.FastDateParserTest.testLocales(FastDateParserTest.java:340)
	at org.apache.commons.lang3.time.FastDateParserTest.testLocales_LongNoEra_BC(FastDateParserTest.java:308)
	at sun.reflect.NativeMethodAccessorImpl.invoke0(Native Method)
	at sun.reflect.NativeMethodAccessorImpl.invoke(NativeMethodAccessorImpl.java:57)
	at sun.reflect.DelegatingMethodAccessorImpl.invoke(DelegatingMethodAccessorImpl.java:43)
	at java.lang.reflect.Method.invoke(Method.java:606)
	at org.junit.runners.model.FrameworkMethod$1.runReflectiveCall(FrameworkMethod.java:50)
	at org.junit.internal.runners.model.ReflectiveCallable.run(ReflectiveCallable.java:12)
	at org.junit.runners.model.FrameworkMethod.invokeExplosively(FrameworkMethod.java:47)
	at org.junit.internal.runners.statements.InvokeMethod.evaluate(InvokeMethod.java:17)
	at org.junit.runners.ParentRunner.runLeaf(ParentRunner.java:325)
	at org.junit.runners.BlockJUnit4ClassRunner.runChild(BlockJUnit4ClassRunner.java:78)
	at org.junit.runners.BlockJUnit4ClassRunner.runChild(BlockJUnit4ClassRunner.java:57)
	at org.junit.runners.ParentRunner$3.run(ParentRunner.java:290)
	at org.junit.runners.ParentRunner$1.schedule(ParentRunner.java:71)
	at org.junit.runners.ParentRunner.runChildren(ParentRunner.java:288)
	at org.junit.runners.ParentRunner.access$000(ParentRunner.java:58)
	at org.junit.runners.ParentRunner$2.evaluate(ParentRunner.java:268)
	at org.junit.runners.ParentRunner.run(ParentRunner.java:363)
	at org.apache.maven.surefire.junit4.JUnit4Provider.execute(JUnit4Provider.java:283)
	at org.apache.maven.surefire.junit4.JUnit4Provider.executeWithRerun(JUnit4Provider.java:173)
	at org.apache.maven.surefire.junit4.JUnit4Provider.executeTestSet(JUnit4Provider.java:153)
	at org.apache.maven.surefire.junit4.JUnit4Provider.invoke(JUnit4Provider.java:128)
	at org.apache.maven.surefire.booter.ForkedBooter.invokeProviderInSameClassLoader(ForkedBooter.java:203)
	at org.apache.maven.surefire.booter.ForkedBooter.runSuitesInProcess(ForkedBooter.java:155)
	at org.apache.maven.surefire.booter.ForkedBooter.main(ForkedBooter.java:103)

testLocales_Short_AD(org.apache.commons.lang3.time.FastDateFormat_ParserTest)  Time elapsed: 0.001 sec  <<< FAILURE!
java.lang.AssertionError: Locale ms_MY failed with G/y/M/d/h/a/m/s/E era AD
java.text.ParseException: Unparseable date: "CE/2003/2/10/12/AM/0/0/Isn" does not match ((?iu)\Qad\E...
	at org.junit.Assert.fail(Assert.java:88)
	at org.apache.commons.lang3.time.FastDateParserTest.testLocales(FastDateParserTest.java:340)
	at org.apache.commons.lang3.time.FastDateParserTest.testLocales_Short_AD(FastDateParserTest.java:293)
	at sun.reflect.NativeMethodAccessorImpl.invoke0(Native Method)
	at sun.reflect.NativeMethodAccessorImpl.invoke(NativeMethodAccessorImpl.java:57)
	at sun.reflect.DelegatingMethodAccessorImpl.invoke(DelegatingMethodAccessorImpl.java:43)
	at java.lang.reflect.Method.invoke(Method.java:606)
	at org.junit.runners.model.FrameworkMethod$1.runReflectiveCall(FrameworkMethod.java:50)
	at org.junit.internal.runners.model.ReflectiveCallable.run(ReflectiveCallable.java:12)
	at org.junit.runners.model.FrameworkMethod.invokeExplosively(FrameworkMethod.java:47)
	at org.junit.internal.runners.statements.InvokeMethod.evaluate(InvokeMethod.java:17)
	at org.junit.runners.ParentRunner.runLeaf(ParentRunner.java:325)
	at org.junit.runners.BlockJUnit4ClassRunner.runChild(BlockJUnit4ClassRunner.java:78)
	at org.junit.runners.BlockJUnit4ClassRunner.runChild(BlockJUnit4ClassRunner.java:57)
	at org.junit.runners.ParentRunner$3.run(ParentRunner.java:290)
	at org.junit.runners.ParentRunner$1.schedule(ParentRunner.java:71)
	at org.junit.runners.ParentRunner.runChildren(ParentRunner.java:288)
	at org.junit.runners.ParentRunner.access$000(ParentRunner.java:58)
	at org.junit.runners.ParentRunner$2.evaluate(ParentRunner.java:268)
	at org.junit.runners.ParentRunner.run(ParentRunner.java:363)
	at org.apache.maven.surefire.junit4.JUnit4Provider.execute(JUnit4Provider.java:283)
	at org.apache.maven.surefire.junit4.JUnit4Provider.executeWithRerun(JUnit4Provider.java:173)
	at org.apache.maven.surefire.junit4.JUnit4Provider.executeTestSet(JUnit4Provider.java:153)
	at org.apache.maven.surefire.junit4.JUnit4Provider.invoke(JUnit4Provider.java:128)
	at org.apache.maven.surefire.booter.ForkedBooter.invokeProviderInSameClassLoader(ForkedBooter.java:203)
	at org.apache.maven.surefire.booter.ForkedBooter.runSuitesInProcess(ForkedBooter.java:155)
	at org.apache.maven.surefire.booter.ForkedBooter.main(ForkedBooter.java:103)

testLocales_Short_BC(org.apache.commons.lang3.time.FastDateFormat_ParserTest)  Time elapsed: 0 sec  <<< FAILURE!
java.lang.AssertionError: Locale ms_MY failed with G/y/M/d/h/a/m/s/E era BC
java.text.ParseException: Unparseable date: "BCE/2003/2/10/12/AM/0/0/Sab" does not match ((?iu)\Qad\...
	at org.junit.Assert.fail(Assert.java:88)
	at org.apache.commons.lang3.time.FastDateParserTest.testLocales(FastDateParserTest.java:340)
	at org.apache.commons.lang3.time.FastDateParserTest.testLocales_Short_BC(FastDateParserTest.java:298)
	at sun.reflect.NativeMethodAccessorImpl.invoke0(Native Method)
	at sun.reflect.NativeMethodAccessorImpl.invoke(NativeMethodAccessorImpl.java:57)
	at sun.reflect.DelegatingMethodAccessorImpl.invoke(DelegatingMethodAccessorImpl.java:43)
	at java.lang.reflect.Method.invoke(Method.java:606)
	at org.junit.runners.model.FrameworkMethod$1.runReflectiveCall(FrameworkMethod.java:50)
	at org.junit.internal.runners.model.ReflectiveCallable.run(ReflectiveCallable.java:12)
	at org.junit.runners.model.FrameworkMethod.invokeExplosively(FrameworkMethod.java:47)
	at org.junit.internal.runners.statements.InvokeMethod.evaluate(InvokeMethod.java:17)
	at org.junit.runners.ParentRunner.runLeaf(ParentRunner.java:325)
	at org.junit.runners.BlockJUnit4ClassRunner.runChild(BlockJUnit4ClassRunner.java:78)
	at org.junit.runners.BlockJUnit4ClassRunner.runChild(BlockJUnit4ClassRunner.java:57)
	at org.junit.runners.ParentRunner$3.run(ParentRunner.java:290)
	at org.junit.runners.ParentRunner$1.schedule(ParentRunner.java:71)
	at org.junit.runners.ParentRunner.runChildren(ParentRunner.java:288)
	at org.junit.runners.ParentRunner.access$000(ParentRunner.java:58)
	at org.junit.runners.ParentRunner$2.evaluate(ParentRunner.java:268)
	at org.junit.runners.ParentRunner.run(ParentRunner.java:363)
	at org.apache.maven.surefire.junit4.JUnit4Provider.execute(JUnit4Provider.java:283)
	at org.apache.maven.surefire.junit4.JUnit4Provider.executeWithRerun(JUnit4Provider.java:173)
	at org.apache.maven.surefire.junit4.JUnit4Provider.executeTestSet(JUnit4Provider.java:153)
	at org.apache.maven.surefire.junit4.JUnit4Provider.invoke(JUnit4Provider.java:128)
	at org.apache.maven.surefire.booter.ForkedBooter.invokeProviderInSameClassLoader(ForkedBooter.java:203)
	at org.apache.maven.surefire.booter.ForkedBooter.runSuitesInProcess(ForkedBooter.java:155)
	at org.apache.maven.surefire.booter.ForkedBooter.main(ForkedBooter.java:103)

Running org.apache.commons.lang3.time.DurationFormatUtilsTest
Tests run: 25, Failures: 0, Errors: 1, Skipped: 0, Time elapsed: 0.653 sec <<< FAILURE! - in org.apache.commons.lang3.time.DurationFormatUtilsTest
testFormatPeriodISO(org.apache.commons.lang3.time.DurationFormatUtilsTest)  Time elapsed: 0 sec  <<< ERROR!
java.lang.NoClassDefFoundError: Could not initialize class org.apache.commons.lang3.time.DateFormatUtils
	at org.apache.commons.lang3.time.DurationFormatUtilsTest.testFormatPeriodISO(DurationFormatUtilsTest.java:269)

Running org.apache.commons.lang3.time.DateFormatUtilsTest
Tests run: 10, Failures: 0, Errors: 10, Skipped: 0, Time elapsed: 0.004 sec <<< FAILURE! - in org.apache.commons.lang3.time.DateFormatUtilsTest
testFormatUTC(org.apache.commons.lang3.time.DateFormatUtilsTest)  Time elapsed: 0 sec  <<< ERROR!
java.lang.NoClassDefFoundError: Could not initialize class org.apache.commons.lang3.time.DateFormatUtils
	at org.apache.commons.lang3.time.DateFormatUtilsTest.testFormatUTC(DateFormatUtilsTest.java:99)

testTimeISO(org.apache.commons.lang3.time.DateFormatUtilsTest)  Time elapsed: 0 sec  <<< ERROR!
java.lang.NoClassDefFoundError: Could not initialize class org.apache.commons.lang3.time.DateFormatUtils
	at org.apache.commons.lang3.time.DateFormatUtilsTest.testTimeISO(DateFormatUtilsTest.java:169)

testFormatCalendar(org.apache.commons.lang3.time.DateFormatUtilsTest)  Time elapsed: 0.001 sec  <<< ERROR!
java.lang.NoClassDefFoundError: Could not initialize class org.apache.commons.lang3.time.DateFormatUtils
	at org.apache.commons.lang3.time.DateFormatUtilsTest.testFormatCalendar(DateFormatUtilsTest.java:86)

testSMTP(org.apache.commons.lang3.time.DateFormatUtilsTest)  Time elapsed: 0 sec  <<< ERROR!
java.lang.NoClassDefFoundError: Could not initialize class org.apache.commons.lang3.time.DateFormatUtils
	at org.apache.commons.lang3.time.DateFormatUtilsTest.testSMTP(DateFormatUtilsTest.java:217)

testDateTimeISO(org.apache.commons.lang3.time.DateFormatUtilsTest)  Time elapsed: 0.001 sec  <<< ERROR!
java.lang.NoClassDefFoundError: Could not initialize class org.apache.commons.lang3.time.DateFormatUtils
	at org.apache.commons.lang3.time.DateFormatUtilsTest.testDateTimeISO(DateFormatUtilsTest.java:113)

testLANG1000(org.apache.commons.lang3.time.DateFormatUtilsTest)  Time elapsed: 0 sec  <<< ERROR!
java.lang.NoClassDefFoundError: Could not initialize class org.apache.commons.lang3.time.DateFormatUtils
	at org.apache.commons.lang3.time.DateFormatUtilsTest.testLANG1000(DateFormatUtilsTest.java:266)

testTimeNoTISO(org.apache.commons.lang3.time.DateFormatUtilsTest)  Time elapsed: 0 sec  <<< ERROR!
java.lang.NoClassDefFoundError: Could not initialize class org.apache.commons.lang3.time.DateFormatUtils
	at org.apache.commons.lang3.time.DateFormatUtilsTest.testTimeNoTISO(DateFormatUtilsTest.java:193)

testDateISO(org.apache.commons.lang3.time.DateFormatUtilsTest)  Time elapsed: 0.001 sec  <<< ERROR!
java.lang.NoClassDefFoundError: Could not initialize class org.apache.commons.lang3.time.DateFormatUtils
	at org.apache.commons.lang3.time.DateFormatUtilsTest.testDateISO(DateFormatUtilsTest.java:145)

testFormat(org.apache.commons.lang3.time.DateFormatUtilsTest)  Time elapsed: 0 sec  <<< ERROR!
java.lang.NoClassDefFoundError: Could not initialize class org.apache.commons.lang3.time.DateFormatUtils
	at org.apache.commons.lang3.time.DateFormatUtilsTest.testFormat(DateFormatUtilsTest.java:62)

testConstructor(org.apache.commons.lang3.time.DateFormatUtilsTest)  Time elapsed: 0 sec  <<< ERROR!
java.lang.NoClassDefFoundError: Could not initialize class org.apache.commons.lang3.time.DateFormatUtils
	at org.apache.commons.lang3.time.DateFormatUtilsTest.testConstructor(DateFormatUtilsTest.java:39)

Running org.apache.commons.lang3.time.DateUtilsFragmentTest
Tests run: 57, Failures: 0, Errors: 0, Skipped: 0, Time elapsed: 0.013 sec - in org.apache.commons.lang3.time.DateUtilsFragmentTest
Running org.apache.commons.lang3.time.FastDatePrinterTimeZonesTest
Tests run: 617, Failures: 0, Errors: 617, Skipped: 0, Time elapsed: 0.3 sec <<< FAILURE! - in org.apache.commons.lang3.time.FastDatePrinterTimeZonesTest
testCalendarTimezoneRespected[0](org.apache.commons.lang3.time.FastDatePrinterTimeZonesTest)  Time elapsed: 0.001 sec  <<< ERROR!
java.lang.NullPointerException: null

testCalendarTimezoneRespected[1](org.apache.commons.lang3.time.FastDatePrinterTimeZonesTest)  Time elapsed: 0.001 sec  <<< ERROR!
java.lang.NullPointerException: null

testCalendarTimezoneRespected[2](org.apache.commons.lang3.time.FastDatePrinterTimeZonesTest)  Time elapsed: 0.001 sec  <<< ERROR!
java.lang.NullPointerException: null

testCalendarTimezoneRespected[3](org.apache.commons.lang3.time.FastDatePrinterTimeZonesTest)  Time elapsed: 0 sec  <<< ERROR!
java.lang.NullPointerException: null

testCalendarTimezoneRespected[4](org.apache.commons.lang3.time.FastDatePrinterTimeZonesTest)  Time elapsed: 0.001 sec  <<< ERROR!
java.lang.NullPointerException: null

testCalendarTimezoneRespected[5](org.apache.commons.lang3.time.FastDatePrinterTimeZonesTest)  Time elapsed: 0 sec  <<< ERROR!
java.lang.NullPointerException: null

testCalendarTimezoneRespected[6](org.apache.commons.lang3.time.FastDatePrinterTimeZonesTest)  Time elapsed: 0 sec  <<< ERROR!
java.lang.NullPointerException: null

testCalendarTimezoneRespected[7](org.apache.commons.lang3.time.FastDatePrinterTimeZonesTest)  Time elapsed: 0.001 sec  <<< ERROR!
java.lang.NullPointerException: null

testCalendarTimezoneRespected[8](org.apache.commons.lang3.time.FastDatePrinterTimeZonesTest)  Time elapsed: 0 sec  <<< ERROR!
java.lang.NullPointerException: null

testCalendarTimezoneRespected[9](org.apache.commons.lang3.time.FastDatePrinterTimeZonesTest)  Time elapsed: 0 sec  <<< ERROR!
java.lang.NullPointerException: null

testCalendarTimezoneRespected[10](org.apache.commons.lang3.time.FastDatePrinterTimeZonesTest)  Time elapsed: 0 sec  <<< ERROR!
java.lang.NullPointerException: null

testCalendarTimezoneRespected[11](org.apache.commons.lang3.time.FastDatePrinterTimeZonesTest)  Time elapsed: 0 sec  <<< ERROR!
java.lang.NullPointerException: null

testCalendarTimezoneRespected[12](org.apache.commons.lang3.time.FastDatePrinterTimeZonesTest)  Time elapsed: 0 sec  <<< ERROR!
java.lang.NullPointerException: null

testCalendarTimezoneRespected[13](org.apache.commons.lang3.time.FastDatePrinterTimeZonesTest)  Time elapsed: 0 sec  <<< ERROR!
java.lang.NullPointerException: null

testCalendarTimezoneRespected[14](org.apache.commons.lang3.time.FastDatePrinterTimeZonesTest)  Time elapsed: 0 sec  <<< ERROR!
java.lang.NullPointerException: null

testCalendarTimezoneRespected[15](org.apache.commons.lang3.time.FastDatePrinterTimeZonesTest)  Time elapsed: 0.001 sec  <<< ERROR!
java.lang.NullPointerException: null

testCalendarTimezoneRespected[16](org.apache.commons.lang3.time.FastDatePrinterTimeZonesTest)  Time elapsed: 0 sec  <<< ERROR!
java.lang.NullPointerException: null

testCalendarTimezoneRespected[17](org.apache.commons.lang3.time.FastDatePrinterTimeZonesTest)  Time elapsed: 0 sec  <<< ERROR!
java.lang.NullPointerException: null

testCalendarTimezoneRespected[18](org.apache.commons.lang3.time.FastDatePrinterTimeZonesTest)  Time elapsed: 0 sec  <<< ERROR!
java.lang.NullPointerException: null

testCalendarTimezoneRespected[19](org.apache.commons.lang3.time.FastDatePrinterTimeZonesTest)  Time elapsed: 0 sec  <<< ERROR!
java.lang.NullPointerException: null

testCalendarTimezoneRespected[20](org.apache.commons.lang3.time.FastDatePrinterTimeZonesTest)  Time elapsed: 0 sec  <<< ERROR!
java.lang.NullPointerException: null

testCalendarTimezoneRespected[21](org.apache.commons.lang3.time.FastDatePrinterTimeZonesTest)  Time elapsed: 0.001 sec  <<< ERROR!
java.lang.NullPointerException: null

testCalendarTimezoneRespected[22](org.apache.commons.lang3.time.FastDatePrinterTimeZonesTest)  Time elapsed: 0 sec  <<< ERROR!
java.lang.NullPointerException: null

testCalendarTimezoneRespected[23](org.apache.commons.lang3.time.FastDatePrinterTimeZonesTest)  Time elapsed: 0 sec  <<< ERROR!
java.lang.NullPointerException: null

testCalendarTimezoneRespected[24](org.apache.commons.lang3.time.FastDatePrinterTimeZonesTest)  Time elapsed: 0 sec  <<< ERROR!
java.lang.NullPointerException: null

testCalendarTimezoneRespected[25](org.apache.commons.lang3.time.FastDatePrinterTimeZonesTest)  Time elapsed: 0 sec  <<< ERROR!
java.lang.NullPointerException: null

testCalendarTimezoneRespected[26](org.apache.commons.lang3.time.FastDatePrinterTimeZonesTest)  Time elapsed: 0 sec  <<< ERROR!
java.lang.NullPointerException: null

testCalendarTimezoneRespected[27](org.apache.commons.lang3.time.FastDatePrinterTimeZonesTest)  Time elapsed: 0 sec  <<< ERROR!
java.lang.NullPointerException: null

testCalendarTimezoneRespected[28](org.apache.commons.lang3.time.FastDatePrinterTimeZonesTest)  Time elapsed: 0 sec  <<< ERROR!
java.lang.NullPointerException: null

testCalendarTimezoneRespected[29](org.apache.commons.lang3.time.FastDatePrinterTimeZonesTest)  Time elapsed: 0.001 sec  <<< ERROR!
java.lang.NullPointerException: null

testCalendarTimezoneRespected[30](org.apache.commons.lang3.time.FastDatePrinterTimeZonesTest)  Time elapsed: 0 sec  <<< ERROR!
java.lang.NullPointerException: null

testCalendarTimezoneRespected[31](org.apache.commons.lang3.time.FastDatePrinterTimeZonesTest)  Time elapsed: 0 sec  <<< ERROR!
java.lang.NullPointerException: null

testCalendarTimezoneRespected[32](org.apache.commons.lang3.time.FastDatePrinterTimeZonesTest)  Time elapsed: 0 sec  <<< ERROR!
java.lang.NullPointerException: null

testCalendarTimezoneRespected[33](org.apache.commons.lang3.time.FastDatePrinterTimeZonesTest)  Time elapsed: 0 sec  <<< ERROR!
java.lang.NullPointerException: null

testCalendarTimezoneRespected[34](org.apache.commons.lang3.time.FastDatePrinterTimeZonesTest)  Time elapsed: 0 sec  <<< ERROR!
java.lang.NullPointerException: null

testCalendarTimezoneRespected[35](org.apache.commons.lang3.time.FastDatePrinterTimeZonesTest)  Time elapsed: 0 sec  <<< ERROR!
java.lang.NullPointerException: null

testCalendarTimezoneRespected[36](org.apache.commons.lang3.time.FastDatePrinterTimeZonesTest)  Time elapsed: 0 sec  <<< ERROR!
java.lang.NullPointerException: null

testCalendarTimezoneRespected[37](org.apache.commons.lang3.time.FastDatePrinterTimeZonesTest)  Time elapsed: 0 sec  <<< ERROR!
java.lang.NullPointerException: null

testCalendarTimezoneRespected[38](org.apache.commons.lang3.time.FastDatePrinterTimeZonesTest)  Time elapsed: 0 sec  <<< ERROR!
java.lang.NullPointerException: null

testCalendarTimezoneRespected[39](org.apache.commons.lang3.time.FastDatePrinterTimeZonesTest)  Time elapsed: 0.001 sec  <<< ERROR!
java.lang.NullPointerException: null

testCalendarTimezoneRespected[40](org.apache.commons.lang3.time.FastDatePrinterTimeZonesTest)  Time elapsed: 0 sec  <<< ERROR!
java.lang.NullPointerException: null

testCalendarTimezoneRespected[41](org.apache.commons.lang3.time.FastDatePrinterTimeZonesTest)  Time elapsed: 0 sec  <<< ERROR!
java.lang.NullPointerException: null

testCalendarTimezoneRespected[42](org.apache.commons.lang3.time.FastDatePrinterTimeZonesTest)  Time elapsed: 0 sec  <<< ERROR!
java.lang.NullPointerException: null

testCalendarTimezoneRespected[43](org.apache.commons.lang3.time.FastDatePrinterTimeZonesTest)  Time elapsed: 0 sec  <<< ERROR!
java.lang.NullPointerException: null

testCalendarTimezoneRespected[44](org.apache.commons.lang3.time.FastDatePrinterTimeZonesTest)  Time elapsed: 0 sec  <<< ERROR!
java.lang.NullPointerException: null

testCalendarTimezoneRespected[45](org.apache.commons.lang3.time.FastDatePrinterTimeZonesTest)  Time elapsed: 0.001 sec  <<< ERROR!
java.lang.NullPointerException: null

testCalendarTimezoneRespected[46](org.apache.commons.lang3.time.FastDatePrinterTimeZonesTest)  Time elapsed: 0 sec  <<< ERROR!
java.lang.NullPointerException: null

testCalendarTimezoneRespected[47](org.apache.commons.lang3.time.FastDatePrinterTimeZonesTest)  Time elapsed: 0 sec  <<< ERROR!
java.lang.NullPointerException: null

testCalendarTimezoneRespected[48](org.apache.commons.lang3.time.FastDatePrinterTimeZonesTest)  Time elapsed: 0 sec  <<< ERROR!
java.lang.NullPointerException: null

testCalendarTimezoneRespected[49](org.apache.commons.lang3.time.FastDatePrinterTimeZonesTest)  Time elapsed: 0 sec  <<< ERROR!
java.lang.NullPointerException: null

testCalendarTimezoneRespected[50](org.apache.commons.lang3.time.FastDatePrinterTimeZonesTest)  Time elapsed: 0 sec  <<< ERROR!
java.lang.NullPointerException: null

testCalendarTimezoneRespected[51](org.apache.commons.lang3.time.FastDatePrinterTimeZonesTest)  Time elapsed: 0.001 sec  <<< ERROR!
java.lang.NullPointerException: null

testCalendarTimezoneRespected[52](org.apache.commons.lang3.time.FastDatePrinterTimeZonesTest)  Time elapsed: 0 sec  <<< ERROR!
java.lang.NullPointerException: null

testCalendarTimezoneRespected[53](org.apache.commons.lang3.time.FastDatePrinterTimeZonesTest)  Time elapsed: 0.001 sec  <<< ERROR!
java.lang.NullPointerException: null

testCalendarTimezoneRespected[54](org.apache.commons.lang3.time.FastDatePrinterTimeZonesTest)  Time elapsed: 0 sec  <<< ERROR!
java.lang.NullPointerException: null

testCalendarTimezoneRespected[55](org.apache.commons.lang3.time.FastDatePrinterTimeZonesTest)  Time elapsed: 0.001 sec  <<< ERROR!
java.lang.NullPointerException: null

testCalendarTimezoneRespected[56](org.apache.commons.lang3.time.FastDatePrinterTimeZonesTest)  Time elapsed: 0 sec  <<< ERROR!
java.lang.NullPointerException: null

testCalendarTimezoneRespected[57](org.apache.commons.lang3.time.FastDatePrinterTimeZonesTest)  Time elapsed: 0.001 sec  <<< ERROR!
java.lang.NullPointerException: null

testCalendarTimezoneRespected[58](org.apache.commons.lang3.time.FastDatePrinterTimeZonesTest)  Time elapsed: 0 sec  <<< ERROR!
java.lang.NullPointerException: null

testCalendarTimezoneRespected[59](org.apache.commons.lang3.time.FastDatePrinterTimeZonesTest)  Time elapsed: 0.001 sec  <<< ERROR!
java.lang.NullPointerException: null

testCalendarTimezoneRespected[60](org.apache.commons.lang3.time.FastDatePrinterTimeZonesTest)  Time elapsed: 0 sec  <<< ERROR!
java.lang.NullPointerException: null

testCalendarTimezoneRespected[61](org.apache.commons.lang3.time.FastDatePrinterTimeZonesTest)  Time elapsed: 0.001 sec  <<< ERROR!
java.lang.NullPointerException: null

testCalendarTimezoneRespected[62](org.apache.commons.lang3.time.FastDatePrinterTimeZonesTest)  Time elapsed: 0 sec  <<< ERROR!
java.lang.NullPointerException: null

testCalendarTimezoneRespected[63](org.apache.commons.lang3.time.FastDatePrinterTimeZonesTest)  Time elapsed: 0 sec  <<< ERROR!
java.lang.NullPointerException: null

testCalendarTimezoneRespected[64](org.apache.commons.lang3.time.FastDatePrinterTimeZonesTest)  Time elapsed: 0.001 sec  <<< ERROR!
java.lang.NullPointerException: null

testCalendarTimezoneRespected[65](org.apache.commons.lang3.time.FastDatePrinterTimeZonesTest)  Time elapsed: 0 sec  <<< ERROR!
java.lang.NullPointerException: null

testCalendarTimezoneRespected[66](org.apache.commons.lang3.time.FastDatePrinterTimeZonesTest)  Time elapsed: 0 sec  <<< ERROR!
java.lang.NullPointerException: null

testCalendarTimezoneRespected[67](org.apache.commons.lang3.time.FastDatePrinterTimeZonesTest)  Time elapsed: 0.001 sec  <<< ERROR!
java.lang.NullPointerException: null

testCalendarTimezoneRespected[68](org.apache.commons.lang3.time.FastDatePrinterTimeZonesTest)  Time elapsed: 0 sec  <<< ERROR!
java.lang.NullPointerException: null

testCalendarTimezoneRespected[69](org.apache.commons.lang3.time.FastDatePrinterTimeZonesTest)  Time elapsed: 0 sec  <<< ERROR!
java.lang.NullPointerException: null

testCalendarTimezoneRespected[70](org.apache.commons.lang3.time.FastDatePrinterTimeZonesTest)  Time elapsed: 0 sec  <<< ERROR!
java.lang.NullPointerException: null

testCalendarTimezoneRespected[71](org.apache.commons.lang3.time.FastDatePrinterTimeZonesTest)  Time elapsed: 0 sec  <<< ERROR!
java.lang.NullPointerException: null

testCalendarTimezoneRespected[72](org.apache.commons.lang3.time.FastDatePrinterTimeZonesTest)  Time elapsed: 0 sec  <<< ERROR!
java.lang.NullPointerException: null

testCalendarTimezoneRespected[73](org.apache.commons.lang3.time.FastDatePrinterTimeZonesTest)  Time elapsed: 0 sec  <<< ERROR!
java.lang.NullPointerException: null

testCalendarTimezoneRespected[74](org.apache.commons.lang3.time.FastDatePrinterTimeZonesTest)  Time elapsed: 0 sec  <<< ERROR!
java.lang.NullPointerException: null

testCalendarTimezoneRespected[75](org.apache.commons.lang3.time.FastDatePrinterTimeZonesTest)  Time elapsed: 0 sec  <<< ERROR!
java.lang.NullPointerException: null

testCalendarTimezoneRespected[76](org.apache.commons.lang3.time.FastDatePrinterTimeZonesTest)  Time elapsed: 0.001 sec  <<< ERROR!
java.lang.NullPointerException: null

testCalendarTimezoneRespected[77](org.apache.commons.lang3.time.FastDatePrinterTimeZonesTest)  Time elapsed: 0 sec  <<< ERROR!
java.lang.NullPointerException: null

testCalendarTimezoneRespected[78](org.apache.commons.lang3.time.FastDatePrinterTimeZonesTest)  Time elapsed: 0 sec  <<< ERROR!
java.lang.NullPointerException: null

testCalendarTimezoneRespected[79](org.apache.commons.lang3.time.FastDatePrinterTimeZonesTest)  Time elapsed: 0.001 sec  <<< ERROR!
java.lang.NullPointerException: null

testCalendarTimezoneRespected[80](org.apache.commons.lang3.time.FastDatePrinterTimeZonesTest)  Time elapsed: 0 sec  <<< ERROR!
java.lang.NullPointerException: null

testCalendarTimezoneRespected[81](org.apache.commons.lang3.time.FastDatePrinterTimeZonesTest)  Time elapsed: 0 sec  <<< ERROR!
java.lang.NullPointerException: null

testCalendarTimezoneRespected[82](org.apache.commons.lang3.time.FastDatePrinterTimeZonesTest)  Time elapsed: 0 sec  <<< ERROR!
java.lang.NullPointerException: null

testCalendarTimezoneRespected[83](org.apache.commons.lang3.time.FastDatePrinterTimeZonesTest)  Time elapsed: 0.001 sec  <<< ERROR!
java.lang.NullPointerException: null

testCalendarTimezoneRespected[84](org.apache.commons.lang3.time.FastDatePrinterTimeZonesTest)  Time elapsed: 0 sec  <<< ERROR!
java.lang.NullPointerException: null

testCalendarTimezoneRespected[85](org.apache.commons.lang3.time.FastDatePrinterTimeZonesTest)  Time elapsed: 0 sec  <<< ERROR!
java.lang.NullPointerException: null

testCalendarTimezoneRespected[86](org.apache.commons.lang3.time.FastDatePrinterTimeZonesTest)  Time elapsed: 0 sec  <<< ERROR!
java.lang.NullPointerException: null

testCalendarTimezoneRespected[87](org.apache.commons.lang3.time.FastDatePrinterTimeZonesTest)  Time elapsed: 0.001 sec  <<< ERROR!
java.lang.NullPointerException: null

testCalendarTimezoneRespected[88](org.apache.commons.lang3.time.FastDatePrinterTimeZonesTest)  Time elapsed: 0 sec  <<< ERROR!
java.lang.NullPointerException: null

testCalendarTimezoneRespected[89](org.apache.commons.lang3.time.FastDatePrinterTimeZonesTest)  Time elapsed: 0 sec  <<< ERROR!
java.lang.NullPointerException: null

testCalendarTimezoneRespected[90](org.apache.commons.lang3.time.FastDatePrinterTimeZonesTest)  Time elapsed: 0 sec  <<< ERROR!
java.lang.NullPointerException: null

testCalendarTimezoneRespected[91](org.apache.commons.lang3.time.FastDatePrinterTimeZonesTest)  Time elapsed: 0.001 sec  <<< ERROR!
java.lang.NullPointerException: null

testCalendarTimezoneRespected[92](org.apache.commons.lang3.time.FastDatePrinterTimeZonesTest)  Time elapsed: 0 sec  <<< ERROR!
java.lang.NullPointerException: null

testCalendarTimezoneRespected[93](org.apache.commons.lang3.time.FastDatePrinterTimeZonesTest)  Time elapsed: 0 sec  <<< ERROR!
java.lang.NullPointerException: null

testCalendarTimezoneRespected[94](org.apache.commons.lang3.time.FastDatePrinterTimeZonesTest)  Time elapsed: 0 sec  <<< ERROR!
java.lang.NullPointerException: null

testCalendarTimezoneRespected[95](org.apache.commons.lang3.time.FastDatePrinterTimeZonesTest)  Time elapsed: 0.001 sec  <<< ERROR!
java.lang.NullPointerException: null

testCalendarTimezoneRespected[96](org.apache.commons.lang3.time.FastDatePrinterTimeZonesTest)  Time elapsed: 0 sec  <<< ERROR!
java.lang.NullPointerException: null

testCalendarTimezoneRespected[97](org.apache.commons.lang3.time.FastDatePrinterTimeZonesTest)  Time elapsed: 0 sec  <<< ERROR!
java.lang.NullPointerException: null

testCalendarTimezoneRespected[98](org.apache.commons.lang3.time.FastDatePrinterTimeZonesTest)  Time elapsed: 0 sec  <<< ERROR!
java.lang.NullPointerException: null

testCalendarTimezoneRespected[99](org.apache.commons.lang3.time.FastDatePrinterTimeZonesTest)  Time elapsed: 0.001 sec  <<< ERROR!
java.lang.NullPointerException: null

testCalendarTimezoneRespected[100](org.apache.commons.lang3.time.FastDatePrinterTimeZonesTest)  Time elapsed: 0 sec  <<< ERROR!
java.lang.NullPointerException: null

testCalendarTimezoneRespected[101](org.apache.commons.lang3.time.FastDatePrinterTimeZonesTest)  Time elapsed: 0 sec  <<< ERROR!
java.lang.NullPointerException: null

testCalendarTimezoneRespected[102](org.apache.commons.lang3.time.FastDatePrinterTimeZonesTest)  Time elapsed: 0 sec  <<< ERROR!
java.lang.NullPointerException: null

testCalendarTimezoneRespected[103](org.apache.commons.lang3.time.FastDatePrinterTimeZonesTest)  Time elapsed: 0 sec  <<< ERROR!
java.lang.NullPointerException: null

testCalendarTimezoneRespected[104](org.apache.commons.lang3.time.FastDatePrinterTimeZonesTest)  Time elapsed: 0 sec  <<< ERROR!
java.lang.NullPointerException: null

testCalendarTimezoneRespected[105](org.apache.commons.lang3.time.FastDatePrinterTimeZonesTest)  Time elapsed: 0 sec  <<< ERROR!
java.lang.NullPointerException: null

testCalendarTimezoneRespected[106](org.apache.commons.lang3.time.FastDatePrinterTimeZonesTest)  Time elapsed: 0.001 sec  <<< ERROR!
java.lang.NullPointerException: null

testCalendarTimezoneRespected[107](org.apache.commons.lang3.time.FastDatePrinterTimeZonesTest)  Time elapsed: 0 sec  <<< ERROR!
java.lang.NullPointerException: null

testCalendarTimezoneRespected[108](org.apache.commons.lang3.time.FastDatePrinterTimeZonesTest)  Time elapsed: 0 sec  <<< ERROR!
java.lang.NullPointerException: null

testCalendarTimezoneRespected[109](org.apache.commons.lang3.time.FastDatePrinterTimeZonesTest)  Time elapsed: 0 sec  <<< ERROR!
java.lang.NullPointerException: null

testCalendarTimezoneRespected[110](org.apache.commons.lang3.time.FastDatePrinterTimeZonesTest)  Time elapsed: 0 sec  <<< ERROR!
java.lang.NullPointerException: null

testCalendarTimezoneRespected[111](org.apache.commons.lang3.time.FastDatePrinterTimeZonesTest)  Time elapsed: 0 sec  <<< ERROR!
java.lang.NullPointerException: null

testCalendarTimezoneRespected[112](org.apache.commons.lang3.time.FastDatePrinterTimeZonesTest)  Time elapsed: 0 sec  <<< ERROR!
java.lang.NullPointerException: null

testCalendarTimezoneRespected[113](org.apache.commons.lang3.time.FastDatePrinterTimeZonesTest)  Time elapsed: 0 sec  <<< ERROR!
java.lang.NullPointerException: null

testCalendarTimezoneRespected[114](org.apache.commons.lang3.time.FastDatePrinterTimeZonesTest)  Time elapsed: 0 sec  <<< ERROR!
java.lang.NullPointerException: null

testCalendarTimezoneRespected[115](org.apache.commons.lang3.time.FastDatePrinterTimeZonesTest)  Time elapsed: 0 sec  <<< ERROR!
java.lang.NullPointerException: null

testCalendarTimezoneRespected[116](org.apache.commons.lang3.time.FastDatePrinterTimeZonesTest)  Time elapsed: 0 sec  <<< ERROR!
java.lang.NullPointerException: null

testCalendarTimezoneRespected[117](org.apache.commons.lang3.time.FastDatePrinterTimeZonesTest)  Time elapsed: 0 sec  <<< ERROR!
java.lang.NullPointerException: null

testCalendarTimezoneRespected[118](org.apache.commons.lang3.time.FastDatePrinterTimeZonesTest)  Time elapsed: 0.001 sec  <<< ERROR!
java.lang.NullPointerException: null

testCalendarTimezoneRespected[119](org.apache.commons.lang3.time.FastDatePrinterTimeZonesTest)  Time elapsed: 0 sec  <<< ERROR!
java.lang.NullPointerException: null

testCalendarTimezoneRespected[120](org.apache.commons.lang3.time.FastDatePrinterTimeZonesTest)  Time elapsed: 0 sec  <<< ERROR!
java.lang.NullPointerException: null

testCalendarTimezoneRespected[121](org.apache.commons.lang3.time.FastDatePrinterTimeZonesTest)  Time elapsed: 0 sec  <<< ERROR!
java.lang.NullPointerException: null

testCalendarTimezoneRespected[122](org.apache.commons.lang3.time.FastDatePrinterTimeZonesTest)  Time elapsed: 0.001 sec  <<< ERROR!
java.lang.NullPointerException: null

testCalendarTimezoneRespected[123](org.apache.commons.lang3.time.FastDatePrinterTimeZonesTest)  Time elapsed: 0 sec  <<< ERROR!
java.lang.NullPointerException: null

testCalendarTimezoneRespected[124](org.apache.commons.lang3.time.FastDatePrinterTimeZonesTest)  Time elapsed: 0 sec  <<< ERROR!
java.lang.NullPointerException: null

testCalendarTimezoneRespected[125](org.apache.commons.lang3.time.FastDatePrinterTimeZonesTest)  Time elapsed: 0 sec  <<< ERROR!
java.lang.NullPointerException: null

testCalendarTimezoneRespected[126](org.apache.commons.lang3.time.FastDatePrinterTimeZonesTest)  Time elapsed: 0.001 sec  <<< ERROR!
java.lang.NullPointerException: null

testCalendarTimezoneRespected[127](org.apache.commons.lang3.time.FastDatePrinterTimeZonesTest)  Time elapsed: 0 sec  <<< ERROR!
java.lang.NullPointerException: null

testCalendarTimezoneRespected[128](org.apache.commons.lang3.time.FastDatePrinterTimeZonesTest)  Time elapsed: 0 sec  <<< ERROR!
java.lang.NullPointerException: null

testCalendarTimezoneRespected[129](org.apache.commons.lang3.time.FastDatePrinterTimeZonesTest)  Time elapsed: 0 sec  <<< ERROR!
java.lang.NullPointerException: null

testCalendarTimezoneRespected[130](org.apache.commons.lang3.time.FastDatePrinterTimeZonesTest)  Time elapsed: 0.001 sec  <<< ERROR!
java.lang.NullPointerException: null

testCalendarTimezoneRespected[131](org.apache.commons.lang3.time.FastDatePrinterTimeZonesTest)  Time elapsed: 0 sec  <<< ERROR!
java.lang.NullPointerException: null

testCalendarTimezoneRespected[132](org.apache.commons.lang3.time.FastDatePrinterTimeZonesTest)  Time elapsed: 0 sec  <<< ERROR!
java.lang.NullPointerException: null

testCalendarTimezoneRespected[133](org.apache.commons.lang3.time.FastDatePrinterTimeZonesTest)  Time elapsed: 0 sec  <<< ERROR!
java.lang.NullPointerException: null

testCalendarTimezoneRespected[134](org.apache.commons.lang3.time.FastDatePrinterTimeZonesTest)  Time elapsed: 0.001 sec  <<< ERROR!
java.lang.NullPointerException: null

testCalendarTimezoneRespected[135](org.apache.commons.lang3.time.FastDatePrinterTimeZonesTest)  Time elapsed: 0 sec  <<< ERROR!
java.lang.NullPointerException: null

testCalendarTimezoneRespected[136](org.apache.commons.lang3.time.FastDatePrinterTimeZonesTest)  Time elapsed: 0 sec  <<< ERROR!
java.lang.NullPointerException: null

testCalendarTimezoneRespected[137](org.apache.commons.lang3.time.FastDatePrinterTimeZonesTest)  Time elapsed: 0.001 sec  <<< ERROR!
java.lang.NullPointerException: null

testCalendarTimezoneRespected[138](org.apache.commons.lang3.time.FastDatePrinterTimeZonesTest)  Time elapsed: 0 sec  <<< ERROR!
java.lang.NullPointerException: null

testCalendarTimezoneRespected[139](org.apache.commons.lang3.time.FastDatePrinterTimeZonesTest)  Time elapsed: 0 sec  <<< ERROR!
java.lang.NullPointerException: null

testCalendarTimezoneRespected[140](org.apache.commons.lang3.time.FastDatePrinterTimeZonesTest)  Time elapsed: 0 sec  <<< ERROR!
java.lang.NullPointerException: null

testCalendarTimezoneRespected[141](org.apache.commons.lang3.time.FastDatePrinterTimeZonesTest)  Time elapsed: 0 sec  <<< ERROR!
java.lang.NullPointerException: null

testCalendarTimezoneRespected[142](org.apache.commons.lang3.time.FastDatePrinterTimeZonesTest)  Time elapsed: 0.004 sec  <<< ERROR!
java.lang.NullPointerException: null

testCalendarTimezoneRespected[143](org.apache.commons.lang3.time.FastDatePrinterTimeZonesTest)  Time elapsed: 0 sec  <<< ERROR!
java.lang.NullPointerException: null

testCalendarTimezoneRespected[144](org.apache.commons.lang3.time.FastDatePrinterTimeZonesTest)  Time elapsed: 0 sec  <<< ERROR!
java.lang.NullPointerException: null

testCalendarTimezoneRespected[145](org.apache.commons.lang3.time.FastDatePrinterTimeZonesTest)  Time elapsed: 0 sec  <<< ERROR!
java.lang.NullPointerException: null

testCalendarTimezoneRespected[146](org.apache.commons.lang3.time.FastDatePrinterTimeZonesTest)  Time elapsed: 0 sec  <<< ERROR!
java.lang.NullPointerException: null

testCalendarTimezoneRespected[147](org.apache.commons.lang3.time.FastDatePrinterTimeZonesTest)  Time elapsed: 0 sec  <<< ERROR!
java.lang.NullPointerException: null

testCalendarTimezoneRespected[148](org.apache.commons.lang3.time.FastDatePrinterTimeZonesTest)  Time elapsed: 0 sec  <<< ERROR!
java.lang.NullPointerException: null

testCalendarTimezoneRespected[149](org.apache.commons.lang3.time.FastDatePrinterTimeZonesTest)  Time elapsed: 0 sec  <<< ERROR!
java.lang.NullPointerException: null

testCalendarTimezoneRespected[150](org.apache.commons.lang3.time.FastDatePrinterTimeZonesTest)  Time elapsed: 0 sec  <<< ERROR!
java.lang.NullPointerException: null

testCalendarTimezoneRespected[151](org.apache.commons.lang3.time.FastDatePrinterTimeZonesTest)  Time elapsed: 0 sec  <<< ERROR!
java.lang.NullPointerException: null

testCalendarTimezoneRespected[152](org.apache.commons.lang3.time.FastDatePrinterTimeZonesTest)  Time elapsed: 0 sec  <<< ERROR!
java.lang.NullPointerException: null

testCalendarTimezoneRespected[153](org.apache.commons.lang3.time.FastDatePrinterTimeZonesTest)  Time elapsed: 0 sec  <<< ERROR!
java.lang.NullPointerException: null

testCalendarTimezoneRespected[154](org.apache.commons.lang3.time.FastDatePrinterTimeZonesTest)  Time elapsed: 0 sec  <<< ERROR!
java.lang.NullPointerException: null

testCalendarTimezoneRespected[155](org.apache.commons.lang3.time.FastDatePrinterTimeZonesTest)  Time elapsed: 0 sec  <<< ERROR!
java.lang.NullPointerException: null

testCalendarTimezoneRespected[156](org.apache.commons.lang3.time.FastDatePrinterTimeZonesTest)  Time elapsed: 0 sec  <<< ERROR!
java.lang.NullPointerException: null

testCalendarTimezoneRespected[157](org.apache.commons.lang3.time.FastDatePrinterTimeZonesTest)  Time elapsed: 0 sec  <<< ERROR!
java.lang.NullPointerException: null

testCalendarTimezoneRespected[158](org.apache.commons.lang3.time.FastDatePrinterTimeZonesTest)  Time elapsed: 0 sec  <<< ERROR!
java.lang.NullPointerException: null

testCalendarTimezoneRespected[159](org.apache.commons.lang3.time.FastDatePrinterTimeZonesTest)  Time elapsed: 0 sec  <<< ERROR!
java.lang.NullPointerException: null

testCalendarTimezoneRespected[160](org.apache.commons.lang3.time.FastDatePrinterTimeZonesTest)  Time elapsed: 0 sec  <<< ERROR!
java.lang.NullPointerException: null

testCalendarTimezoneRespected[161](org.apache.commons.lang3.time.FastDatePrinterTimeZonesTest)  Time elapsed: 0 sec  <<< ERROR!
java.lang.NullPointerException: null

testCalendarTimezoneRespected[162](org.apache.commons.lang3.time.FastDatePrinterTimeZonesTest)  Time elapsed: 0 sec  <<< ERROR!
java.lang.NullPointerException: null

testCalendarTimezoneRespected[163](org.apache.commons.lang3.time.FastDatePrinterTimeZonesTest)  Time elapsed: 0 sec  <<< ERROR!
java.lang.NullPointerException: null

testCalendarTimezoneRespected[164](org.apache.commons.lang3.time.FastDatePrinterTimeZonesTest)  Time elapsed: 0.001 sec  <<< ERROR!
java.lang.NullPointerException: null

testCalendarTimezoneRespected[165](org.apache.commons.lang3.time.FastDatePrinterTimeZonesTest)  Time elapsed: 0 sec  <<< ERROR!
java.lang.NullPointerException: null

testCalendarTimezoneRespected[166](org.apache.commons.lang3.time.FastDatePrinterTimeZonesTest)  Time elapsed: 0 sec  <<< ERROR!
java.lang.NullPointerException: null

testCalendarTimezoneRespected[167](org.apache.commons.lang3.time.FastDatePrinterTimeZonesTest)  Time elapsed: 0 sec  <<< ERROR!
java.lang.NullPointerException: null

testCalendarTimezoneRespected[168](org.apache.commons.lang3.time.FastDatePrinterTimeZonesTest)  Time elapsed: 0 sec  <<< ERROR!
java.lang.NullPointerException: null

testCalendarTimezoneRespected[169](org.apache.commons.lang3.time.FastDatePrinterTimeZonesTest)  Time elapsed: 0 sec  <<< ERROR!
java.lang.NullPointerException: null

testCalendarTimezoneRespected[170](org.apache.commons.lang3.time.FastDatePrinterTimeZonesTest)  Time elapsed: 0 sec  <<< ERROR!
java.lang.NullPointerException: null

testCalendarTimezoneRespected[171](org.apache.commons.lang3.time.FastDatePrinterTimeZonesTest)  Time elapsed: 0 sec  <<< ERROR!
java.lang.NullPointerException: null

testCalendarTimezoneRespected[172](org.apache.commons.lang3.time.FastDatePrinterTimeZonesTest)  Time elapsed: 0.001 sec  <<< ERROR!
java.lang.NullPointerException: null

testCalendarTimezoneRespected[173](org.apache.commons.lang3.time.FastDatePrinterTimeZonesTest)  Time elapsed: 0 sec  <<< ERROR!
java.lang.NullPointerException: null

testCalendarTimezoneRespected[174](org.apache.commons.lang3.time.FastDatePrinterTimeZonesTest)  Time elapsed: 0 sec  <<< ERROR!
java.lang.NullPointerException: null

testCalendarTimezoneRespected[175](org.apache.commons.lang3.time.FastDatePrinterTimeZonesTest)  Time elapsed: 0.001 sec  <<< ERROR!
java.lang.NullPointerException: null

testCalendarTimezoneRespected[176](org.apache.commons.lang3.time.FastDatePrinterTimeZonesTest)  Time elapsed: 0 sec  <<< ERROR!
java.lang.NullPointerException: null

testCalendarTimezoneRespected[177](org.apache.commons.lang3.time.FastDatePrinterTimeZonesTest)  Time elapsed: 0 sec  <<< ERROR!
java.lang.NullPointerException: null

testCalendarTimezoneRespected[178](org.apache.commons.lang3.time.FastDatePrinterTimeZonesTest)  Time elapsed: 0 sec  <<< ERROR!
java.lang.NullPointerException: null

testCalendarTimezoneRespected[179](org.apache.commons.lang3.time.FastDatePrinterTimeZonesTest)  Time elapsed: 0 sec  <<< ERROR!
java.lang.NullPointerException: null

testCalendarTimezoneRespected[180](org.apache.commons.lang3.time.FastDatePrinterTimeZonesTest)  Time elapsed: 0 sec  <<< ERROR!
java.lang.NullPointerException: null

testCalendarTimezoneRespected[181](org.apache.commons.lang3.time.FastDatePrinterTimeZonesTest)  Time elapsed: 0 sec  <<< ERROR!
java.lang.NullPointerException: null

testCalendarTimezoneRespected[182](org.apache.commons.lang3.time.FastDatePrinterTimeZonesTest)  Time elapsed: 0.001 sec  <<< ERROR!
java.lang.NullPointerException: null

testCalendarTimezoneRespected[183](org.apache.commons.lang3.time.FastDatePrinterTimeZonesTest)  Time elapsed: 0 sec  <<< ERROR!
java.lang.NullPointerException: null

testCalendarTimezoneRespected[184](org.apache.commons.lang3.time.FastDatePrinterTimeZonesTest)  Time elapsed: 0 sec  <<< ERROR!
java.lang.NullPointerException: null

testCalendarTimezoneRespected[185](org.apache.commons.lang3.time.FastDatePrinterTimeZonesTest)  Time elapsed: 0.001 sec  <<< ERROR!
java.lang.NullPointerException: null

testCalendarTimezoneRespected[186](org.apache.commons.lang3.time.FastDatePrinterTimeZonesTest)  Time elapsed: 0 sec  <<< ERROR!
java.lang.NullPointerException: null

testCalendarTimezoneRespected[187](org.apache.commons.lang3.time.FastDatePrinterTimeZonesTest)  Time elapsed: 0.011 sec  <<< ERROR!
java.lang.NullPointerException: null

testCalendarTimezoneRespected[188](org.apache.commons.lang3.time.FastDatePrinterTimeZonesTest)  Time elapsed: 0 sec  <<< ERROR!
java.lang.NullPointerException: null

testCalendarTimezoneRespected[189](org.apache.commons.lang3.time.FastDatePrinterTimeZonesTest)  Time elapsed: 0 sec  <<< ERROR!
java.lang.NullPointerException: null

testCalendarTimezoneRespected[190](org.apache.commons.lang3.time.FastDatePrinterTimeZonesTest)  Time elapsed: 0 sec  <<< ERROR!
java.lang.NullPointerException: null

testCalendarTimezoneRespected[191](org.apache.commons.lang3.time.FastDatePrinterTimeZonesTest)  Time elapsed: 0 sec  <<< ERROR!
java.lang.NullPointerException: null

testCalendarTimezoneRespected[192](org.apache.commons.lang3.time.FastDatePrinterTimeZonesTest)  Time elapsed: 0 sec  <<< ERROR!
java.lang.NullPointerException: null

testCalendarTimezoneRespected[193](org.apache.commons.lang3.time.FastDatePrinterTimeZonesTest)  Time elapsed: 0 sec  <<< ERROR!
java.lang.NullPointerException: null

testCalendarTimezoneRespected[194](org.apache.commons.lang3.time.FastDatePrinterTimeZonesTest)  Time elapsed: 0 sec  <<< ERROR!
java.lang.NullPointerException: null

testCalendarTimezoneRespected[195](org.apache.commons.lang3.time.FastDatePrinterTimeZonesTest)  Time elapsed: 0 sec  <<< ERROR!
java.lang.NullPointerException: null

testCalendarTimezoneRespected[196](org.apache.commons.lang3.time.FastDatePrinterTimeZonesTest)  Time elapsed: 0 sec  <<< ERROR!
java.lang.NullPointerException: null

testCalendarTimezoneRespected[197](org.apache.commons.lang3.time.FastDatePrinterTimeZonesTest)  Time elapsed: 0 sec  <<< ERROR!
java.lang.NullPointerException: null

testCalendarTimezoneRespected[198](org.apache.commons.lang3.time.FastDatePrinterTimeZonesTest)  Time elapsed: 0 sec  <<< ERROR!
java.lang.NullPointerException: null

testCalendarTimezoneRespected[199](org.apache.commons.lang3.time.FastDatePrinterTimeZonesTest)  Time elapsed: 0 sec  <<< ERROR!
java.lang.NullPointerException: null

testCalendarTimezoneRespected[200](org.apache.commons.lang3.time.FastDatePrinterTimeZonesTest)  Time elapsed: 0 sec  <<< ERROR!
java.lang.NullPointerException: null

testCalendarTimezoneRespected[201](org.apache.commons.lang3.time.FastDatePrinterTimeZonesTest)  Time elapsed: 0 sec  <<< ERROR!
java.lang.NullPointerException: null

testCalendarTimezoneRespected[202](org.apache.commons.lang3.time.FastDatePrinterTimeZonesTest)  Time elapsed: 0 sec  <<< ERROR!
java.lang.NullPointerException: null

testCalendarTimezoneRespected[203](org.apache.commons.lang3.time.FastDatePrinterTimeZonesTest)  Time elapsed: 0 sec  <<< ERROR!
java.lang.NullPointerException: null

testCalendarTimezoneRespected[204](org.apache.commons.lang3.time.FastDatePrinterTimeZonesTest)  Time elapsed: 0 sec  <<< ERROR!
java.lang.NullPointerException: null

testCalendarTimezoneRespected[205](org.apache.commons.lang3.time.FastDatePrinterTimeZonesTest)  Time elapsed: 0 sec  <<< ERROR!
java.lang.NullPointerException: null

testCalendarTimezoneRespected[206](org.apache.commons.lang3.time.FastDatePrinterTimeZonesTest)  Time elapsed: 0 sec  <<< ERROR!
java.lang.NullPointerException: null

testCalendarTimezoneRespected[207](org.apache.commons.lang3.time.FastDatePrinterTimeZonesTest)  Time elapsed: 0 sec  <<< ERROR!
java.lang.NullPointerException: null

testCalendarTimezoneRespected[208](org.apache.commons.lang3.time.FastDatePrinterTimeZonesTest)  Time elapsed: 0 sec  <<< ERROR!
java.lang.NullPointerException: null

testCalendarTimezoneRespected[209](org.apache.commons.lang3.time.FastDatePrinterTimeZonesTest)  Time elapsed: 0 sec  <<< ERROR!
java.lang.NullPointerException: null

testCalendarTimezoneRespected[210](org.apache.commons.lang3.time.FastDatePrinterTimeZonesTest)  Time elapsed: 0 sec  <<< ERROR!
java.lang.NullPointerException: null

testCalendarTimezoneRespected[211](org.apache.commons.lang3.time.FastDatePrinterTimeZonesTest)  Time elapsed: 0 sec  <<< ERROR!
java.lang.NullPointerException: null

testCalendarTimezoneRespected[212](org.apache.commons.lang3.time.FastDatePrinterTimeZonesTest)  Time elapsed: 0 sec  <<< ERROR!
java.lang.NullPointerException: null

testCalendarTimezoneRespected[213](org.apache.commons.lang3.time.FastDatePrinterTimeZonesTest)  Time elapsed: 0 sec  <<< ERROR!
java.lang.NullPointerException: null

testCalendarTimezoneRespected[214](org.apache.commons.lang3.time.FastDatePrinterTimeZonesTest)  Time elapsed: 0 sec  <<< ERROR!
java.lang.NullPointerException: null

testCalendarTimezoneRespected[215](org.apache.commons.lang3.time.FastDatePrinterTimeZonesTest)  Time elapsed: 0 sec  <<< ERROR!
java.lang.NullPointerException: null

testCalendarTimezoneRespected[216](org.apache.commons.lang3.time.FastDatePrinterTimeZonesTest)  Time elapsed: 0 sec  <<< ERROR!
java.lang.NullPointerException: null

testCalendarTimezoneRespected[217](org.apache.commons.lang3.time.FastDatePrinterTimeZonesTest)  Time elapsed: 0 sec  <<< ERROR!
java.lang.NullPointerException: null

testCalendarTimezoneRespected[218](org.apache.commons.lang3.time.FastDatePrinterTimeZonesTest)  Time elapsed: 0 sec  <<< ERROR!
java.lang.NullPointerException: null

testCalendarTimezoneRespected[219](org.apache.commons.lang3.time.FastDatePrinterTimeZonesTest)  Time elapsed: 0 sec  <<< ERROR!
java.lang.NullPointerException: null

testCalendarTimezoneRespected[220](org.apache.commons.lang3.time.FastDatePrinterTimeZonesTest)  Time elapsed: 0 sec  <<< ERROR!
java.lang.NullPointerException: null

testCalendarTimezoneRespected[221](org.apache.commons.lang3.time.FastDatePrinterTimeZonesTest)  Time elapsed: 0 sec  <<< ERROR!
java.lang.NullPointerException: null

testCalendarTimezoneRespected[222](org.apache.commons.lang3.time.FastDatePrinterTimeZonesTest)  Time elapsed: 0 sec  <<< ERROR!
java.lang.NullPointerException: null

testCalendarTimezoneRespected[223](org.apache.commons.lang3.time.FastDatePrinterTimeZonesTest)  Time elapsed: 0 sec  <<< ERROR!
java.lang.NullPointerException: null

testCalendarTimezoneRespected[224](org.apache.commons.lang3.time.FastDatePrinterTimeZonesTest)  Time elapsed: 0 sec  <<< ERROR!
java.lang.NullPointerException: null

testCalendarTimezoneRespected[225](org.apache.commons.lang3.time.FastDatePrinterTimeZonesTest)  Time elapsed: 0 sec  <<< ERROR!
java.lang.NullPointerException: null

testCalendarTimezoneRespected[226](org.apache.commons.lang3.time.FastDatePrinterTimeZonesTest)  Time elapsed: 0 sec  <<< ERROR!
java.lang.NullPointerException: null

testCalendarTimezoneRespected[227](org.apache.commons.lang3.time.FastDatePrinterTimeZonesTest)  Time elapsed: 0 sec  <<< ERROR!
java.lang.NullPointerException: null

testCalendarTimezoneRespected[228](org.apache.commons.lang3.time.FastDatePrinterTimeZonesTest)  Time elapsed: 0 sec  <<< ERROR!
java.lang.NullPointerException: null

testCalendarTimezoneRespected[229](org.apache.commons.lang3.time.FastDatePrinterTimeZonesTest)  Time elapsed: 0 sec  <<< ERROR!
java.lang.NullPointerException: null

testCalendarTimezoneRespected[230](org.apache.commons.lang3.time.FastDatePrinterTimeZonesTest)  Time elapsed: 0 sec  <<< ERROR!
java.lang.NullPointerException: null

testCalendarTimezoneRespected[231](org.apache.commons.lang3.time.FastDatePrinterTimeZonesTest)  Time elapsed: 0 sec  <<< ERROR!
java.lang.NullPointerException: null

testCalendarTimezoneRespected[232](org.apache.commons.lang3.time.FastDatePrinterTimeZonesTest)  Time elapsed: 0 sec  <<< ERROR!
java.lang.NullPointerException: null

testCalendarTimezoneRespected[233](org.apache.commons.lang3.time.FastDatePrinterTimeZonesTest)  Time elapsed: 0 sec  <<< ERROR!
java.lang.NullPointerException: null

testCalendarTimezoneRespected[234](org.apache.commons.lang3.time.FastDatePrinterTimeZonesTest)  Time elapsed: 0 sec  <<< ERROR!
java.lang.NullPointerException: null

testCalendarTimezoneRespected[235](org.apache.commons.lang3.time.FastDatePrinterTimeZonesTest)  Time elapsed: 0 sec  <<< ERROR!
java.lang.NullPointerException: null

testCalendarTimezoneRespected[236](org.apache.commons.lang3.time.FastDatePrinterTimeZonesTest)  Time elapsed: 0 sec  <<< ERROR!
java.lang.NullPointerException: null

testCalendarTimezoneRespected[237](org.apache.commons.lang3.time.FastDatePrinterTimeZonesTest)  Time elapsed: 0 sec  <<< ERROR!
java.lang.NullPointerException: null

testCalendarTimezoneRespected[238](org.apache.commons.lang3.time.FastDatePrinterTimeZonesTest)  Time elapsed: 0 sec  <<< ERROR!
java.lang.NullPointerException: null

testCalendarTimezoneRespected[239](org.apache.commons.lang3.time.FastDatePrinterTimeZonesTest)  Time elapsed: 0 sec  <<< ERROR!
java.lang.NullPointerException: null

testCalendarTimezoneRespected[240](org.apache.commons.lang3.time.FastDatePrinterTimeZonesTest)  Time elapsed: 0 sec  <<< ERROR!
java.lang.NullPointerException: null

testCalendarTimezoneRespected[241](org.apache.commons.lang3.time.FastDatePrinterTimeZonesTest)  Time elapsed: 0 sec  <<< ERROR!
java.lang.NullPointerException: null

testCalendarTimezoneRespected[242](org.apache.commons.lang3.time.FastDatePrinterTimeZonesTest)  Time elapsed: 0 sec  <<< ERROR!
java.lang.NullPointerException: null

testCalendarTimezoneRespected[243](org.apache.commons.lang3.time.FastDatePrinterTimeZonesTest)  Time elapsed: 0 sec  <<< ERROR!
java.lang.NullPointerException: null

testCalendarTimezoneRespected[244](org.apache.commons.lang3.time.FastDatePrinterTimeZonesTest)  Time elapsed: 0 sec  <<< ERROR!
java.lang.NullPointerException: null

testCalendarTimezoneRespected[245](org.apache.commons.lang3.time.FastDatePrinterTimeZonesTest)  Time elapsed: 0.001 sec  <<< ERROR!
java.lang.NullPointerException: null

testCalendarTimezoneRespected[246](org.apache.commons.lang3.time.FastDatePrinterTimeZonesTest)  Time elapsed: 0 sec  <<< ERROR!
java.lang.NullPointerException: null

testCalendarTimezoneRespected[247](org.apache.commons.lang3.time.FastDatePrinterTimeZonesTest)  Time elapsed: 0 sec  <<< ERROR!
java.lang.NullPointerException: null

testCalendarTimezoneRespected[248](org.apache.commons.lang3.time.FastDatePrinterTimeZonesTest)  Time elapsed: 0 sec  <<< ERROR!
java.lang.NullPointerException: null

testCalendarTimezoneRespected[249](org.apache.commons.lang3.time.FastDatePrinterTimeZonesTest)  Time elapsed: 0 sec  <<< ERROR!
java.lang.NullPointerException: null

testCalendarTimezoneRespected[250](org.apache.commons.lang3.time.FastDatePrinterTimeZonesTest)  Time elapsed: 0 sec  <<< ERROR!
java.lang.NullPointerException: null

testCalendarTimezoneRespected[251](org.apache.commons.lang3.time.FastDatePrinterTimeZonesTest)  Time elapsed: 0 sec  <<< ERROR!
java.lang.NullPointerException: null

testCalendarTimezoneRespected[252](org.apache.commons.lang3.time.FastDatePrinterTimeZonesTest)  Time elapsed: 0.001 sec  <<< ERROR!
java.lang.NullPointerException: null

testCalendarTimezoneRespected[253](org.apache.commons.lang3.time.FastDatePrinterTimeZonesTest)  Time elapsed: 0 sec  <<< ERROR!
java.lang.NullPointerException: null

testCalendarTimezoneRespected[254](org.apache.commons.lang3.time.FastDatePrinterTimeZonesTest)  Time elapsed: 0 sec  <<< ERROR!
java.lang.NullPointerException: null

testCalendarTimezoneRespected[255](org.apache.commons.lang3.time.FastDatePrinterTimeZonesTest)  Time elapsed: 0 sec  <<< ERROR!
java.lang.NullPointerException: null

testCalendarTimezoneRespected[256](org.apache.commons.lang3.time.FastDatePrinterTimeZonesTest)  Time elapsed: 0 sec  <<< ERROR!
java.lang.NullPointerException: null

testCalendarTimezoneRespected[257](org.apache.commons.lang3.time.FastDatePrinterTimeZonesTest)  Time elapsed: 0 sec  <<< ERROR!
java.lang.NullPointerException: null

testCalendarTimezoneRespected[258](org.apache.commons.lang3.time.FastDatePrinterTimeZonesTest)  Time elapsed: 0 sec  <<< ERROR!
java.lang.NullPointerException: null

testCalendarTimezoneRespected[259](org.apache.commons.lang3.time.FastDatePrinterTimeZonesTest)  Time elapsed: 0 sec  <<< ERROR!
java.lang.NullPointerException: null

testCalendarTimezoneRespected[260](org.apache.commons.lang3.time.FastDatePrinterTimeZonesTest)  Time elapsed: 0 sec  <<< ERROR!
java.lang.NullPointerException: null

testCalendarTimezoneRespected[261](org.apache.commons.lang3.time.FastDatePrinterTimeZonesTest)  Time elapsed: 0 sec  <<< ERROR!
java.lang.NullPointerException: null

testCalendarTimezoneRespected[262](org.apache.commons.lang3.time.FastDatePrinterTimeZonesTest)  Time elapsed: 0 sec  <<< ERROR!
java.lang.NullPointerException: null

testCalendarTimezoneRespected[263](org.apache.commons.lang3.time.FastDatePrinterTimeZonesTest)  Time elapsed: 0 sec  <<< ERROR!
java.lang.NullPointerException: null

testCalendarTimezoneRespected[264](org.apache.commons.lang3.time.FastDatePrinterTimeZonesTest)  Time elapsed: 0 sec  <<< ERROR!
java.lang.NullPointerException: null

testCalendarTimezoneRespected[265](org.apache.commons.lang3.time.FastDatePrinterTimeZonesTest)  Time elapsed: 0 sec  <<< ERROR!
java.lang.NullPointerException: null

testCalendarTimezoneRespected[266](org.apache.commons.lang3.time.FastDatePrinterTimeZonesTest)  Time elapsed: 0 sec  <<< ERROR!
java.lang.NullPointerException: null

testCalendarTimezoneRespected[267](org.apache.commons.lang3.time.FastDatePrinterTimeZonesTest)  Time elapsed: 0 sec  <<< ERROR!
java.lang.NullPointerException: null

testCalendarTimezoneRespected[268](org.apache.commons.lang3.time.FastDatePrinterTimeZonesTest)  Time elapsed: 0.001 sec  <<< ERROR!
java.lang.NullPointerException: null

testCalendarTimezoneRespected[269](org.apache.commons.lang3.time.FastDatePrinterTimeZonesTest)  Time elapsed: 0 sec  <<< ERROR!
java.lang.NullPointerException: null

testCalendarTimezoneRespected[270](org.apache.commons.lang3.time.FastDatePrinterTimeZonesTest)  Time elapsed: 0 sec  <<< ERROR!
java.lang.NullPointerException: null

testCalendarTimezoneRespected[271](org.apache.commons.lang3.time.FastDatePrinterTimeZonesTest)  Time elapsed: 0 sec  <<< ERROR!
java.lang.NullPointerException: null

testCalendarTimezoneRespected[272](org.apache.commons.lang3.time.FastDatePrinterTimeZonesTest)  Time elapsed: 0 sec  <<< ERROR!
java.lang.NullPointerException: null

testCalendarTimezoneRespected[273](org.apache.commons.lang3.time.FastDatePrinterTimeZonesTest)  Time elapsed: 0 sec  <<< ERROR!
java.lang.NullPointerException: null

testCalendarTimezoneRespected[274](org.apache.commons.lang3.time.FastDatePrinterTimeZonesTest)  Time elapsed: 0 sec  <<< ERROR!
java.lang.NullPointerException: null

testCalendarTimezoneRespected[275](org.apache.commons.lang3.time.FastDatePrinterTimeZonesTest)  Time elapsed: 0 sec  <<< ERROR!
java.lang.NullPointerException: null

testCalendarTimezoneRespected[276](org.apache.commons.lang3.time.FastDatePrinterTimeZonesTest)  Time elapsed: 0 sec  <<< ERROR!
java.lang.NullPointerException: null

testCalendarTimezoneRespected[277](org.apache.commons.lang3.time.FastDatePrinterTimeZonesTest)  Time elapsed: 0 sec  <<< ERROR!
java.lang.NullPointerException: null

testCalendarTimezoneRespected[278](org.apache.commons.lang3.time.FastDatePrinterTimeZonesTest)  Time elapsed: 0 sec  <<< ERROR!
java.lang.NullPointerException: null

testCalendarTimezoneRespected[279](org.apache.commons.lang3.time.FastDatePrinterTimeZonesTest)  Time elapsed: 0 sec  <<< ERROR!
java.lang.NullPointerException: null

testCalendarTimezoneRespected[280](org.apache.commons.lang3.time.FastDatePrinterTimeZonesTest)  Time elapsed: 0 sec  <<< ERROR!
java.lang.NullPointerException: null

testCalendarTimezoneRespected[281](org.apache.commons.lang3.time.FastDatePrinterTimeZonesTest)  Time elapsed: 0.001 sec  <<< ERROR!
java.lang.NullPointerException: null

testCalendarTimezoneRespected[282](org.apache.commons.lang3.time.FastDatePrinterTimeZonesTest)  Time elapsed: 0 sec  <<< ERROR!
java.lang.NullPointerException: null

testCalendarTimezoneRespected[283](org.apache.commons.lang3.time.FastDatePrinterTimeZonesTest)  Time elapsed: 0 sec  <<< ERROR!
java.lang.NullPointerException: null

testCalendarTimezoneRespected[284](org.apache.commons.lang3.time.FastDatePrinterTimeZonesTest)  Time elapsed: 0 sec  <<< ERROR!
java.lang.NullPointerException: null

testCalendarTimezoneRespected[285](org.apache.commons.lang3.time.FastDatePrinterTimeZonesTest)  Time elapsed: 0.001 sec  <<< ERROR!
java.lang.NullPointerException: null

testCalendarTimezoneRespected[286](org.apache.commons.lang3.time.FastDatePrinterTimeZonesTest)  Time elapsed: 0 sec  <<< ERROR!
java.lang.NullPointerException: null

testCalendarTimezoneRespected[287](org.apache.commons.lang3.time.FastDatePrinterTimeZonesTest)  Time elapsed: 0 sec  <<< ERROR!
java.lang.NullPointerException: null

testCalendarTimezoneRespected[288](org.apache.commons.lang3.time.FastDatePrinterTimeZonesTest)  Time elapsed: 0 sec  <<< ERROR!
java.lang.NullPointerException: null

testCalendarTimezoneRespected[289](org.apache.commons.lang3.time.FastDatePrinterTimeZonesTest)  Time elapsed: 0 sec  <<< ERROR!
java.lang.NullPointerException: null

testCalendarTimezoneRespected[290](org.apache.commons.lang3.time.FastDatePrinterTimeZonesTest)  Time elapsed: 0 sec  <<< ERROR!
java.lang.NullPointerException: null

testCalendarTimezoneRespected[291](org.apache.commons.lang3.time.FastDatePrinterTimeZonesTest)  Time elapsed: 0 sec  <<< ERROR!
java.lang.NullPointerException: null

testCalendarTimezoneRespected[292](org.apache.commons.lang3.time.FastDatePrinterTimeZonesTest)  Time elapsed: 0.001 sec  <<< ERROR!
java.lang.NullPointerException: null

testCalendarTimezoneRespected[293](org.apache.commons.lang3.time.FastDatePrinterTimeZonesTest)  Time elapsed: 0 sec  <<< ERROR!
java.lang.NullPointerException: null

testCalendarTimezoneRespected[294](org.apache.commons.lang3.time.FastDatePrinterTimeZonesTest)  Time elapsed: 0 sec  <<< ERROR!
java.lang.NullPointerException: null

testCalendarTimezoneRespected[295](org.apache.commons.lang3.time.FastDatePrinterTimeZonesTest)  Time elapsed: 0 sec  <<< ERROR!
java.lang.NullPointerException: null

testCalendarTimezoneRespected[296](org.apache.commons.lang3.time.FastDatePrinterTimeZonesTest)  Time elapsed: 0 sec  <<< ERROR!
java.lang.NullPointerException: null

testCalendarTimezoneRespected[297](org.apache.commons.lang3.time.FastDatePrinterTimeZonesTest)  Time elapsed: 0 sec  <<< ERROR!
java.lang.NullPointerException: null

testCalendarTimezoneRespected[298](org.apache.commons.lang3.time.FastDatePrinterTimeZonesTest)  Time elapsed: 0 sec  <<< ERROR!
java.lang.NullPointerException: null

testCalendarTimezoneRespected[299](org.apache.commons.lang3.time.FastDatePrinterTimeZonesTest)  Time elapsed: 0 sec  <<< ERROR!
java.lang.NullPointerException: null

testCalendarTimezoneRespected[300](org.apache.commons.lang3.time.FastDatePrinterTimeZonesTest)  Time elapsed: 0 sec  <<< ERROR!
java.lang.NullPointerException: null

testCalendarTimezoneRespected[301](org.apache.commons.lang3.time.FastDatePrinterTimeZonesTest)  Time elapsed: 0.001 sec  <<< ERROR!
java.lang.NullPointerException: null

testCalendarTimezoneRespected[302](org.apache.commons.lang3.time.FastDatePrinterTimeZonesTest)  Time elapsed: 0 sec  <<< ERROR!
java.lang.NullPointerException: null

testCalendarTimezoneRespected[303](org.apache.commons.lang3.time.FastDatePrinterTimeZonesTest)  Time elapsed: 0 sec  <<< ERROR!
java.lang.NullPointerException: null

testCalendarTimezoneRespected[304](org.apache.commons.lang3.time.FastDatePrinterTimeZonesTest)  Time elapsed: 0 sec  <<< ERROR!
java.lang.NullPointerException: null

testCalendarTimezoneRespected[305](org.apache.commons.lang3.time.FastDatePrinterTimeZonesTest)  Time elapsed: 0.001 sec  <<< ERROR!
java.lang.NullPointerException: null

testCalendarTimezoneRespected[306](org.apache.commons.lang3.time.FastDatePrinterTimeZonesTest)  Time elapsed: 0 sec  <<< ERROR!
java.lang.NullPointerException: null

testCalendarTimezoneRespected[307](org.apache.commons.lang3.time.FastDatePrinterTimeZonesTest)  Time elapsed: 0 sec  <<< ERROR!
java.lang.NullPointerException: null

testCalendarTimezoneRespected[308](org.apache.commons.lang3.time.FastDatePrinterTimeZonesTest)  Time elapsed: 0 sec  <<< ERROR!
java.lang.NullPointerException: null

testCalendarTimezoneRespected[309](org.apache.commons.lang3.time.FastDatePrinterTimeZonesTest)  Time elapsed: 0 sec  <<< ERROR!
java.lang.NullPointerException: null

testCalendarTimezoneRespected[310](org.apache.commons.lang3.time.FastDatePrinterTimeZonesTest)  Time elapsed: 0 sec  <<< ERROR!
java.lang.NullPointerException: null

testCalendarTimezoneRespected[311](org.apache.commons.lang3.time.FastDatePrinterTimeZonesTest)  Time elapsed: 0 sec  <<< ERROR!
java.lang.NullPointerException: null

testCalendarTimezoneRespected[312](org.apache.commons.lang3.time.FastDatePrinterTimeZonesTest)  Time elapsed: 0 sec  <<< ERROR!
java.lang.NullPointerException: null

testCalendarTimezoneRespected[313](org.apache.commons.lang3.time.FastDatePrinterTimeZonesTest)  Time elapsed: 0 sec  <<< ERROR!
java.lang.NullPointerException: null

testCalendarTimezoneRespected[314](org.apache.commons.lang3.time.FastDatePrinterTimeZonesTest)  Time elapsed: 0 sec  <<< ERROR!
java.lang.NullPointerException: null

testCalendarTimezoneRespected[315](org.apache.commons.lang3.time.FastDatePrinterTimeZonesTest)  Time elapsed: 0 sec  <<< ERROR!
java.lang.NullPointerException: null

testCalendarTimezoneRespected[316](org.apache.commons.lang3.time.FastDatePrinterTimeZonesTest)  Time elapsed: 0 sec  <<< ERROR!
java.lang.NullPointerException: null

testCalendarTimezoneRespected[317](org.apache.commons.lang3.time.FastDatePrinterTimeZonesTest)  Time elapsed: 0 sec  <<< ERROR!
java.lang.NullPointerException: null

testCalendarTimezoneRespected[318](org.apache.commons.lang3.time.FastDatePrinterTimeZonesTest)  Time elapsed: 0 sec  <<< ERROR!
java.lang.NullPointerException: null

testCalendarTimezoneRespected[319](org.apache.commons.lang3.time.FastDatePrinterTimeZonesTest)  Time elapsed: 0 sec  <<< ERROR!
java.lang.NullPointerException: null

testCalendarTimezoneRespected[320](org.apache.commons.lang3.time.FastDatePrinterTimeZonesTest)  Time elapsed: 0 sec  <<< ERROR!
java.lang.NullPointerException: null

testCalendarTimezoneRespected[321](org.apache.commons.lang3.time.FastDatePrinterTimeZonesTest)  Time elapsed: 0 sec  <<< ERROR!
java.lang.NullPointerException: null

testCalendarTimezoneRespected[322](org.apache.commons.lang3.time.FastDatePrinterTimeZonesTest)  Time elapsed: 0 sec  <<< ERROR!
java.lang.NullPointerException: null

testCalendarTimezoneRespected[323](org.apache.commons.lang3.time.FastDatePrinterTimeZonesTest)  Time elapsed: 0 sec  <<< ERROR!
java.lang.NullPointerException: null

testCalendarTimezoneRespected[324](org.apache.commons.lang3.time.FastDatePrinterTimeZonesTest)  Time elapsed: 0 sec  <<< ERROR!
java.lang.NullPointerException: null

testCalendarTimezoneRespected[325](org.apache.commons.lang3.time.FastDatePrinterTimeZonesTest)  Time elapsed: 0 sec  <<< ERROR!
java.lang.NullPointerException: null

testCalendarTimezoneRespected[326](org.apache.commons.lang3.time.FastDatePrinterTimeZonesTest)  Time elapsed: 0 sec  <<< ERROR!
java.lang.NullPointerException: null

testCalendarTimezoneRespected[327](org.apache.commons.lang3.time.FastDatePrinterTimeZonesTest)  Time elapsed: 0 sec  <<< ERROR!
java.lang.NullPointerException: null

testCalendarTimezoneRespected[328](org.apache.commons.lang3.time.FastDatePrinterTimeZonesTest)  Time elapsed: 0 sec  <<< ERROR!
java.lang.NullPointerException: null

testCalendarTimezoneRespected[329](org.apache.commons.lang3.time.FastDatePrinterTimeZonesTest)  Time elapsed: 0 sec  <<< ERROR!
java.lang.NullPointerException: null

testCalendarTimezoneRespected[330](org.apache.commons.lang3.time.FastDatePrinterTimeZonesTest)  Time elapsed: 0 sec  <<< ERROR!
java.lang.NullPointerException: null

testCalendarTimezoneRespected[331](org.apache.commons.lang3.time.FastDatePrinterTimeZonesTest)  Time elapsed: 0 sec  <<< ERROR!
java.lang.NullPointerException: null

testCalendarTimezoneRespected[332](org.apache.commons.lang3.time.FastDatePrinterTimeZonesTest)  Time elapsed: 0 sec  <<< ERROR!
java.lang.NullPointerException: null

testCalendarTimezoneRespected[333](org.apache.commons.lang3.time.FastDatePrinterTimeZonesTest)  Time elapsed: 0.001 sec  <<< ERROR!
java.lang.NullPointerException: null

testCalendarTimezoneRespected[334](org.apache.commons.lang3.time.FastDatePrinterTimeZonesTest)  Time elapsed: 0 sec  <<< ERROR!
java.lang.NullPointerException: null

testCalendarTimezoneRespected[335](org.apache.commons.lang3.time.FastDatePrinterTimeZonesTest)  Time elapsed: 0 sec  <<< ERROR!
java.lang.NullPointerException: null

testCalendarTimezoneRespected[336](org.apache.commons.lang3.time.FastDatePrinterTimeZonesTest)  Time elapsed: 0 sec  <<< ERROR!
java.lang.NullPointerException: null

testCalendarTimezoneRespected[337](org.apache.commons.lang3.time.FastDatePrinterTimeZonesTest)  Time elapsed: 0.001 sec  <<< ERROR!
java.lang.NullPointerException: null

testCalendarTimezoneRespected[338](org.apache.commons.lang3.time.FastDatePrinterTimeZonesTest)  Time elapsed: 0 sec  <<< ERROR!
java.lang.NullPointerException: null

testCalendarTimezoneRespected[339](org.apache.commons.lang3.time.FastDatePrinterTimeZonesTest)  Time elapsed: 0 sec  <<< ERROR!
java.lang.NullPointerException: null

testCalendarTimezoneRespected[340](org.apache.commons.lang3.time.FastDatePrinterTimeZonesTest)  Time elapsed: 0 sec  <<< ERROR!
java.lang.NullPointerException: null

testCalendarTimezoneRespected[341](org.apache.commons.lang3.time.FastDatePrinterTimeZonesTest)  Time elapsed: 0 sec  <<< ERROR!
java.lang.NullPointerException: null

testCalendarTimezoneRespected[342](org.apache.commons.lang3.time.FastDatePrinterTimeZonesTest)  Time elapsed: 0 sec  <<< ERROR!
java.lang.NullPointerException: null

testCalendarTimezoneRespected[343](org.apache.commons.lang3.time.FastDatePrinterTimeZonesTest)  Time elapsed: 0 sec  <<< ERROR!
java.lang.NullPointerException: null

testCalendarTimezoneRespected[344](org.apache.commons.lang3.time.FastDatePrinterTimeZonesTest)  Time elapsed: 0 sec  <<< ERROR!
java.lang.NullPointerException: null

testCalendarTimezoneRespected[345](org.apache.commons.lang3.time.FastDatePrinterTimeZonesTest)  Time elapsed: 0 sec  <<< ERROR!
java.lang.NullPointerException: null

testCalendarTimezoneRespected[346](org.apache.commons.lang3.time.FastDatePrinterTimeZonesTest)  Time elapsed: 0 sec  <<< ERROR!
java.lang.NullPointerException: null

testCalendarTimezoneRespected[347](org.apache.commons.lang3.time.FastDatePrinterTimeZonesTest)  Time elapsed: 0 sec  <<< ERROR!
java.lang.NullPointerException: null

testCalendarTimezoneRespected[348](org.apache.commons.lang3.time.FastDatePrinterTimeZonesTest)  Time elapsed: 0 sec  <<< ERROR!
java.lang.NullPointerException: null

testCalendarTimezoneRespected[349](org.apache.commons.lang3.time.FastDatePrinterTimeZonesTest)  Time elapsed: 0 sec  <<< ERROR!
java.lang.NullPointerException: null

testCalendarTimezoneRespected[350](org.apache.commons.lang3.time.FastDatePrinterTimeZonesTest)  Time elapsed: 0.001 sec  <<< ERROR!
java.lang.NullPointerException: null

testCalendarTimezoneRespected[351](org.apache.commons.lang3.time.FastDatePrinterTimeZonesTest)  Time elapsed: 0 sec  <<< ERROR!
java.lang.NullPointerException: null

testCalendarTimezoneRespected[352](org.apache.commons.lang3.time.FastDatePrinterTimeZonesTest)  Time elapsed: 0 sec  <<< ERROR!
java.lang.NullPointerException: null

testCalendarTimezoneRespected[353](org.apache.commons.lang3.time.FastDatePrinterTimeZonesTest)  Time elapsed: 0 sec  <<< ERROR!
java.lang.NullPointerException: null

testCalendarTimezoneRespected[354](org.apache.commons.lang3.time.FastDatePrinterTimeZonesTest)  Time elapsed: 0 sec  <<< ERROR!
java.lang.NullPointerException: null

testCalendarTimezoneRespected[355](org.apache.commons.lang3.time.FastDatePrinterTimeZonesTest)  Time elapsed: 0 sec  <<< ERROR!
java.lang.NullPointerException: null

testCalendarTimezoneRespected[356](org.apache.commons.lang3.time.FastDatePrinterTimeZonesTest)  Time elapsed: 0 sec  <<< ERROR!
java.lang.NullPointerException: null

testCalendarTimezoneRespected[357](org.apache.commons.lang3.time.FastDatePrinterTimeZonesTest)  Time elapsed: 0.001 sec  <<< ERROR!
java.lang.NullPointerException: null

testCalendarTimezoneRespected[358](org.apache.commons.lang3.time.FastDatePrinterTimeZonesTest)  Time elapsed: 0.004 sec  <<< ERROR!
java.lang.NullPointerException: null

testCalendarTimezoneRespected[359](org.apache.commons.lang3.time.FastDatePrinterTimeZonesTest)  Time elapsed: 0 sec  <<< ERROR!
java.lang.NullPointerException: null

testCalendarTimezoneRespected[360](org.apache.commons.lang3.time.FastDatePrinterTimeZonesTest)  Time elapsed: 0 sec  <<< ERROR!
java.lang.NullPointerException: null

testCalendarTimezoneRespected[361](org.apache.commons.lang3.time.FastDatePrinterTimeZonesTest)  Time elapsed: 0 sec  <<< ERROR!
java.lang.NullPointerException: null

testCalendarTimezoneRespected[362](org.apache.commons.lang3.time.FastDatePrinterTimeZonesTest)  Time elapsed: 0 sec  <<< ERROR!
java.lang.NullPointerException: null

testCalendarTimezoneRespected[363](org.apache.commons.lang3.time.FastDatePrinterTimeZonesTest)  Time elapsed: 0 sec  <<< ERROR!
java.lang.NullPointerException: null

testCalendarTimezoneRespected[364](org.apache.commons.lang3.time.FastDatePrinterTimeZonesTest)  Time elapsed: 0 sec  <<< ERROR!
java.lang.NullPointerException: null

testCalendarTimezoneRespected[365](org.apache.commons.lang3.time.FastDatePrinterTimeZonesTest)  Time elapsed: 0 sec  <<< ERROR!
java.lang.NullPointerException: null

testCalendarTimezoneRespected[366](org.apache.commons.lang3.time.FastDatePrinterTimeZonesTest)  Time elapsed: 0 sec  <<< ERROR!
java.lang.NullPointerException: null

testCalendarTimezoneRespected[367](org.apache.commons.lang3.time.FastDatePrinterTimeZonesTest)  Time elapsed: 0 sec  <<< ERROR!
java.lang.NullPointerException: null

testCalendarTimezoneRespected[368](org.apache.commons.lang3.time.FastDatePrinterTimeZonesTest)  Time elapsed: 0 sec  <<< ERROR!
java.lang.NullPointerException: null

testCalendarTimezoneRespected[369](org.apache.commons.lang3.time.FastDatePrinterTimeZonesTest)  Time elapsed: 0 sec  <<< ERROR!
java.lang.NullPointerException: null

testCalendarTimezoneRespected[370](org.apache.commons.lang3.time.FastDatePrinterTimeZonesTest)  Time elapsed: 0 sec  <<< ERROR!
java.lang.NullPointerException: null

testCalendarTimezoneRespected[371](org.apache.commons.lang3.time.FastDatePrinterTimeZonesTest)  Time elapsed: 0.001 sec  <<< ERROR!
java.lang.NullPointerException: null

testCalendarTimezoneRespected[372](org.apache.commons.lang3.time.FastDatePrinterTimeZonesTest)  Time elapsed: 0 sec  <<< ERROR!
java.lang.NullPointerException: null

testCalendarTimezoneRespected[373](org.apache.commons.lang3.time.FastDatePrinterTimeZonesTest)  Time elapsed: 0 sec  <<< ERROR!
java.lang.NullPointerException: null

testCalendarTimezoneRespected[374](org.apache.commons.lang3.time.FastDatePrinterTimeZonesTest)  Time elapsed: 0 sec  <<< ERROR!
java.lang.NullPointerException: null

testCalendarTimezoneRespected[375](org.apache.commons.lang3.time.FastDatePrinterTimeZonesTest)  Time elapsed: 0 sec  <<< ERROR!
java.lang.NullPointerException: null

testCalendarTimezoneRespected[376](org.apache.commons.lang3.time.FastDatePrinterTimeZonesTest)  Time elapsed: 0 sec  <<< ERROR!
java.lang.NullPointerException: null

testCalendarTimezoneRespected[377](org.apache.commons.lang3.time.FastDatePrinterTimeZonesTest)  Time elapsed: 0 sec  <<< ERROR!
java.lang.NullPointerException: null

testCalendarTimezoneRespected[378](org.apache.commons.lang3.time.FastDatePrinterTimeZonesTest)  Time elapsed: 0 sec  <<< ERROR!
java.lang.NullPointerException: null

testCalendarTimezoneRespected[379](org.apache.commons.lang3.time.FastDatePrinterTimeZonesTest)  Time elapsed: 0 sec  <<< ERROR!
java.lang.NullPointerException: null

testCalendarTimezoneRespected[380](org.apache.commons.lang3.time.FastDatePrinterTimeZonesTest)  Time elapsed: 0 sec  <<< ERROR!
java.lang.NullPointerException: null

testCalendarTimezoneRespected[381](org.apache.commons.lang3.time.FastDatePrinterTimeZonesTest)  Time elapsed: 0 sec  <<< ERROR!
java.lang.NullPointerException: null

testCalendarTimezoneRespected[382](org.apache.commons.lang3.time.FastDatePrinterTimeZonesTest)  Time elapsed: 0 sec  <<< ERROR!
java.lang.NullPointerException: null

testCalendarTimezoneRespected[383](org.apache.commons.lang3.time.FastDatePrinterTimeZonesTest)  Time elapsed: 0.001 sec  <<< ERROR!
java.lang.NullPointerException: null

testCalendarTimezoneRespected[384](org.apache.commons.lang3.time.FastDatePrinterTimeZonesTest)  Time elapsed: 0 sec  <<< ERROR!
java.lang.NullPointerException: null

testCalendarTimezoneRespected[385](org.apache.commons.lang3.time.FastDatePrinterTimeZonesTest)  Time elapsed: 0 sec  <<< ERROR!
java.lang.NullPointerException: null

testCalendarTimezoneRespected[386](org.apache.commons.lang3.time.FastDatePrinterTimeZonesTest)  Time elapsed: 0 sec  <<< ERROR!
java.lang.NullPointerException: null

testCalendarTimezoneRespected[387](org.apache.commons.lang3.time.FastDatePrinterTimeZonesTest)  Time elapsed: 0 sec  <<< ERROR!
java.lang.NullPointerException: null

testCalendarTimezoneRespected[388](org.apache.commons.lang3.time.FastDatePrinterTimeZonesTest)  Time elapsed: 0 sec  <<< ERROR!
java.lang.NullPointerException: null

testCalendarTimezoneRespected[389](org.apache.commons.lang3.time.FastDatePrinterTimeZonesTest)  Time elapsed: 0 sec  <<< ERROR!
java.lang.NullPointerException: null

testCalendarTimezoneRespected[390](org.apache.commons.lang3.time.FastDatePrinterTimeZonesTest)  Time elapsed: 0.001 sec  <<< ERROR!
java.lang.NullPointerException: null

testCalendarTimezoneRespected[391](org.apache.commons.lang3.time.FastDatePrinterTimeZonesTest)  Time elapsed: 0 sec  <<< ERROR!
java.lang.NullPointerException: null

testCalendarTimezoneRespected[392](org.apache.commons.lang3.time.FastDatePrinterTimeZonesTest)  Time elapsed: 0 sec  <<< ERROR!
java.lang.NullPointerException: null

testCalendarTimezoneRespected[393](org.apache.commons.lang3.time.FastDatePrinterTimeZonesTest)  Time elapsed: 0 sec  <<< ERROR!
java.lang.NullPointerException: null

testCalendarTimezoneRespected[394](org.apache.commons.lang3.time.FastDatePrinterTimeZonesTest)  Time elapsed: 0.001 sec  <<< ERROR!
java.lang.NullPointerException: null

testCalendarTimezoneRespected[395](org.apache.commons.lang3.time.FastDatePrinterTimeZonesTest)  Time elapsed: 0 sec  <<< ERROR!
java.lang.NullPointerException: null

testCalendarTimezoneRespected[396](org.apache.commons.lang3.time.FastDatePrinterTimeZonesTest)  Time elapsed: 0 sec  <<< ERROR!
java.lang.NullPointerException: null

testCalendarTimezoneRespected[397](org.apache.commons.lang3.time.FastDatePrinterTimeZonesTest)  Time elapsed: 0 sec  <<< ERROR!
java.lang.NullPointerException: null

testCalendarTimezoneRespected[398](org.apache.commons.lang3.time.FastDatePrinterTimeZonesTest)  Time elapsed: 0.001 sec  <<< ERROR!
java.lang.NullPointerException: null

testCalendarTimezoneRespected[399](org.apache.commons.lang3.time.FastDatePrinterTimeZonesTest)  Time elapsed: 0 sec  <<< ERROR!
java.lang.NullPointerException: null

testCalendarTimezoneRespected[400](org.apache.commons.lang3.time.FastDatePrinterTimeZonesTest)  Time elapsed: 0 sec  <<< ERROR!
java.lang.NullPointerException: null

testCalendarTimezoneRespected[401](org.apache.commons.lang3.time.FastDatePrinterTimeZonesTest)  Time elapsed: 0 sec  <<< ERROR!
java.lang.NullPointerException: null

testCalendarTimezoneRespected[402](org.apache.commons.lang3.time.FastDatePrinterTimeZonesTest)  Time elapsed: 0 sec  <<< ERROR!
java.lang.NullPointerException: null

testCalendarTimezoneRespected[403](org.apache.commons.lang3.time.FastDatePrinterTimeZonesTest)  Time elapsed: 0 sec  <<< ERROR!
java.lang.NullPointerException: null

testCalendarTimezoneRespected[404](org.apache.commons.lang3.time.FastDatePrinterTimeZonesTest)  Time elapsed: 0 sec  <<< ERROR!
java.lang.NullPointerException: null

testCalendarTimezoneRespected[405](org.apache.commons.lang3.time.FastDatePrinterTimeZonesTest)  Time elapsed: 0 sec  <<< ERROR!
java.lang.NullPointerException: null

testCalendarTimezoneRespected[406](org.apache.commons.lang3.time.FastDatePrinterTimeZonesTest)  Time elapsed: 0 sec  <<< ERROR!
java.lang.NullPointerException: null

testCalendarTimezoneRespected[407](org.apache.commons.lang3.time.FastDatePrinterTimeZonesTest)  Time elapsed: 0 sec  <<< ERROR!
java.lang.NullPointerException: null

testCalendarTimezoneRespected[408](org.apache.commons.lang3.time.FastDatePrinterTimeZonesTest)  Time elapsed: 0 sec  <<< ERROR!
java.lang.NullPointerException: null

testCalendarTimezoneRespected[409](org.apache.commons.lang3.time.FastDatePrinterTimeZonesTest)  Time elapsed: 0 sec  <<< ERROR!
java.lang.NullPointerException: null

testCalendarTimezoneRespected[410](org.apache.commons.lang3.time.FastDatePrinterTimeZonesTest)  Time elapsed: 0 sec  <<< ERROR!
java.lang.NullPointerException: null

testCalendarTimezoneRespected[411](org.apache.commons.lang3.time.FastDatePrinterTimeZonesTest)  Time elapsed: 0.001 sec  <<< ERROR!
java.lang.NullPointerException: null

testCalendarTimezoneRespected[412](org.apache.commons.lang3.time.FastDatePrinterTimeZonesTest)  Time elapsed: 0 sec  <<< ERROR!
java.lang.NullPointerException: null

testCalendarTimezoneRespected[413](org.apache.commons.lang3.time.FastDatePrinterTimeZonesTest)  Time elapsed: 0 sec  <<< ERROR!
java.lang.NullPointerException: null

testCalendarTimezoneRespected[414](org.apache.commons.lang3.time.FastDatePrinterTimeZonesTest)  Time elapsed: 0 sec  <<< ERROR!
java.lang.NullPointerException: null

testCalendarTimezoneRespected[415](org.apache.commons.lang3.time.FastDatePrinterTimeZonesTest)  Time elapsed: 0.001 sec  <<< ERROR!
java.lang.NullPointerException: null

testCalendarTimezoneRespected[416](org.apache.commons.lang3.time.FastDatePrinterTimeZonesTest)  Time elapsed: 0 sec  <<< ERROR!
java.lang.NullPointerException: null

testCalendarTimezoneRespected[417](org.apache.commons.lang3.time.FastDatePrinterTimeZonesTest)  Time elapsed: 0 sec  <<< ERROR!
java.lang.NullPointerException: null

testCalendarTimezoneRespected[418](org.apache.commons.lang3.time.FastDatePrinterTimeZonesTest)  Time elapsed: 0 sec  <<< ERROR!
java.lang.NullPointerException: null

testCalendarTimezoneRespected[419](org.apache.commons.lang3.time.FastDatePrinterTimeZonesTest)  Time elapsed: 0 sec  <<< ERROR!
java.lang.NullPointerException: null

testCalendarTimezoneRespected[420](org.apache.commons.lang3.time.FastDatePrinterTimeZonesTest)  Time elapsed: 0 sec  <<< ERROR!
java.lang.NullPointerException: null

testCalendarTimezoneRespected[421](org.apache.commons.lang3.time.FastDatePrinterTimeZonesTest)  Time elapsed: 0 sec  <<< ERROR!
java.lang.NullPointerException: null

testCalendarTimezoneRespected[422](org.apache.commons.lang3.time.FastDatePrinterTimeZonesTest)  Time elapsed: 0 sec  <<< ERROR!
java.lang.NullPointerException: null

testCalendarTimezoneRespected[423](org.apache.commons.lang3.time.FastDatePrinterTimeZonesTest)  Time elapsed: 0.001 sec  <<< ERROR!
java.lang.NullPointerException: null

testCalendarTimezoneRespected[424](org.apache.commons.lang3.time.FastDatePrinterTimeZonesTest)  Time elapsed: 0 sec  <<< ERROR!
java.lang.NullPointerException: null

testCalendarTimezoneRespected[425](org.apache.commons.lang3.time.FastDatePrinterTimeZonesTest)  Time elapsed: 0 sec  <<< ERROR!
java.lang.NullPointerException: null

testCalendarTimezoneRespected[426](org.apache.commons.lang3.time.FastDatePrinterTimeZonesTest)  Time elapsed: 0 sec  <<< ERROR!
java.lang.NullPointerException: null

testCalendarTimezoneRespected[427](org.apache.commons.lang3.time.FastDatePrinterTimeZonesTest)  Time elapsed: 0.001 sec  <<< ERROR!
java.lang.NullPointerException: null

testCalendarTimezoneRespected[428](org.apache.commons.lang3.time.FastDatePrinterTimeZonesTest)  Time elapsed: 0 sec  <<< ERROR!
java.lang.NullPointerException: null

testCalendarTimezoneRespected[429](org.apache.commons.lang3.time.FastDatePrinterTimeZonesTest)  Time elapsed: 0 sec  <<< ERROR!
java.lang.NullPointerException: null

testCalendarTimezoneRespected[430](org.apache.commons.lang3.time.FastDatePrinterTimeZonesTest)  Time elapsed: 0 sec  <<< ERROR!
java.lang.NullPointerException: null

testCalendarTimezoneRespected[431](org.apache.commons.lang3.time.FastDatePrinterTimeZonesTest)  Time elapsed: 0 sec  <<< ERROR!
java.lang.NullPointerException: null

testCalendarTimezoneRespected[432](org.apache.commons.lang3.time.FastDatePrinterTimeZonesTest)  Time elapsed: 0 sec  <<< ERROR!
java.lang.NullPointerException: null

testCalendarTimezoneRespected[433](org.apache.commons.lang3.time.FastDatePrinterTimeZonesTest)  Time elapsed: 0 sec  <<< ERROR!
java.lang.NullPointerException: null

testCalendarTimezoneRespected[434](org.apache.commons.lang3.time.FastDatePrinterTimeZonesTest)  Time elapsed: 0 sec  <<< ERROR!
java.lang.NullPointerException: null

testCalendarTimezoneRespected[435](org.apache.commons.lang3.time.FastDatePrinterTimeZonesTest)  Time elapsed: 0 sec  <<< ERROR!
java.lang.NullPointerException: null

testCalendarTimezoneRespected[436](org.apache.commons.lang3.time.FastDatePrinterTimeZonesTest)  Time elapsed: 0 sec  <<< ERROR!
java.lang.NullPointerException: null

testCalendarTimezoneRespected[437](org.apache.commons.lang3.time.FastDatePrinterTimeZonesTest)  Time elapsed: 0 sec  <<< ERROR!
java.lang.NullPointerException: null

testCalendarTimezoneRespected[438](org.apache.commons.lang3.time.FastDatePrinterTimeZonesTest)  Time elapsed: 0 sec  <<< ERROR!
java.lang.NullPointerException: null

testCalendarTimezoneRespected[439](org.apache.commons.lang3.time.FastDatePrinterTimeZonesTest)  Time elapsed: 0.001 sec  <<< ERROR!
java.lang.NullPointerException: null

testCalendarTimezoneRespected[440](org.apache.commons.lang3.time.FastDatePrinterTimeZonesTest)  Time elapsed: 0 sec  <<< ERROR!
java.lang.NullPointerException: null

testCalendarTimezoneRespected[441](org.apache.commons.lang3.time.FastDatePrinterTimeZonesTest)  Time elapsed: 0 sec  <<< ERROR!
java.lang.NullPointerException: null

testCalendarTimezoneRespected[442](org.apache.commons.lang3.time.FastDatePrinterTimeZonesTest)  Time elapsed: 0 sec  <<< ERROR!
java.lang.NullPointerException: null

testCalendarTimezoneRespected[443](org.apache.commons.lang3.time.FastDatePrinterTimeZonesTest)  Time elapsed: 0.001 sec  <<< ERROR!
java.lang.NullPointerException: null

testCalendarTimezoneRespected[444](org.apache.commons.lang3.time.FastDatePrinterTimeZonesTest)  Time elapsed: 0 sec  <<< ERROR!
java.lang.NullPointerException: null

testCalendarTimezoneRespected[445](org.apache.commons.lang3.time.FastDatePrinterTimeZonesTest)  Time elapsed: 0 sec  <<< ERROR!
java.lang.NullPointerException: null

testCalendarTimezoneRespected[446](org.apache.commons.lang3.time.FastDatePrinterTimeZonesTest)  Time elapsed: 0 sec  <<< ERROR!
java.lang.NullPointerException: null

testCalendarTimezoneRespected[447](org.apache.commons.lang3.time.FastDatePrinterTimeZonesTest)  Time elapsed: 0 sec  <<< ERROR!
java.lang.NullPointerException: null

testCalendarTimezoneRespected[448](org.apache.commons.lang3.time.FastDatePrinterTimeZonesTest)  Time elapsed: 0 sec  <<< ERROR!
java.lang.NullPointerException: null

testCalendarTimezoneRespected[449](org.apache.commons.lang3.time.FastDatePrinterTimeZonesTest)  Time elapsed: 0 sec  <<< ERROR!
java.lang.NullPointerException: null

testCalendarTimezoneRespected[450](org.apache.commons.lang3.time.FastDatePrinterTimeZonesTest)  Time elapsed: 0 sec  <<< ERROR!
java.lang.NullPointerException: null

testCalendarTimezoneRespected[451](org.apache.commons.lang3.time.FastDatePrinterTimeZonesTest)  Time elapsed: 0 sec  <<< ERROR!
java.lang.NullPointerException: null

testCalendarTimezoneRespected[452](org.apache.commons.lang3.time.FastDatePrinterTimeZonesTest)  Time elapsed: 0.001 sec  <<< ERROR!
java.lang.NullPointerException: null

testCalendarTimezoneRespected[453](org.apache.commons.lang3.time.FastDatePrinterTimeZonesTest)  Time elapsed: 0 sec  <<< ERROR!
java.lang.NullPointerException: null

testCalendarTimezoneRespected[454](org.apache.commons.lang3.time.FastDatePrinterTimeZonesTest)  Time elapsed: 0 sec  <<< ERROR!
java.lang.NullPointerException: null

testCalendarTimezoneRespected[455](org.apache.commons.lang3.time.FastDatePrinterTimeZonesTest)  Time elapsed: 0 sec  <<< ERROR!
java.lang.NullPointerException: null

testCalendarTimezoneRespected[456](org.apache.commons.lang3.time.FastDatePrinterTimeZonesTest)  Time elapsed: 0 sec  <<< ERROR!
java.lang.NullPointerException: null

testCalendarTimezoneRespected[457](org.apache.commons.lang3.time.FastDatePrinterTimeZonesTest)  Time elapsed: 0 sec  <<< ERROR!
java.lang.NullPointerException: null

testCalendarTimezoneRespected[458](org.apache.commons.lang3.time.FastDatePrinterTimeZonesTest)  Time elapsed: 0 sec  <<< ERROR!
java.lang.NullPointerException: null

testCalendarTimezoneRespected[459](org.apache.commons.lang3.time.FastDatePrinterTimeZonesTest)  Time elapsed: 0.001 sec  <<< ERROR!
java.lang.NullPointerException: null

testCalendarTimezoneRespected[460](org.apache.commons.lang3.time.FastDatePrinterTimeZonesTest)  Time elapsed: 0 sec  <<< ERROR!
java.lang.NullPointerException: null

testCalendarTimezoneRespected[461](org.apache.commons.lang3.time.FastDatePrinterTimeZonesTest)  Time elapsed: 0 sec  <<< ERROR!
java.lang.NullPointerException: null

testCalendarTimezoneRespected[462](org.apache.commons.lang3.time.FastDatePrinterTimeZonesTest)  Time elapsed: 0 sec  <<< ERROR!
java.lang.NullPointerException: null

testCalendarTimezoneRespected[463](org.apache.commons.lang3.time.FastDatePrinterTimeZonesTest)  Time elapsed: 0.001 sec  <<< ERROR!
java.lang.NullPointerException: null

testCalendarTimezoneRespected[464](org.apache.commons.lang3.time.FastDatePrinterTimeZonesTest)  Time elapsed: 0 sec  <<< ERROR!
java.lang.NullPointerException: null

testCalendarTimezoneRespected[465](org.apache.commons.lang3.time.FastDatePrinterTimeZonesTest)  Time elapsed: 0 sec  <<< ERROR!
java.lang.NullPointerException: null

testCalendarTimezoneRespected[466](org.apache.commons.lang3.time.FastDatePrinterTimeZonesTest)  Time elapsed: 0 sec  <<< ERROR!
java.lang.NullPointerException: null

testCalendarTimezoneRespected[467](org.apache.commons.lang3.time.FastDatePrinterTimeZonesTest)  Time elapsed: 0.001 sec  <<< ERROR!
java.lang.NullPointerException: null

testCalendarTimezoneRespected[468](org.apache.commons.lang3.time.FastDatePrinterTimeZonesTest)  Time elapsed: 0 sec  <<< ERROR!
java.lang.NullPointerException: null

testCalendarTimezoneRespected[469](org.apache.commons.lang3.time.FastDatePrinterTimeZonesTest)  Time elapsed: 0 sec  <<< ERROR!
java.lang.NullPointerException: null

testCalendarTimezoneRespected[470](org.apache.commons.lang3.time.FastDatePrinterTimeZonesTest)  Time elapsed: 0 sec  <<< ERROR!
java.lang.NullPointerException: null

testCalendarTimezoneRespected[471](org.apache.commons.lang3.time.FastDatePrinterTimeZonesTest)  Time elapsed: 0 sec  <<< ERROR!
java.lang.NullPointerException: null

testCalendarTimezoneRespected[472](org.apache.commons.lang3.time.FastDatePrinterTimeZonesTest)  Time elapsed: 0 sec  <<< ERROR!
java.lang.NullPointerException: null

testCalendarTimezoneRespected[473](org.apache.commons.lang3.time.FastDatePrinterTimeZonesTest)  Time elapsed: 0 sec  <<< ERROR!
java.lang.NullPointerException: null

testCalendarTimezoneRespected[474](org.apache.commons.lang3.time.FastDatePrinterTimeZonesTest)  Time elapsed: 0 sec  <<< ERROR!
java.lang.NullPointerException: null

testCalendarTimezoneRespected[475](org.apache.commons.lang3.time.FastDatePrinterTimeZonesTest)  Time elapsed: 0 sec  <<< ERROR!
java.lang.NullPointerException: null

testCalendarTimezoneRespected[476](org.apache.commons.lang3.time.FastDatePrinterTimeZonesTest)  Time elapsed: 0 sec  <<< ERROR!
java.lang.NullPointerException: null

testCalendarTimezoneRespected[477](org.apache.commons.lang3.time.FastDatePrinterTimeZonesTest)  Time elapsed: 0 sec  <<< ERROR!
java.lang.NullPointerException: null

testCalendarTimezoneRespected[478](org.apache.commons.lang3.time.FastDatePrinterTimeZonesTest)  Time elapsed: 0 sec  <<< ERROR!
java.lang.NullPointerException: null

testCalendarTimezoneRespected[479](org.apache.commons.lang3.time.FastDatePrinterTimeZonesTest)  Time elapsed: 0 sec  <<< ERROR!
java.lang.NullPointerException: null

testCalendarTimezoneRespected[480](org.apache.commons.lang3.time.FastDatePrinterTimeZonesTest)  Time elapsed: 0.001 sec  <<< ERROR!
java.lang.NullPointerException: null

testCalendarTimezoneRespected[481](org.apache.commons.lang3.time.FastDatePrinterTimeZonesTest)  Time elapsed: 0 sec  <<< ERROR!
java.lang.NullPointerException: null

testCalendarTimezoneRespected[482](org.apache.commons.lang3.time.FastDatePrinterTimeZonesTest)  Time elapsed: 0 sec  <<< ERROR!
java.lang.NullPointerException: null

testCalendarTimezoneRespected[483](org.apache.commons.lang3.time.FastDatePrinterTimeZonesTest)  Time elapsed: 0 sec  <<< ERROR!
java.lang.NullPointerException: null

testCalendarTimezoneRespected[484](org.apache.commons.lang3.time.FastDatePrinterTimeZonesTest)  Time elapsed: 0.001 sec  <<< ERROR!
java.lang.NullPointerException: null

testCalendarTimezoneRespected[485](org.apache.commons.lang3.time.FastDatePrinterTimeZonesTest)  Time elapsed: 0 sec  <<< ERROR!
java.lang.NullPointerException: null

testCalendarTimezoneRespected[486](org.apache.commons.lang3.time.FastDatePrinterTimeZonesTest)  Time elapsed: 0 sec  <<< ERROR!
java.lang.NullPointerException: null

testCalendarTimezoneRespected[487](org.apache.commons.lang3.time.FastDatePrinterTimeZonesTest)  Time elapsed: 0 sec  <<< ERROR!
java.lang.NullPointerException: null

testCalendarTimezoneRespected[488](org.apache.commons.lang3.time.FastDatePrinterTimeZonesTest)  Time elapsed: 0.001 sec  <<< ERROR!
java.lang.NullPointerException: null

testCalendarTimezoneRespected[489](org.apache.commons.lang3.time.FastDatePrinterTimeZonesTest)  Time elapsed: 0 sec  <<< ERROR!
java.lang.NullPointerException: null

testCalendarTimezoneRespected[490](org.apache.commons.lang3.time.FastDatePrinterTimeZonesTest)  Time elapsed: 0 sec  <<< ERROR!
java.lang.NullPointerException: null

testCalendarTimezoneRespected[491](org.apache.commons.lang3.time.FastDatePrinterTimeZonesTest)  Time elapsed: 0 sec  <<< ERROR!
java.lang.NullPointerException: null

testCalendarTimezoneRespected[492](org.apache.commons.lang3.time.FastDatePrinterTimeZonesTest)  Time elapsed: 0.001 sec  <<< ERROR!
java.lang.NullPointerException: null

testCalendarTimezoneRespected[493](org.apache.commons.lang3.time.FastDatePrinterTimeZonesTest)  Time elapsed: 0 sec  <<< ERROR!
java.lang.NullPointerException: null

testCalendarTimezoneRespected[494](org.apache.commons.lang3.time.FastDatePrinterTimeZonesTest)  Time elapsed: 0 sec  <<< ERROR!
java.lang.NullPointerException: null

testCalendarTimezoneRespected[495](org.apache.commons.lang3.time.FastDatePrinterTimeZonesTest)  Time elapsed: 0 sec  <<< ERROR!
java.lang.NullPointerException: null

testCalendarTimezoneRespected[496](org.apache.commons.lang3.time.FastDatePrinterTimeZonesTest)  Time elapsed: 0 sec  <<< ERROR!
java.lang.NullPointerException: null

testCalendarTimezoneRespected[497](org.apache.commons.lang3.time.FastDatePrinterTimeZonesTest)  Time elapsed: 0 sec  <<< ERROR!
java.lang.NullPointerException: null

testCalendarTimezoneRespected[498](org.apache.commons.lang3.time.FastDatePrinterTimeZonesTest)  Time elapsed: 0 sec  <<< ERROR!
java.lang.NullPointerException: null

testCalendarTimezoneRespected[499](org.apache.commons.lang3.time.FastDatePrinterTimeZonesTest)  Time elapsed: 0.001 sec  <<< ERROR!
java.lang.NullPointerException: null

testCalendarTimezoneRespected[500](org.apache.commons.lang3.time.FastDatePrinterTimeZonesTest)  Time elapsed: 0 sec  <<< ERROR!
java.lang.NullPointerException: null

testCalendarTimezoneRespected[501](org.apache.commons.lang3.time.FastDatePrinterTimeZonesTest)  Time elapsed: 0 sec  <<< ERROR!
java.lang.NullPointerException: null

testCalendarTimezoneRespected[502](org.apache.commons.lang3.time.FastDatePrinterTimeZonesTest)  Time elapsed: 0 sec  <<< ERROR!
java.lang.NullPointerException: null

testCalendarTimezoneRespected[503](org.apache.commons.lang3.time.FastDatePrinterTimeZonesTest)  Time elapsed: 0.001 sec  <<< ERROR!
java.lang.NullPointerException: null

testCalendarTimezoneRespected[504](org.apache.commons.lang3.time.FastDatePrinterTimeZonesTest)  Time elapsed: 0 sec  <<< ERROR!
java.lang.NullPointerException: null

testCalendarTimezoneRespected[505](org.apache.commons.lang3.time.FastDatePrinterTimeZonesTest)  Time elapsed: 0 sec  <<< ERROR!
java.lang.NullPointerException: null

testCalendarTimezoneRespected[506](org.apache.commons.lang3.time.FastDatePrinterTimeZonesTest)  Time elapsed: 0 sec  <<< ERROR!
java.lang.NullPointerException: null

testCalendarTimezoneRespected[507](org.apache.commons.lang3.time.FastDatePrinterTimeZonesTest)  Time elapsed: 0.001 sec  <<< ERROR!
java.lang.NullPointerException: null

testCalendarTimezoneRespected[508](org.apache.commons.lang3.time.FastDatePrinterTimeZonesTest)  Time elapsed: 0 sec  <<< ERROR!
java.lang.NullPointerException: null

testCalendarTimezoneRespected[509](org.apache.commons.lang3.time.FastDatePrinterTimeZonesTest)  Time elapsed: 0 sec  <<< ERROR!
java.lang.NullPointerException: null

testCalendarTimezoneRespected[510](org.apache.commons.lang3.time.FastDatePrinterTimeZonesTest)  Time elapsed: 0.001 sec  <<< ERROR!
java.lang.NullPointerException: null

testCalendarTimezoneRespected[511](org.apache.commons.lang3.time.FastDatePrinterTimeZonesTest)  Time elapsed: 0 sec  <<< ERROR!
java.lang.NullPointerException: null

testCalendarTimezoneRespected[512](org.apache.commons.lang3.time.FastDatePrinterTimeZonesTest)  Time elapsed: 0 sec  <<< ERROR!
java.lang.NullPointerException: null

testCalendarTimezoneRespected[513](org.apache.commons.lang3.time.FastDatePrinterTimeZonesTest)  Time elapsed: 0.001 sec  <<< ERROR!
java.lang.NullPointerException: null

testCalendarTimezoneRespected[514](org.apache.commons.lang3.time.FastDatePrinterTimeZonesTest)  Time elapsed: 0 sec  <<< ERROR!
java.lang.NullPointerException: null

testCalendarTimezoneRespected[515](org.apache.commons.lang3.time.FastDatePrinterTimeZonesTest)  Time elapsed: 0 sec  <<< ERROR!
java.lang.NullPointerException: null

testCalendarTimezoneRespected[516](org.apache.commons.lang3.time.FastDatePrinterTimeZonesTest)  Time elapsed: 0.001 sec  <<< ERROR!
java.lang.NullPointerException: null

testCalendarTimezoneRespected[517](org.apache.commons.lang3.time.FastDatePrinterTimeZonesTest)  Time elapsed: 0 sec  <<< ERROR!
java.lang.NullPointerException: null

testCalendarTimezoneRespected[518](org.apache.commons.lang3.time.FastDatePrinterTimeZonesTest)  Time elapsed: 0 sec  <<< ERROR!
java.lang.NullPointerException: null

testCalendarTimezoneRespected[519](org.apache.commons.lang3.time.FastDatePrinterTimeZonesTest)  Time elapsed: 0.001 sec  <<< ERROR!
java.lang.NullPointerException: null

testCalendarTimezoneRespected[520](org.apache.commons.lang3.time.FastDatePrinterTimeZonesTest)  Time elapsed: 0 sec  <<< ERROR!
java.lang.NullPointerException: null

testCalendarTimezoneRespected[521](org.apache.commons.lang3.time.FastDatePrinterTimeZonesTest)  Time elapsed: 0 sec  <<< ERROR!
java.lang.NullPointerException: null

testCalendarTimezoneRespected[522](org.apache.commons.lang3.time.FastDatePrinterTimeZonesTest)  Time elapsed: 0 sec  <<< ERROR!
java.lang.NullPointerException: null

testCalendarTimezoneRespected[523](org.apache.commons.lang3.time.FastDatePrinterTimeZonesTest)  Time elapsed: 0 sec  <<< ERROR!
java.lang.NullPointerException: null

testCalendarTimezoneRespected[524](org.apache.commons.lang3.time.FastDatePrinterTimeZonesTest)  Time elapsed: 0 sec  <<< ERROR!
java.lang.NullPointerException: null

testCalendarTimezoneRespected[525](org.apache.commons.lang3.time.FastDatePrinterTimeZonesTest)  Time elapsed: 0 sec  <<< ERROR!
java.lang.NullPointerException: null

testCalendarTimezoneRespected[526](org.apache.commons.lang3.time.FastDatePrinterTimeZonesTest)  Time elapsed: 0 sec  <<< ERROR!
java.lang.NullPointerException: null

testCalendarTimezoneRespected[527](org.apache.commons.lang3.time.FastDatePrinterTimeZonesTest)  Time elapsed: 0 sec  <<< ERROR!
java.lang.NullPointerException: null

testCalendarTimezoneRespected[528](org.apache.commons.lang3.time.FastDatePrinterTimeZonesTest)  Time elapsed: 0 sec  <<< ERROR!
java.lang.NullPointerException: null

testCalendarTimezoneRespected[529](org.apache.commons.lang3.time.FastDatePrinterTimeZonesTest)  Time elapsed: 0.001 sec  <<< ERROR!
java.lang.NullPointerException: null

testCalendarTimezoneRespected[530](org.apache.commons.lang3.time.FastDatePrinterTimeZonesTest)  Time elapsed: 0 sec  <<< ERROR!
java.lang.NullPointerException: null

testCalendarTimezoneRespected[531](org.apache.commons.lang3.time.FastDatePrinterTimeZonesTest)  Time elapsed: 0 sec  <<< ERROR!
java.lang.NullPointerException: null

testCalendarTimezoneRespected[532](org.apache.commons.lang3.time.FastDatePrinterTimeZonesTest)  Time elapsed: 0 sec  <<< ERROR!
java.lang.NullPointerException: null

testCalendarTimezoneRespected[533](org.apache.commons.lang3.time.FastDatePrinterTimeZonesTest)  Time elapsed: 0.001 sec  <<< ERROR!
java.lang.NullPointerException: null

testCalendarTimezoneRespected[534](org.apache.commons.lang3.time.FastDatePrinterTimeZonesTest)  Time elapsed: 0 sec  <<< ERROR!
java.lang.NullPointerException: null

testCalendarTimezoneRespected[535](org.apache.commons.lang3.time.FastDatePrinterTimeZonesTest)  Time elapsed: 0 sec  <<< ERROR!
java.lang.NullPointerException: null

testCalendarTimezoneRespected[536](org.apache.commons.lang3.time.FastDatePrinterTimeZonesTest)  Time elapsed: 0 sec  <<< ERROR!
java.lang.NullPointerException: null

testCalendarTimezoneRespected[537](org.apache.commons.lang3.time.FastDatePrinterTimeZonesTest)  Time elapsed: 0.001 sec  <<< ERROR!
java.lang.NullPointerException: null

testCalendarTimezoneRespected[538](org.apache.commons.lang3.time.FastDatePrinterTimeZonesTest)  Time elapsed: 0 sec  <<< ERROR!
java.lang.NullPointerException: null

testCalendarTimezoneRespected[539](org.apache.commons.lang3.time.FastDatePrinterTimeZonesTest)  Time elapsed: 0 sec  <<< ERROR!
java.lang.NullPointerException: null

testCalendarTimezoneRespected[540](org.apache.commons.lang3.time.FastDatePrinterTimeZonesTest)  Time elapsed: 0 sec  <<< ERROR!
java.lang.NullPointerException: null

testCalendarTimezoneRespected[541](org.apache.commons.lang3.time.FastDatePrinterTimeZonesTest)  Time elapsed: 0.001 sec  <<< ERROR!
java.lang.NullPointerException: null

testCalendarTimezoneRespected[542](org.apache.commons.lang3.time.FastDatePrinterTimeZonesTest)  Time elapsed: 0 sec  <<< ERROR!
java.lang.NullPointerException: null

testCalendarTimezoneRespected[543](org.apache.commons.lang3.time.FastDatePrinterTimeZonesTest)  Time elapsed: 0 sec  <<< ERROR!
java.lang.NullPointerException: null

testCalendarTimezoneRespected[544](org.apache.commons.lang3.time.FastDatePrinterTimeZonesTest)  Time elapsed: 0 sec  <<< ERROR!
java.lang.NullPointerException: null

testCalendarTimezoneRespected[545](org.apache.commons.lang3.time.FastDatePrinterTimeZonesTest)  Time elapsed: 0 sec  <<< ERROR!
java.lang.NullPointerException: null

testCalendarTimezoneRespected[546](org.apache.commons.lang3.time.FastDatePrinterTimeZonesTest)  Time elapsed: 0 sec  <<< ERROR!
java.lang.NullPointerException: null

testCalendarTimezoneRespected[547](org.apache.commons.lang3.time.FastDatePrinterTimeZonesTest)  Time elapsed: 0 sec  <<< ERROR!
java.lang.NullPointerException: null

testCalendarTimezoneRespected[548](org.apache.commons.lang3.time.FastDatePrinterTimeZonesTest)  Time elapsed: 0 sec  <<< ERROR!
java.lang.NullPointerException: null

testCalendarTimezoneRespected[549](org.apache.commons.lang3.time.FastDatePrinterTimeZonesTest)  Time elapsed: 0 sec  <<< ERROR!
java.lang.NullPointerException: null

testCalendarTimezoneRespected[550](org.apache.commons.lang3.time.FastDatePrinterTimeZonesTest)  Time elapsed: 0 sec  <<< ERROR!
java.lang.NullPointerException: null

testCalendarTimezoneRespected[551](org.apache.commons.lang3.time.FastDatePrinterTimeZonesTest)  Time elapsed: 0 sec  <<< ERROR!
java.lang.NullPointerException: null

testCalendarTimezoneRespected[552](org.apache.commons.lang3.time.FastDatePrinterTimeZonesTest)  Time elapsed: 0 sec  <<< ERROR!
java.lang.NullPointerException: null

testCalendarTimezoneRespected[553](org.apache.commons.lang3.time.FastDatePrinterTimeZonesTest)  Time elapsed: 0 sec  <<< ERROR!
java.lang.NullPointerException: null

testCalendarTimezoneRespected[554](org.apache.commons.lang3.time.FastDatePrinterTimeZonesTest)  Time elapsed: 0.001 sec  <<< ERROR!
java.lang.NullPointerException: null

testCalendarTimezoneRespected[555](org.apache.commons.lang3.time.FastDatePrinterTimeZonesTest)  Time elapsed: 0 sec  <<< ERROR!
java.lang.NullPointerException: null

testCalendarTimezoneRespected[556](org.apache.commons.lang3.time.FastDatePrinterTimeZonesTest)  Time elapsed: 0 sec  <<< ERROR!
java.lang.NullPointerException: null

testCalendarTimezoneRespected[557](org.apache.commons.lang3.time.FastDatePrinterTimeZonesTest)  Time elapsed: 0 sec  <<< ERROR!
java.lang.NullPointerException: null

testCalendarTimezoneRespected[558](org.apache.commons.lang3.time.FastDatePrinterTimeZonesTest)  Time elapsed: 0 sec  <<< ERROR!
java.lang.NullPointerException: null

testCalendarTimezoneRespected[559](org.apache.commons.lang3.time.FastDatePrinterTimeZonesTest)  Time elapsed: 0 sec  <<< ERROR!
java.lang.NullPointerException: null

testCalendarTimezoneRespected[560](org.apache.commons.lang3.time.FastDatePrinterTimeZonesTest)  Time elapsed: 0 sec  <<< ERROR!
java.lang.NullPointerException: null

testCalendarTimezoneRespected[561](org.apache.commons.lang3.time.FastDatePrinterTimeZonesTest)  Time elapsed: 0 sec  <<< ERROR!
java.lang.NullPointerException: null

testCalendarTimezoneRespected[562](org.apache.commons.lang3.time.FastDatePrinterTimeZonesTest)  Time elapsed: 0.001 sec  <<< ERROR!
java.lang.NullPointerException: null

testCalendarTimezoneRespected[563](org.apache.commons.lang3.time.FastDatePrinterTimeZonesTest)  Time elapsed: 0 sec  <<< ERROR!
java.lang.NullPointerException: null

testCalendarTimezoneRespected[564](org.apache.commons.lang3.time.FastDatePrinterTimeZonesTest)  Time elapsed: 0 sec  <<< ERROR!
java.lang.NullPointerException: null

testCalendarTimezoneRespected[565](org.apache.commons.lang3.time.FastDatePrinterTimeZonesTest)  Time elapsed: 0.001 sec  <<< ERROR!
java.lang.NullPointerException: null

testCalendarTimezoneRespected[566](org.apache.commons.lang3.time.FastDatePrinterTimeZonesTest)  Time elapsed: 0 sec  <<< ERROR!
java.lang.NullPointerException: null

testCalendarTimezoneRespected[567](org.apache.commons.lang3.time.FastDatePrinterTimeZonesTest)  Time elapsed: 0 sec  <<< ERROR!
java.lang.NullPointerException: null

testCalendarTimezoneRespected[568](org.apache.commons.lang3.time.FastDatePrinterTimeZonesTest)  Time elapsed: 0 sec  <<< ERROR!
java.lang.NullPointerException: null

testCalendarTimezoneRespected[569](org.apache.commons.lang3.time.FastDatePrinterTimeZonesTest)  Time elapsed: 0.001 sec  <<< ERROR!
java.lang.NullPointerException: null

testCalendarTimezoneRespected[570](org.apache.commons.lang3.time.FastDatePrinterTimeZonesTest)  Time elapsed: 0 sec  <<< ERROR!
java.lang.NullPointerException: null

testCalendarTimezoneRespected[571](org.apache.commons.lang3.time.FastDatePrinterTimeZonesTest)  Time elapsed: 0 sec  <<< ERROR!
java.lang.NullPointerException: null

testCalendarTimezoneRespected[572](org.apache.commons.lang3.time.FastDatePrinterTimeZonesTest)  Time elapsed: 0 sec  <<< ERROR!
java.lang.NullPointerException: null

testCalendarTimezoneRespected[573](org.apache.commons.lang3.time.FastDatePrinterTimeZonesTest)  Time elapsed: 0.001 sec  <<< ERROR!
java.lang.NullPointerException: null

testCalendarTimezoneRespected[574](org.apache.commons.lang3.time.FastDatePrinterTimeZonesTest)  Time elapsed: 0 sec  <<< ERROR!
java.lang.NullPointerException: null

testCalendarTimezoneRespected[575](org.apache.commons.lang3.time.FastDatePrinterTimeZonesTest)  Time elapsed: 0 sec  <<< ERROR!
java.lang.NullPointerException: null

testCalendarTimezoneRespected[576](org.apache.commons.lang3.time.FastDatePrinterTimeZonesTest)  Time elapsed: 0 sec  <<< ERROR!
java.lang.NullPointerException: null

testCalendarTimezoneRespected[577](org.apache.commons.lang3.time.FastDatePrinterTimeZonesTest)  Time elapsed: 0 sec  <<< ERROR!
java.lang.NullPointerException: null

testCalendarTimezoneRespected[578](org.apache.commons.lang3.time.FastDatePrinterTimeZonesTest)  Time elapsed: 0 sec  <<< ERROR!
java.lang.NullPointerException: null

testCalendarTimezoneRespected[579](org.apache.commons.lang3.time.FastDatePrinterTimeZonesTest)  Time elapsed: 0 sec  <<< ERROR!
java.lang.NullPointerException: null

testCalendarTimezoneRespected[580](org.apache.commons.lang3.time.FastDatePrinterTimeZonesTest)  Time elapsed: 0 sec  <<< ERROR!
java.lang.NullPointerException: null

testCalendarTimezoneRespected[581](org.apache.commons.lang3.time.FastDatePrinterTimeZonesTest)  Time elapsed: 0 sec  <<< ERROR!
java.lang.NullPointerException: null

testCalendarTimezoneRespected[582](org.apache.commons.lang3.time.FastDatePrinterTimeZonesTest)  Time elapsed: 0.001 sec  <<< ERROR!
java.lang.NullPointerException: null

testCalendarTimezoneRespected[583](org.apache.commons.lang3.time.FastDatePrinterTimeZonesTest)  Time elapsed: 0 sec  <<< ERROR!
java.lang.NullPointerException: null

testCalendarTimezoneRespected[584](org.apache.commons.lang3.time.FastDatePrinterTimeZonesTest)  Time elapsed: 0 sec  <<< ERROR!
java.lang.NullPointerException: null

testCalendarTimezoneRespected[585](org.apache.commons.lang3.time.FastDatePrinterTimeZonesTest)  Time elapsed: 0 sec  <<< ERROR!
java.lang.NullPointerException: null

testCalendarTimezoneRespected[586](org.apache.commons.lang3.time.FastDatePrinterTimeZonesTest)  Time elapsed: 0.001 sec  <<< ERROR!
java.lang.NullPointerException: null

testCalendarTimezoneRespected[587](org.apache.commons.lang3.time.FastDatePrinterTimeZonesTest)  Time elapsed: 0 sec  <<< ERROR!
java.lang.NullPointerException: null

testCalendarTimezoneRespected[588](org.apache.commons.lang3.time.FastDatePrinterTimeZonesTest)  Time elapsed: 0 sec  <<< ERROR!
java.lang.NullPointerException: null

testCalendarTimezoneRespected[589](org.apache.commons.lang3.time.FastDatePrinterTimeZonesTest)  Time elapsed: 0 sec  <<< ERROR!
java.lang.NullPointerException: null

testCalendarTimezoneRespected[590](org.apache.commons.lang3.time.FastDatePrinterTimeZonesTest)  Time elapsed: 0 sec  <<< ERROR!
java.lang.NullPointerException: null

testCalendarTimezoneRespected[591](org.apache.commons.lang3.time.FastDatePrinterTimeZonesTest)  Time elapsed: 0 sec  <<< ERROR!
java.lang.NullPointerException: null

testCalendarTimezoneRespected[592](org.apache.commons.lang3.time.FastDatePrinterTimeZonesTest)  Time elapsed: 0 sec  <<< ERROR!
java.lang.NullPointerException: null

testCalendarTimezoneRespected[593](org.apache.commons.lang3.time.FastDatePrinterTimeZonesTest)  Time elapsed: 0 sec  <<< ERROR!
java.lang.NullPointerException: null

testCalendarTimezoneRespected[594](org.apache.commons.lang3.time.FastDatePrinterTimeZonesTest)  Time elapsed: 0.001 sec  <<< ERROR!
java.lang.NullPointerException: null

testCalendarTimezoneRespected[595](org.apache.commons.lang3.time.FastDatePrinterTimeZonesTest)  Time elapsed: 0 sec  <<< ERROR!
java.lang.NullPointerException: null

testCalendarTimezoneRespected[596](org.apache.commons.lang3.time.FastDatePrinterTimeZonesTest)  Time elapsed: 0 sec  <<< ERROR!
java.lang.NullPointerException: null

testCalendarTimezoneRespected[597](org.apache.commons.lang3.time.FastDatePrinterTimeZonesTest)  Time elapsed: 0.001 sec  <<< ERROR!
java.lang.NullPointerException: null

testCalendarTimezoneRespected[598](org.apache.commons.lang3.time.FastDatePrinterTimeZonesTest)  Time elapsed: 0 sec  <<< ERROR!
java.lang.NullPointerException: null

testCalendarTimezoneRespected[599](org.apache.commons.lang3.time.FastDatePrinterTimeZonesTest)  Time elapsed: 0 sec  <<< ERROR!
java.lang.NullPointerException: null

testCalendarTimezoneRespected[600](org.apache.commons.lang3.time.FastDatePrinterTimeZonesTest)  Time elapsed: 0 sec  <<< ERROR!
java.lang.NullPointerException: null

testCalendarTimezoneRespected[601](org.apache.commons.lang3.time.FastDatePrinterTimeZonesTest)  Time elapsed: 0 sec  <<< ERROR!
java.lang.NullPointerException: null

testCalendarTimezoneRespected[602](org.apache.commons.lang3.time.FastDatePrinterTimeZonesTest)  Time elapsed: 0 sec  <<< ERROR!
java.lang.NullPointerException: null

testCalendarTimezoneRespected[603](org.apache.commons.lang3.time.FastDatePrinterTimeZonesTest)  Time elapsed: 0 sec  <<< ERROR!
java.lang.NullPointerException: null

testCalendarTimezoneRespected[604](org.apache.commons.lang3.time.FastDatePrinterTimeZonesTest)  Time elapsed: 0.001 sec  <<< ERROR!
java.lang.NullPointerException: null

testCalendarTimezoneRespected[605](org.apache.commons.lang3.time.FastDatePrinterTimeZonesTest)  Time elapsed: 0 sec  <<< ERROR!
java.lang.NullPointerException: null

testCalendarTimezoneRespected[606](org.apache.commons.lang3.time.FastDatePrinterTimeZonesTest)  Time elapsed: 0 sec  <<< ERROR!
java.lang.NullPointerException: null

testCalendarTimezoneRespected[607](org.apache.commons.lang3.time.FastDatePrinterTimeZonesTest)  Time elapsed: 0.001 sec  <<< ERROR!
java.lang.NullPointerException: null

testCalendarTimezoneRespected[608](org.apache.commons.lang3.time.FastDatePrinterTimeZonesTest)  Time elapsed: 0 sec  <<< ERROR!
java.lang.NullPointerException: null

testCalendarTimezoneRespected[609](org.apache.commons.lang3.time.FastDatePrinterTimeZonesTest)  Time elapsed: 0 sec  <<< ERROR!
java.lang.NullPointerException: null

testCalendarTimezoneRespected[610](org.apache.commons.lang3.time.FastDatePrinterTimeZonesTest)  Time elapsed: 0.001 sec  <<< ERROR!
java.lang.NullPointerException: null

testCalendarTimezoneRespected[611](org.apache.commons.lang3.time.FastDatePrinterTimeZonesTest)  Time elapsed: 0 sec  <<< ERROR!
java.lang.NullPointerException: null

testCalendarTimezoneRespected[612](org.apache.commons.lang3.time.FastDatePrinterTimeZonesTest)  Time elapsed: 0 sec  <<< ERROR!
java.lang.NullPointerException: null

testCalendarTimezoneRespected[613](org.apache.commons.lang3.time.FastDatePrinterTimeZonesTest)  Time elapsed: 0 sec  <<< ERROR!
java.lang.NullPointerException: null

testCalendarTimezoneRespected[614](org.apache.commons.lang3.time.FastDatePrinterTimeZonesTest)  Time elapsed: 0 sec  <<< ERROR!
java.lang.NullPointerException: null

testCalendarTimezoneRespected[615](org.apache.commons.lang3.time.FastDatePrinterTimeZonesTest)  Time elapsed: 0 sec  <<< ERROR!
java.lang.NullPointerException: null

testCalendarTimezoneRespected[616](org.apache.commons.lang3.time.FastDatePrinterTimeZonesTest)  Time elapsed: 0 sec  <<< ERROR!
java.lang.NullPointerException: null

Running org.apache.commons.lang3.time.FastDateFormatTest
Tests run: 14, Failures: 3, Errors: 5, Skipped: 0, Time elapsed: 0.001 sec <<< FAILURE! - in org.apache.commons.lang3.time.FastDateFormatTest
testParseSync(org.apache.commons.lang3.time.FastDateFormatTest)  Time elapsed: 0 sec  <<< ERROR!
java.lang.NullPointerException: null

testLang954(org.apache.commons.lang3.time.FastDateFormatTest)  Time elapsed: 0 sec  <<< ERROR!
java.lang.NullPointerException: null

test_getInstance_String_TimeZone_Locale(org.apache.commons.lang3.time.FastDateFormatTest)  Time elapsed: 0 sec  <<< FAILURE!
java.lang.AssertionError: expected:<de_DE> but was:<en_US>
	at org.junit.Assert.fail(Assert.java:88)
	at org.junit.Assert.failNotEquals(Assert.java:834)
	at org.junit.Assert.assertEquals(Assert.java:118)
	at org.junit.Assert.assertEquals(Assert.java:144)
	at org.apache.commons.lang3.time.FastDateFormatTest.test_getInstance_String_TimeZone_Locale(FastDateFormatTest.java:179)

test_changeDefault_Locale_DateInstance(org.apache.commons.lang3.time.FastDateFormatTest)  Time elapsed: 0 sec  <<< FAILURE!
java.lang.AssertionError: expected same:<de_DE> was not:<en_US>
	at org.junit.Assert.fail(Assert.java:88)
	at org.junit.Assert.failNotSame(Assert.java:828)
	at org.junit.Assert.assertSame(Assert.java:771)
	at org.junit.Assert.assertSame(Assert.java:782)
	at org.apache.commons.lang3.time.FastDateFormatTest.test_changeDefault_Locale_DateInstance(FastDateFormatTest.java:129)

test_getInstance_String(org.apache.commons.lang3.time.FastDateFormatTest)  Time elapsed: 0 sec  <<< ERROR!
java.lang.NullPointerException: null

test_getInstance_String_TimeZone(org.apache.commons.lang3.time.FastDateFormatTest)  Time elapsed: 0 sec  <<< ERROR!
java.lang.NullPointerException: null

test_getInstance_String_Locale(org.apache.commons.lang3.time.FastDateFormatTest)  Time elapsed: 0 sec  <<< ERROR!
java.lang.NullPointerException: null

test_changeDefault_Locale_DateTimeInstance(org.apache.commons.lang3.time.FastDateFormatTest)  Time elapsed: 0 sec  <<< FAILURE!
java.lang.AssertionError: expected same:<de_DE> was not:<en_US>
	at org.junit.Assert.fail(Assert.java:88)
	at org.junit.Assert.failNotSame(Assert.java:828)
	at org.junit.Assert.assertSame(Assert.java:771)
	at org.junit.Assert.assertSame(Assert.java:782)
	at org.apache.commons.lang3.time.FastDateFormatTest.test_changeDefault_Locale_DateTimeInstance(FastDateFormatTest.java:150)

Running org.apache.commons.lang3.time.FastDateFormat_PrinterTest
Tests run: 17, Failures: 2, Errors: 1, Skipped: 0, Time elapsed: 0.002 sec <<< FAILURE! - in org.apache.commons.lang3.time.FastDateFormat_PrinterTest
testLocaleMatches(org.apache.commons.lang3.time.FastDateFormat_PrinterTest)  Time elapsed: 0 sec  <<< FAILURE!
java.lang.AssertionError: expected:<sv_SE> but was:<en_US>
	at org.junit.Assert.fail(Assert.java:88)
	at org.junit.Assert.failNotEquals(Assert.java:834)
	at org.junit.Assert.assertEquals(Assert.java:118)
	at org.junit.Assert.assertEquals(Assert.java:144)
	at org.apache.commons.lang3.time.FastDatePrinterTest.testLocaleMatches(FastDatePrinterTest.java:257)
	at sun.reflect.NativeMethodAccessorImpl.invoke0(Native Method)
	at sun.reflect.NativeMethodAccessorImpl.invoke(NativeMethodAccessorImpl.java:57)
	at sun.reflect.DelegatingMethodAccessorImpl.invoke(DelegatingMethodAccessorImpl.java:43)
	at java.lang.reflect.Method.invoke(Method.java:606)
	at org.junit.runners.model.FrameworkMethod$1.runReflectiveCall(FrameworkMethod.java:50)
	at org.junit.internal.runners.model.ReflectiveCallable.run(ReflectiveCallable.java:12)
	at org.junit.runners.model.FrameworkMethod.invokeExplosively(FrameworkMethod.java:47)
	at org.junit.internal.runners.statements.InvokeMethod.evaluate(InvokeMethod.java:17)
	at org.junit.runners.ParentRunner.runLeaf(ParentRunner.java:325)
	at org.junit.runners.BlockJUnit4ClassRunner.runChild(BlockJUnit4ClassRunner.java:78)
	at org.junit.runners.BlockJUnit4ClassRunner.runChild(BlockJUnit4ClassRunner.java:57)
	at org.junit.runners.ParentRunner$3.run(ParentRunner.java:290)
	at org.junit.runners.ParentRunner$1.schedule(ParentRunner.java:71)
	at org.junit.runners.ParentRunner.runChildren(ParentRunner.java:288)
	at org.junit.runners.ParentRunner.access$000(ParentRunner.java:58)
	at org.junit.runners.ParentRunner$2.evaluate(ParentRunner.java:268)
	at org.junit.runners.ParentRunner.run(ParentRunner.java:363)
	at org.apache.maven.surefire.junit4.JUnit4Provider.execute(JUnit4Provider.java:283)
	at org.apache.maven.surefire.junit4.JUnit4Provider.executeWithRerun(JUnit4Provider.java:173)
	at org.apache.maven.surefire.junit4.JUnit4Provider.executeTestSet(JUnit4Provider.java:153)
	at org.apache.maven.surefire.junit4.JUnit4Provider.invoke(JUnit4Provider.java:128)
	at org.apache.maven.surefire.booter.ForkedBooter.invokeProviderInSameClassLoader(ForkedBooter.java:203)
	at org.apache.maven.surefire.booter.ForkedBooter.runSuitesInProcess(ForkedBooter.java:155)
	at org.apache.maven.surefire.booter.ForkedBooter.main(ForkedBooter.java:103)

testLang645(org.apache.commons.lang3.time.FastDateFormat_PrinterTest)  Time elapsed: 0 sec  <<< FAILURE!
org.junit.ComparisonFailure: expected:<[fredag, week 53]> but was:<[Friday, week 01]>
	at org.junit.Assert.assertEquals(Assert.java:115)
	at org.junit.Assert.assertEquals(Assert.java:144)
	at org.apache.commons.lang3.time.FastDatePrinterTest.testLang645(FastDatePrinterTest.java:228)
	at sun.reflect.NativeMethodAccessorImpl.invoke0(Native Method)
	at sun.reflect.NativeMethodAccessorImpl.invoke(NativeMethodAccessorImpl.java:57)
	at sun.reflect.DelegatingMethodAccessorImpl.invoke(DelegatingMethodAccessorImpl.java:43)
	at java.lang.reflect.Method.invoke(Method.java:606)
	at org.junit.runners.model.FrameworkMethod$1.runReflectiveCall(FrameworkMethod.java:50)
	at org.junit.internal.runners.model.ReflectiveCallable.run(ReflectiveCallable.java:12)
	at org.junit.runners.model.FrameworkMethod.invokeExplosively(FrameworkMethod.java:47)
	at org.junit.internal.runners.statements.InvokeMethod.evaluate(InvokeMethod.java:17)
	at org.junit.runners.ParentRunner.runLeaf(ParentRunner.java:325)
	at org.junit.runners.BlockJUnit4ClassRunner.runChild(BlockJUnit4ClassRunner.java:78)
	at org.junit.runners.BlockJUnit4ClassRunner.runChild(BlockJUnit4ClassRunner.java:57)
	at org.junit.runners.ParentRunner$3.run(ParentRunner.java:290)
	at org.junit.runners.ParentRunner$1.schedule(ParentRunner.java:71)
	at org.junit.runners.ParentRunner.runChildren(ParentRunner.java:288)
	at org.junit.runners.ParentRunner.access$000(ParentRunner.java:58)
	at org.junit.runners.ParentRunner$2.evaluate(ParentRunner.java:268)
	at org.junit.runners.ParentRunner.run(ParentRunner.java:363)
	at org.apache.maven.surefire.junit4.JUnit4Provider.execute(JUnit4Provider.java:283)
	at org.apache.maven.surefire.junit4.JUnit4Provider.executeWithRerun(JUnit4Provider.java:173)
	at org.apache.maven.surefire.junit4.JUnit4Provider.executeTestSet(JUnit4Provider.java:153)
	at org.apache.maven.surefire.junit4.JUnit4Provider.invoke(JUnit4Provider.java:128)
	at org.apache.maven.surefire.booter.ForkedBooter.invokeProviderInSameClassLoader(ForkedBooter.java:203)
	at org.apache.maven.surefire.booter.ForkedBooter.runSuitesInProcess(ForkedBooter.java:155)
	at org.apache.maven.surefire.booter.ForkedBooter.main(ForkedBooter.java:103)

testTimeZoneAsZ(org.apache.commons.lang3.time.FastDateFormat_PrinterTest)  Time elapsed: 0 sec  <<< ERROR!
java.lang.NullPointerException: null

Running org.apache.commons.lang3.time.FastDatePrinterTest
Tests run: 17, Failures: 0, Errors: 1, Skipped: 0, Time elapsed: 0.001 sec <<< FAILURE! - in org.apache.commons.lang3.time.FastDatePrinterTest
testTimeZoneAsZ(org.apache.commons.lang3.time.FastDatePrinterTest)  Time elapsed: 0 sec  <<< ERROR!
java.lang.NullPointerException: null

Running org.apache.commons.lang3.time.FastDateParserSDFTest
Tests run: 276, Failures: 0, Errors: 0, Skipped: 92, Time elapsed: 0.032 sec - in org.apache.commons.lang3.time.FastDateParserSDFTest
Running org.apache.commons.lang3.time.DateUtilsTest
DateUtilsTest: Default Locale=en_US
Tests run: 38, Failures: 0, Errors: 1, Skipped: 0, Time elapsed: 0.025 sec <<< FAILURE! - in org.apache.commons.lang3.time.DateUtilsTest
testLang530(org.apache.commons.lang3.time.DateUtilsTest)  Time elapsed: 0 sec  <<< ERROR!
java.lang.NoClassDefFoundError: Could not initialize class org.apache.commons.lang3.time.DateFormatUtils
	at org.apache.commons.lang3.time.DateUtilsTest.testLang530(DateUtilsTest.java:1222)

Running org.apache.commons.lang3.reflect.InheritanceUtilsTest
Tests run: 9, Failures: 0, Errors: 0, Skipped: 0, Time elapsed: 0.002 sec - in org.apache.commons.lang3.reflect.InheritanceUtilsTest
Running org.apache.commons.lang3.reflect.MethodUtilsTest
Tests run: 23, Failures: 0, Errors: 0, Skipped: 0, Time elapsed: 0.028 sec - in org.apache.commons.lang3.reflect.MethodUtilsTest
Running org.apache.commons.lang3.reflect.ConstructorUtilsTest
Tests run: 7, Failures: 0, Errors: 0, Skipped: 0, Time elapsed: 0.004 sec - in org.apache.commons.lang3.reflect.ConstructorUtilsTest
Running org.apache.commons.lang3.reflect.FieldUtilsTest
Tests run: 64, Failures: 0, Errors: 0, Skipped: 0, Time elapsed: 0.038 sec - in org.apache.commons.lang3.reflect.FieldUtilsTest
Running org.apache.commons.lang3.reflect.TypeLiteralTest
Tests run: 4, Failures: 0, Errors: 0, Skipped: 0, Time elapsed: 0.012 sec - in org.apache.commons.lang3.reflect.TypeLiteralTest
Running org.apache.commons.lang3.reflect.TypeUtilsTest
Tests run: 19, Failures: 0, Errors: 0, Skipped: 0, Time elapsed: 0.054 sec - in org.apache.commons.lang3.reflect.TypeUtilsTest
Running org.apache.commons.lang3.mutable.MutableByteTest
Tests run: 17, Failures: 0, Errors: 0, Skipped: 0, Time elapsed: 0.009 sec - in org.apache.commons.lang3.mutable.MutableByteTest
Running org.apache.commons.lang3.mutable.MutableShortTest
Tests run: 14, Failures: 0, Errors: 0, Skipped: 0, Time elapsed: 0.003 sec - in org.apache.commons.lang3.mutable.MutableShortTest
Running org.apache.commons.lang3.mutable.MutableIntTest
Tests run: 17, Failures: 0, Errors: 0, Skipped: 0, Time elapsed: 0.005 sec - in org.apache.commons.lang3.mutable.MutableIntTest
Running org.apache.commons.lang3.mutable.MutableDoubleTest
Tests run: 18, Failures: 0, Errors: 0, Skipped: 0, Time elapsed: 0.007 sec - in org.apache.commons.lang3.mutable.MutableDoubleTest
Running org.apache.commons.lang3.mutable.MutableFloatTest
Tests run: 18, Failures: 0, Errors: 0, Skipped: 0, Time elapsed: 0.006 sec - in org.apache.commons.lang3.mutable.MutableFloatTest
Running org.apache.commons.lang3.mutable.MutableLongTest
Tests run: 17, Failures: 0, Errors: 0, Skipped: 0, Time elapsed: 0.004 sec - in org.apache.commons.lang3.mutable.MutableLongTest
Running org.apache.commons.lang3.mutable.MutableBooleanTest
Tests run: 9, Failures: 0, Errors: 0, Skipped: 0, Time elapsed: 0.002 sec - in org.apache.commons.lang3.mutable.MutableBooleanTest
Running org.apache.commons.lang3.mutable.MutableObjectTest
Tests run: 5, Failures: 0, Errors: 0, Skipped: 0, Time elapsed: 0.001 sec - in org.apache.commons.lang3.mutable.MutableObjectTest
Running org.apache.commons.lang3.text.translate.UnicodeEscaperTest
Tests run: 3, Failures: 0, Errors: 0, Skipped: 0, Time elapsed: 0 sec - in org.apache.commons.lang3.text.translate.UnicodeEscaperTest
Running org.apache.commons.lang3.text.translate.EntityArraysTest
Tests run: 3, Failures: 0, Errors: 0, Skipped: 0, Time elapsed: 0.001 sec - in org.apache.commons.lang3.text.translate.EntityArraysTest
Running org.apache.commons.lang3.text.translate.UnicodeUnpairedSurrogateRemoverTest
Tests run: 2, Failures: 0, Errors: 0, Skipped: 0, Time elapsed: 0 sec - in org.apache.commons.lang3.text.translate.UnicodeUnpairedSurrogateRemoverTest
Running org.apache.commons.lang3.text.translate.NumericEntityUnescaperTest
Tests run: 3, Failures: 0, Errors: 0, Skipped: 0, Time elapsed: 0 sec - in org.apache.commons.lang3.text.translate.NumericEntityUnescaperTest
Running org.apache.commons.lang3.text.translate.NumericEntityEscaperTest
Tests run: 4, Failures: 0, Errors: 0, Skipped: 0, Time elapsed: 0.001 sec - in org.apache.commons.lang3.text.translate.NumericEntityEscaperTest
Running org.apache.commons.lang3.text.translate.LookupTranslatorTest
Tests run: 2, Failures: 0, Errors: 0, Skipped: 0, Time elapsed: 0 sec - in org.apache.commons.lang3.text.translate.LookupTranslatorTest
Running org.apache.commons.lang3.text.translate.UnicodeUnescaperTest
Tests run: 3, Failures: 0, Errors: 0, Skipped: 0, Time elapsed: 0 sec - in org.apache.commons.lang3.text.translate.UnicodeUnescaperTest
Running org.apache.commons.lang3.text.translate.OctalUnescaperTest
Tests run: 1, Failures: 0, Errors: 0, Skipped: 0, Time elapsed: 0 sec - in org.apache.commons.lang3.text.translate.OctalUnescaperTest
Running org.apache.commons.lang3.text.StrMatcherTest
Tests run: 14, Failures: 0, Errors: 0, Skipped: 0, Time elapsed: 0.005 sec - in org.apache.commons.lang3.text.StrMatcherTest
Running org.apache.commons.lang3.text.StrTokenizerTest
Tests run: 55, Failures: 0, Errors: 0, Skipped: 0, Time elapsed: 0.016 sec - in org.apache.commons.lang3.text.StrTokenizerTest
Running org.apache.commons.lang3.text.FormattableUtilsTest
Tests run: 5, Failures: 0, Errors: 0, Skipped: 0, Time elapsed: 0 sec - in org.apache.commons.lang3.text.FormattableUtilsTest
Running org.apache.commons.lang3.text.CompositeFormatTest
Tests run: 2, Failures: 0, Errors: 0, Skipped: 0, Time elapsed: 0.002 sec - in org.apache.commons.lang3.text.CompositeFormatTest
Running org.apache.commons.lang3.text.WordUtilsTest
Tests run: 12, Failures: 0, Errors: 0, Skipped: 0, Time elapsed: 0.003 sec - in org.apache.commons.lang3.text.WordUtilsTest
Running org.apache.commons.lang3.text.StrLookupTest
Tests run: 5, Failures: 0, Errors: 0, Skipped: 0, Time elapsed: 0.003 sec - in org.apache.commons.lang3.text.StrLookupTest
Running org.apache.commons.lang3.text.StrBuilderAppendInsertTest
Tests run: 51, Failures: 0, Errors: 0, Skipped: 0, Time elapsed: 0.015 sec - in org.apache.commons.lang3.text.StrBuilderAppendInsertTest
Running org.apache.commons.lang3.text.ExtendedMessageFormatTest
Tests run: 10, Failures: 0, Errors: 0, Skipped: 0, Time elapsed: 0.81 sec - in org.apache.commons.lang3.text.ExtendedMessageFormatTest
Running org.apache.commons.lang3.text.StrSubstitutorTest
Tests run: 40, Failures: 0, Errors: 0, Skipped: 0, Time elapsed: 0.034 sec - in org.apache.commons.lang3.text.StrSubstitutorTest
Running org.apache.commons.lang3.text.StrBuilderTest
Tests run: 90, Failures: 0, Errors: 0, Skipped: 0, Time elapsed: 0.048 sec - in org.apache.commons.lang3.text.StrBuilderTest
Running org.apache.commons.lang3.StringEscapeUtilsTest
Tests run: 28, Failures: 0, Errors: 0, Skipped: 0, Time elapsed: 0.55 sec - in org.apache.commons.lang3.StringEscapeUtilsTest
Running org.apache.commons.lang3.AnnotationUtilsTest
Tests run: 10, Failures: 0, Errors: 0, Skipped: 0, Time elapsed: 0.02 sec - in org.apache.commons.lang3.AnnotationUtilsTest
Running org.apache.commons.lang3.ConversionTest
Tests run: 42, Failures: 0, Errors: 0, Skipped: 0, Time elapsed: 0.013 sec - in org.apache.commons.lang3.ConversionTest
Running org.apache.commons.lang3.StringUtilsTrimEmptyTest
Tests run: 15, Failures: 0, Errors: 0, Skipped: 0, Time elapsed: 0.007 sec - in org.apache.commons.lang3.StringUtilsTrimEmptyTest
Running org.apache.commons.lang3.EnumUtilsTest
Tests run: 34, Failures: 0, Errors: 0, Skipped: 0, Time elapsed: 0.015 sec - in org.apache.commons.lang3.EnumUtilsTest
Running org.apache.commons.lang3.exception.ExceptionUtilsTest
Tests run: 28, Failures: 0, Errors: 0, Skipped: 0, Time elapsed: 0.024 sec - in org.apache.commons.lang3.exception.ExceptionUtilsTest
Running org.apache.commons.lang3.exception.DefaultExceptionContextTest
Tests run: 8, Failures: 0, Errors: 0, Skipped: 0, Time elapsed: 0.004 sec - in org.apache.commons.lang3.exception.DefaultExceptionContextTest
Running org.apache.commons.lang3.exception.ContextedExceptionTest
Tests run: 14, Failures: 0, Errors: 0, Skipped: 0, Time elapsed: 0.018 sec - in org.apache.commons.lang3.exception.ContextedExceptionTest
Running org.apache.commons.lang3.exception.ContextedRuntimeExceptionTest
Tests run: 14, Failures: 0, Errors: 0, Skipped: 0, Time elapsed: 0.015 sec - in org.apache.commons.lang3.exception.ContextedRuntimeExceptionTest
Running org.apache.commons.lang3.BitFieldTest
Tests run: 15, Failures: 0, Errors: 0, Skipped: 0, Time elapsed: 0.005 sec - in org.apache.commons.lang3.BitFieldTest
Running org.apache.commons.lang3.ArrayUtilsRemoveMultipleTest
Tests run: 55, Failures: 0, Errors: 0, Skipped: 0, Time elapsed: 0.004 sec - in org.apache.commons.lang3.ArrayUtilsRemoveMultipleTest
Running org.apache.commons.lang3.HashSetvBitSetTest
Ratio=9% array=100 count=1 extract=22403029 bitset=2057185
Ratio=12% array=100 count=10 extract=16020652 bitset=1938915
Ratio=12% array=100 count=50 extract=11573524 bitset=1413084
Ratio=4% array=100 count=100 extract=12676229 bitset=560237
Ratio=79% array=1000 count=10 extract=7735165 bitset=6130483
Ratio=29% array=1000 count=100 extract=18876121 bitset=5521019
Ratio=7% array=1000 count=500 extract=50182758 bitset=3739783
Ratio=1% array=1000 count=1000 extract=79988591 bitset=825138
Ratio=332% count=0 hash=499837 bits=1659751
Ratio=23% count=5 hash=1212267 bits=286809
Ratio=20% count=10 hash=1940851 bits=404918
Ratio=17% count=200 hash=29402125 bits=5237358
Ratio=62% count=50 hash=8552061 bits=5316093
Ratio=19% count=100 hash=15472278 bits=3028273
Ratio=16% count=1000 hash=109007025 bits=17467990
Ratio=21% count=2000 hash=158465722 bits=34839455
Tests run: 2, Failures: 0, Errors: 0, Skipped: 0, Time elapsed: 0.758 sec - in org.apache.commons.lang3.HashSetvBitSetTest
Running org.apache.commons.lang3.StringUtilsTest
Tests run: 124, Failures: 0, Errors: 0, Skipped: 0, Time elapsed: 0.134 sec - in org.apache.commons.lang3.StringUtilsTest
Running org.apache.commons.lang3.ArrayUtilsRemoveTest
Tests run: 19, Failures: 0, Errors: 0, Skipped: 0, Time elapsed: 0.001 sec - in org.apache.commons.lang3.ArrayUtilsRemoveTest
Running org.apache.commons.lang3.ObjectUtilsTest
Tests run: 36, Failures: 0, Errors: 0, Skipped: 0, Time elapsed: 0.016 sec - in org.apache.commons.lang3.ObjectUtilsTest
Running org.apache.commons.lang3.ClassPathUtilsTest
Tests run: 13, Failures: 0, Errors: 0, Skipped: 0, Time elapsed: 0.001 sec - in org.apache.commons.lang3.ClassPathUtilsTest
Running org.apache.commons.lang3.math.NumberUtilsTest
Tests run: 91, Failures: 0, Errors: 0, Skipped: 0, Time elapsed: 0.03 sec - in org.apache.commons.lang3.math.NumberUtilsTest
Running org.apache.commons.lang3.math.IEEE754rUtilsTest
Tests run: 3, Failures: 0, Errors: 0, Skipped: 0, Time elapsed: 0.001 sec - in org.apache.commons.lang3.math.IEEE754rUtilsTest
Running org.apache.commons.lang3.math.FractionTest
Tests run: 25, Failures: 0, Errors: 0, Skipped: 0, Time elapsed: 0.118 sec - in org.apache.commons.lang3.math.FractionTest
Running org.apache.commons.lang3.BooleanUtilsTest
Tests run: 72, Failures: 0, Errors: 0, Skipped: 0, Time elapsed: 0.016 sec - in org.apache.commons.lang3.BooleanUtilsTest
Running org.apache.commons.lang3.CharSequenceUtilsTest
Tests run: 2, Failures: 0, Errors: 0, Skipped: 0, Time elapsed: 0.001 sec - in org.apache.commons.lang3.CharSequenceUtilsTest
Running org.apache.commons.lang3.CharSetUtilsTest
Tests run: 11, Failures: 0, Errors: 0, Skipped: 0, Time elapsed: 0.001 sec - in org.apache.commons.lang3.CharSetUtilsTest
Running org.apache.commons.lang3.ArrayUtilsAddTest
Tests run: 13, Failures: 0, Errors: 0, Skipped: 0, Time elapsed: 0.003 sec - in org.apache.commons.lang3.ArrayUtilsAddTest
Running org.apache.commons.lang3.CharEncodingTest
Tests run: 6, Failures: 0, Errors: 0, Skipped: 0, Time elapsed: 0.047 sec - in org.apache.commons.lang3.CharEncodingTest
Running org.apache.commons.lang3.ClassUtilsTest
Tests run: 57, Failures: 0, Errors: 0, Skipped: 0, Time elapsed: 0.036 sec - in org.apache.commons.lang3.ClassUtilsTest
Running org.apache.commons.lang3.RangeTest
Tests run: 24, Failures: 0, Errors: 0, Skipped: 0, Time elapsed: 0.007 sec - in org.apache.commons.lang3.RangeTest
Running org.apache.commons.lang3.event.EventUtilsTest
Tests run: 8, Failures: 0, Errors: 0, Skipped: 0, Time elapsed: 0.009 sec - in org.apache.commons.lang3.event.EventUtilsTest
Running org.apache.commons.lang3.event.EventListenerSupportTest
Tests run: 9, Failures: 0, Errors: 0, Skipped: 0, Time elapsed: 0.019 sec - in org.apache.commons.lang3.event.EventListenerSupportTest
Running org.apache.commons.lang3.ArrayUtilsTest
Tests run: 205, Failures: 0, Errors: 0, Skipped: 0, Time elapsed: 0.081 sec - in org.apache.commons.lang3.ArrayUtilsTest
Running org.apache.commons.lang3.CharUtilsTest
Tests run: 24, Failures: 0, Errors: 0, Skipped: 0, Time elapsed: 0.015 sec - in org.apache.commons.lang3.CharUtilsTest
Running org.apache.commons.lang3.NotImplementedExceptionTest
Tests run: 1, Failures: 0, Errors: 0, Skipped: 0, Time elapsed: 0.002 sec - in org.apache.commons.lang3.NotImplementedExceptionTest
Running org.apache.commons.lang3.StringUtilsEqualsIndexOfTest
Tests run: 50, Failures: 0, Errors: 0, Skipped: 0, Time elapsed: 0.062 sec - in org.apache.commons.lang3.StringUtilsEqualsIndexOfTest
Running org.apache.commons.lang3.RandomUtilsTest
Tests run: 23, Failures: 0, Errors: 0, Skipped: 0, Time elapsed: 0.014 sec - in org.apache.commons.lang3.RandomUtilsTest

Results :

Failed tests: 
  FastDateFormatTest.test_changeDefault_Locale_DateInstance:129 expected same:<de_DE> was not:<en_US>
  FastDateFormatTest.test_changeDefault_Locale_DateTimeInstance:150 expected same:<de_DE> was not:<en_US>
  FastDateFormatTest.test_getInstance_String_TimeZone_Locale:179 expected:<de_DE> but was:<en_US>
  FastDateFormat_ParserTest>FastDateParserTest.testLocaleMatches:564 expected:<sv_SE> but was:<en_US>
  FastDateFormat_ParserTest>FastDateParserTest.testLocales_LongNoEra_AD:303->FastDateParserTest.testLocales:340 Locale ms_MY failed with yyyy/MMMM/dddd/hhhh/mmmm/ss/aaaa/EEEE era AD
java.text.ParseException: Unparseable date: "2003/Februari/0010/0012/0000/00/AM/Isnin" does not matc...
  FastDateFormat_ParserTest>FastDateParserTest.testLocales_LongNoEra_BC:308->FastDateParserTest.testLocales:340 Locale ms_MY failed with yyyy/MMMM/dddd/hhhh/mmmm/ss/aaaa/EEEE era BC
java.text.ParseException: Unparseable date: "2003/Februari/0010/0012/0000/00/AM/Sabtu" does not matc...
  FastDateFormat_ParserTest>FastDateParserTest.testLocales_Long_AD:283->FastDateParserTest.testLocales:340 Locale ms_MY failed with GGGG/yyyy/MMMM/dddd/hhhh/mmmm/ss/aaaa/EEEE era AD
java.text.ParseException: Unparseable date: "CE/2003/Februari/0010/0012/0000/00/AM/Isnin" does not m...
  FastDateFormat_ParserTest>FastDateParserTest.testLocales_Long_BC:288->FastDateParserTest.testLocales:340 Locale ms_MY failed with GGGG/yyyy/MMMM/dddd/hhhh/mmmm/ss/aaaa/EEEE era BC
java.text.ParseException: Unparseable date: "BCE/2003/Februari/0010/0012/0000/00/AM/Sabtu" does not ...
  FastDateFormat_ParserTest>FastDateParserTest.testLocales_ShortNoEra_AD:313->FastDateParserTest.testLocales:340 Locale ms_MY failed with y/M/d/h/a/m/s/E era AD
java.text.ParseException: Unparseable date: "2003/2/10/12/AM/0/0/Isn" does not match (\p{Nd}++)\Q/\E...
  FastDateFormat_ParserTest>FastDateParserTest.testLocales_ShortNoEra_BC:318->FastDateParserTest.testLocales:340 Locale ms_MY failed with y/M/d/h/a/m/s/E era BC
java.text.ParseException: Unparseable date: "2003/2/10/12/AM/0/0/Sab" does not match (\p{Nd}++)\Q/\E...
  FastDateFormat_ParserTest>FastDateParserTest.testLocales_Short_AD:293->FastDateParserTest.testLocales:340 Locale ms_MY failed with G/y/M/d/h/a/m/s/E era AD
java.text.ParseException: Unparseable date: "CE/2003/2/10/12/AM/0/0/Isn" does not match ((?iu)\Qad\E...
  FastDateFormat_ParserTest>FastDateParserTest.testLocales_Short_BC:298->FastDateParserTest.testLocales:340 Locale ms_MY failed with G/y/M/d/h/a/m/s/E era BC
java.text.ParseException: Unparseable date: "BCE/2003/2/10/12/AM/0/0/Sab" does not match ((?iu)\Qad\...
  FastDateFormat_ParserTest>FastDateParserTest.test_Equality_Hash:112 expected:<5> but was:<6>
  FastDateFormat_PrinterTest>FastDatePrinterTest.testLang645:228 expected:<[fredag, week 53]> but was:<[Friday, week 01]>
  FastDateFormat_PrinterTest>FastDatePrinterTest.testLocaleMatches:257 expected:<sv_SE> but was:<en_US>

Tests in error: 
  DateFormatUtilsTest.testConstructor:39 NoClassDefFound Could not initialize cl...
  DateFormatUtilsTest.testDateISO:145 NoClassDefFound Could not initialize class...
  DateFormatUtilsTest.testDateTimeISO:113 NoClassDefFound Could not initialize c...
  DateFormatUtilsTest.testFormat:62 NoClassDefFound Could not initialize class o...
  DateFormatUtilsTest.testFormatCalendar:86 NoClassDefFound Could not initialize...
  DateFormatUtilsTest.testFormatUTC:99 NoClassDefFound Could not initialize clas...
  DateFormatUtilsTest.testLANG1000:266 NoClassDefFound Could not initialize clas...
  DateFormatUtilsTest.testSMTP:217 NoClassDefFound Could not initialize class or...
  DateFormatUtilsTest.testTimeISO:169 NoClassDefFound Could not initialize class...
  DateFormatUtilsTest.testTimeNoTISO:193 NoClassDefFound Could not initialize cl...
  DateUtilsRoundingTest.<init>:55 NoClassDefFound Could not initialize class org...
  DateUtilsRoundingTest.<init>:55 NoClassDefFound Could not initialize class org...
  DateUtilsRoundingTest.<init>:55 NoClassDefFound Could not initialize class org...
  DateUtilsRoundingTest.<init>:55 NoClassDefFound Could not initialize class org...
  DateUtilsRoundingTest.<init>:55 NoClassDefFound Could not initialize class org...
  DateUtilsRoundingTest.<init>:55 ExceptionInInitializer
  DateUtilsRoundingTest.<init>:55 NoClassDefFound Could not initialize class org...
  DateUtilsRoundingTest.<init>:55 NoClassDefFound Could not initialize class org...
  DateUtilsRoundingTest.<init>:55 NoClassDefFound Could not initialize class org...
  DateUtilsRoundingTest.<init>:55 NoClassDefFound Could not initialize class org...
  DateUtilsRoundingTest.<init>:55 NoClassDefFound Could not initialize class org...
  DateUtilsRoundingTest.<init>:55 NoClassDefFound Could not initialize class org...
  DateUtilsRoundingTest.<init>:55 NoClassDefFound Could not initialize class org...
  DateUtilsRoundingTest.<init>:55 NoClassDefFound Could not initialize class org...
  DateUtilsRoundingTest.<init>:55 NoClassDefFound Could not initialize class org...
  DateUtilsRoundingTest.<init>:55 NoClassDefFound Could not initialize class org...
  DateUtilsRoundingTest.<init>:55 NoClassDefFound Could not initialize class org...
  DateUtilsRoundingTest.<init>:55 NoClassDefFound Could not initialize class org...
  DateUtilsRoundingTest.<init>:55 NoClassDefFound Could not initialize class org...
  DateUtilsRoundingTest.<init>:55 NoClassDefFound Could not initialize class org...
  DateUtilsRoundingTest.<init>:55 NoClassDefFound Could not initialize class org...
  DateUtilsRoundingTest.<init>:55 NoClassDefFound Could not initialize class org...
  DateUtilsTest.testLang530:1222 NoClassDefFound Could not initialize class org....
  DurationFormatUtilsTest.testFormatPeriodISO:269 NoClassDefFound Could not init...
  FastDateFormatTest.testLang954 » NullPointer
  FastDateFormatTest.testParseSync » NullPointer
  FastDateFormatTest.test_getInstance_String » NullPointer
  FastDateFormatTest.test_getInstance_String_Locale » NullPointer
  FastDateFormatTest.test_getInstance_String_TimeZone » NullPointer
  FastDateFormat_PrinterTest.testTimeZoneAsZ » NullPointer
  FastDatePrinterTest.testTimeZoneAsZ » NullPointer
  FastDatePrinterTimeZonesTest.testCalendarTimezoneRespected[0] » NullPointer
  FastDatePrinterTimeZonesTest.testCalendarTimezoneRespected[100] » NullPointer
  FastDatePrinterTimeZonesTest.testCalendarTimezoneRespected[101] » NullPointer
  FastDatePrinterTimeZonesTest.testCalendarTimezoneRespected[102] » NullPointer
  FastDatePrinterTimeZonesTest.testCalendarTimezoneRespected[103] » NullPointer
  FastDatePrinterTimeZonesTest.testCalendarTimezoneRespected[104] » NullPointer
  FastDatePrinterTimeZonesTest.testCalendarTimezoneRespected[105] » NullPointer
  FastDatePrinterTimeZonesTest.testCalendarTimezoneRespected[106] » NullPointer
  FastDatePrinterTimeZonesTest.testCalendarTimezoneRespected[107] » NullPointer
  FastDatePrinterTimeZonesTest.testCalendarTimezoneRespected[108] » NullPointer
  FastDatePrinterTimeZonesTest.testCalendarTimezoneRespected[109] » NullPointer
  FastDatePrinterTimeZonesTest.testCalendarTimezoneRespected[10] » NullPointer
  FastDatePrinterTimeZonesTest.testCalendarTimezoneRespected[110] » NullPointer
  FastDatePrinterTimeZonesTest.testCalendarTimezoneRespected[111] » NullPointer
  FastDatePrinterTimeZonesTest.testCalendarTimezoneRespected[112] » NullPointer
  FastDatePrinterTimeZonesTest.testCalendarTimezoneRespected[113] » NullPointer
  FastDatePrinterTimeZonesTest.testCalendarTimezoneRespected[114] » NullPointer
  FastDatePrinterTimeZonesTest.testCalendarTimezoneRespected[115] » NullPointer
  FastDatePrinterTimeZonesTest.testCalendarTimezoneRespected[116] » NullPointer
  FastDatePrinterTimeZonesTest.testCalendarTimezoneRespected[117] » NullPointer
  FastDatePrinterTimeZonesTest.testCalendarTimezoneRespected[118] » NullPointer
  FastDatePrinterTimeZonesTest.testCalendarTimezoneRespected[119] » NullPointer
  FastDatePrinterTimeZonesTest.testCalendarTimezoneRespected[11] » NullPointer
  FastDatePrinterTimeZonesTest.testCalendarTimezoneRespected[120] » NullPointer
  FastDatePrinterTimeZonesTest.testCalendarTimezoneRespected[121] » NullPointer
  FastDatePrinterTimeZonesTest.testCalendarTimezoneRespected[122] » NullPointer
  FastDatePrinterTimeZonesTest.testCalendarTimezoneRespected[123] » NullPointer
  FastDatePrinterTimeZonesTest.testCalendarTimezoneRespected[124] » NullPointer
  FastDatePrinterTimeZonesTest.testCalendarTimezoneRespected[125] » NullPointer
  FastDatePrinterTimeZonesTest.testCalendarTimezoneRespected[126] » NullPointer
  FastDatePrinterTimeZonesTest.testCalendarTimezoneRespected[127] » NullPointer
  FastDatePrinterTimeZonesTest.testCalendarTimezoneRespected[128] » NullPointer
  FastDatePrinterTimeZonesTest.testCalendarTimezoneRespected[129] » NullPointer
  FastDatePrinterTimeZonesTest.testCalendarTimezoneRespected[12] » NullPointer
  FastDatePrinterTimeZonesTest.testCalendarTimezoneRespected[130] » NullPointer
  FastDatePrinterTimeZonesTest.testCalendarTimezoneRespected[131] » NullPointer
  FastDatePrinterTimeZonesTest.testCalendarTimezoneRespected[132] » NullPointer
  FastDatePrinterTimeZonesTest.testCalendarTimezoneRespected[133] » NullPointer
  FastDatePrinterTimeZonesTest.testCalendarTimezoneRespected[134] » NullPointer
  FastDatePrinterTimeZonesTest.testCalendarTimezoneRespected[135] » NullPointer
  FastDatePrinterTimeZonesTest.testCalendarTimezoneRespected[136] » NullPointer
  FastDatePrinterTimeZonesTest.testCalendarTimezoneRespected[137] » NullPointer
  FastDatePrinterTimeZonesTest.testCalendarTimezoneRespected[138] » NullPointer
  FastDatePrinterTimeZonesTest.testCalendarTimezoneRespected[139] » NullPointer
  FastDatePrinterTimeZonesTest.testCalendarTimezoneRespected[13] » NullPointer
  FastDatePrinterTimeZonesTest.testCalendarTimezoneRespected[140] » NullPointer
  FastDatePrinterTimeZonesTest.testCalendarTimezoneRespected[141] » NullPointer
  FastDatePrinterTimeZonesTest.testCalendarTimezoneRespected[142] » NullPointer
  FastDatePrinterTimeZonesTest.testCalendarTimezoneRespected[143] » NullPointer
  FastDatePrinterTimeZonesTest.testCalendarTimezoneRespected[144] » NullPointer
  FastDatePrinterTimeZonesTest.testCalendarTimezoneRespected[145] » NullPointer
  FastDatePrinterTimeZonesTest.testCalendarTimezoneRespected[146] » NullPointer
  FastDatePrinterTimeZonesTest.testCalendarTimezoneRespected[147] » NullPointer
  FastDatePrinterTimeZonesTest.testCalendarTimezoneRespected[148] » NullPointer
  FastDatePrinterTimeZonesTest.testCalendarTimezoneRespected[149] » NullPointer
  FastDatePrinterTimeZonesTest.testCalendarTimezoneRespected[14] » NullPointer
  FastDatePrinterTimeZonesTest.testCalendarTimezoneRespected[150] » NullPointer
  FastDatePrinterTimeZonesTest.testCalendarTimezoneRespected[151] » NullPointer
  FastDatePrinterTimeZonesTest.testCalendarTimezoneRespected[152] » NullPointer
  FastDatePrinterTimeZonesTest.testCalendarTimezoneRespected[153] » NullPointer
  FastDatePrinterTimeZonesTest.testCalendarTimezoneRespected[154] » NullPointer
  FastDatePrinterTimeZonesTest.testCalendarTimezoneRespected[155] » NullPointer
  FastDatePrinterTimeZonesTest.testCalendarTimezoneRespected[156] » NullPointer
  FastDatePrinterTimeZonesTest.testCalendarTimezoneRespected[157] » NullPointer
  FastDatePrinterTimeZonesTest.testCalendarTimezoneRespected[158] » NullPointer
  FastDatePrinterTimeZonesTest.testCalendarTimezoneRespected[159] » NullPointer
  FastDatePrinterTimeZonesTest.testCalendarTimezoneRespected[15] » NullPointer
  FastDatePrinterTimeZonesTest.testCalendarTimezoneRespected[160] » NullPointer
  FastDatePrinterTimeZonesTest.testCalendarTimezoneRespected[161] » NullPointer
  FastDatePrinterTimeZonesTest.testCalendarTimezoneRespected[162] » NullPointer
  FastDatePrinterTimeZonesTest.testCalendarTimezoneRespected[163] » NullPointer
  FastDatePrinterTimeZonesTest.testCalendarTimezoneRespected[164] » NullPointer
  FastDatePrinterTimeZonesTest.testCalendarTimezoneRespected[165] » NullPointer
  FastDatePrinterTimeZonesTest.testCalendarTimezoneRespected[166] » NullPointer
  FastDatePrinterTimeZonesTest.testCalendarTimezoneRespected[167] » NullPointer
  FastDatePrinterTimeZonesTest.testCalendarTimezoneRespected[168] » NullPointer
  FastDatePrinterTimeZonesTest.testCalendarTimezoneRespected[169] » NullPointer
  FastDatePrinterTimeZonesTest.testCalendarTimezoneRespected[16] » NullPointer
  FastDatePrinterTimeZonesTest.testCalendarTimezoneRespected[170] » NullPointer
  FastDatePrinterTimeZonesTest.testCalendarTimezoneRespected[171] » NullPointer
  FastDatePrinterTimeZonesTest.testCalendarTimezoneRespected[172] » NullPointer
  FastDatePrinterTimeZonesTest.testCalendarTimezoneRespected[173] » NullPointer
  FastDatePrinterTimeZonesTest.testCalendarTimezoneRespected[174] » NullPointer
  FastDatePrinterTimeZonesTest.testCalendarTimezoneRespected[175] » NullPointer
  FastDatePrinterTimeZonesTest.testCalendarTimezoneRespected[176] » NullPointer
  FastDatePrinterTimeZonesTest.testCalendarTimezoneRespected[177] » NullPointer
  FastDatePrinterTimeZonesTest.testCalendarTimezoneRespected[178] » NullPointer
  FastDatePrinterTimeZonesTest.testCalendarTimezoneRespected[179] » NullPointer
  FastDatePrinterTimeZonesTest.testCalendarTimezoneRespected[17] » NullPointer
  FastDatePrinterTimeZonesTest.testCalendarTimezoneRespected[180] » NullPointer
  FastDatePrinterTimeZonesTest.testCalendarTimezoneRespected[181] » NullPointer
  FastDatePrinterTimeZonesTest.testCalendarTimezoneRespected[182] » NullPointer
  FastDatePrinterTimeZonesTest.testCalendarTimezoneRespected[183] » NullPointer
  FastDatePrinterTimeZonesTest.testCalendarTimezoneRespected[184] » NullPointer
  FastDatePrinterTimeZonesTest.testCalendarTimezoneRespected[185] » NullPointer
  FastDatePrinterTimeZonesTest.testCalendarTimezoneRespected[186] » NullPointer
  FastDatePrinterTimeZonesTest.testCalendarTimezoneRespected[187] » NullPointer
  FastDatePrinterTimeZonesTest.testCalendarTimezoneRespected[188] » NullPointer
  FastDatePrinterTimeZonesTest.testCalendarTimezoneRespected[189] » NullPointer
  FastDatePrinterTimeZonesTest.testCalendarTimezoneRespected[18] » NullPointer
  FastDatePrinterTimeZonesTest.testCalendarTimezoneRespected[190] » NullPointer
  FastDatePrinterTimeZonesTest.testCalendarTimezoneRespected[191] » NullPointer
  FastDatePrinterTimeZonesTest.testCalendarTimezoneRespected[192] » NullPointer
  FastDatePrinterTimeZonesTest.testCalendarTimezoneRespected[193] » NullPointer
  FastDatePrinterTimeZonesTest.testCalendarTimezoneRespected[194] » NullPointer
  FastDatePrinterTimeZonesTest.testCalendarTimezoneRespected[195] » NullPointer
  FastDatePrinterTimeZonesTest.testCalendarTimezoneRespected[196] » NullPointer
  FastDatePrinterTimeZonesTest.testCalendarTimezoneRespected[197] » NullPointer
  FastDatePrinterTimeZonesTest.testCalendarTimezoneRespected[198] » NullPointer
  FastDatePrinterTimeZonesTest.testCalendarTimezoneRespected[199] » NullPointer
  FastDatePrinterTimeZonesTest.testCalendarTimezoneRespected[19] » NullPointer
  FastDatePrinterTimeZonesTest.testCalendarTimezoneRespected[1] » NullPointer
  FastDatePrinterTimeZonesTest.testCalendarTimezoneRespected[200] » NullPointer
  FastDatePrinterTimeZonesTest.testCalendarTimezoneRespected[201] » NullPointer
  FastDatePrinterTimeZonesTest.testCalendarTimezoneRespected[202] » NullPointer
  FastDatePrinterTimeZonesTest.testCalendarTimezoneRespected[203] » NullPointer
  FastDatePrinterTimeZonesTest.testCalendarTimezoneRespected[204] » NullPointer
  FastDatePrinterTimeZonesTest.testCalendarTimezoneRespected[205] » NullPointer
  FastDatePrinterTimeZonesTest.testCalendarTimezoneRespected[206] » NullPointer
  FastDatePrinterTimeZonesTest.testCalendarTimezoneRespected[207] » NullPointer
  FastDatePrinterTimeZonesTest.testCalendarTimezoneRespected[208] » NullPointer
  FastDatePrinterTimeZonesTest.testCalendarTimezoneRespected[209] » NullPointer
  FastDatePrinterTimeZonesTest.testCalendarTimezoneRespected[20] » NullPointer
  FastDatePrinterTimeZonesTest.testCalendarTimezoneRespected[210] » NullPointer
  FastDatePrinterTimeZonesTest.testCalendarTimezoneRespected[211] » NullPointer
  FastDatePrinterTimeZonesTest.testCalendarTimezoneRespected[212] » NullPointer
  FastDatePrinterTimeZonesTest.testCalendarTimezoneRespected[213] » NullPointer
  FastDatePrinterTimeZonesTest.testCalendarTimezoneRespected[214] » NullPointer
  FastDatePrinterTimeZonesTest.testCalendarTimezoneRespected[215] » NullPointer
  FastDatePrinterTimeZonesTest.testCalendarTimezoneRespected[216] » NullPointer
  FastDatePrinterTimeZonesTest.testCalendarTimezoneRespected[217] » NullPointer
  FastDatePrinterTimeZonesTest.testCalendarTimezoneRespected[218] » NullPointer
  FastDatePrinterTimeZonesTest.testCalendarTimezoneRespected[219] » NullPointer
  FastDatePrinterTimeZonesTest.testCalendarTimezoneRespected[21] » NullPointer
  FastDatePrinterTimeZonesTest.testCalendarTimezoneRespected[220] » NullPointer
  FastDatePrinterTimeZonesTest.testCalendarTimezoneRespected[221] » NullPointer
  FastDatePrinterTimeZonesTest.testCalendarTimezoneRespected[222] » NullPointer
  FastDatePrinterTimeZonesTest.testCalendarTimezoneRespected[223] » NullPointer
  FastDatePrinterTimeZonesTest.testCalendarTimezoneRespected[224] » NullPointer
  FastDatePrinterTimeZonesTest.testCalendarTimezoneRespected[225] » NullPointer
  FastDatePrinterTimeZonesTest.testCalendarTimezoneRespected[226] » NullPointer
  FastDatePrinterTimeZonesTest.testCalendarTimezoneRespected[227] » NullPointer
  FastDatePrinterTimeZonesTest.testCalendarTimezoneRespected[228] » NullPointer
  FastDatePrinterTimeZonesTest.testCalendarTimezoneRespected[229] » NullPointer
  FastDatePrinterTimeZonesTest.testCalendarTimezoneRespected[22] » NullPointer
  FastDatePrinterTimeZonesTest.testCalendarTimezoneRespected[230] » NullPointer
  FastDatePrinterTimeZonesTest.testCalendarTimezoneRespected[231] » NullPointer
  FastDatePrinterTimeZonesTest.testCalendarTimezoneRespected[232] » NullPointer
  FastDatePrinterTimeZonesTest.testCalendarTimezoneRespected[233] » NullPointer
  FastDatePrinterTimeZonesTest.testCalendarTimezoneRespected[234] » NullPointer
  FastDatePrinterTimeZonesTest.testCalendarTimezoneRespected[235] » NullPointer
  FastDatePrinterTimeZonesTest.testCalendarTimezoneRespected[236] » NullPointer
  FastDatePrinterTimeZonesTest.testCalendarTimezoneRespected[237] » NullPointer
  FastDatePrinterTimeZonesTest.testCalendarTimezoneRespected[238] » NullPointer
  FastDatePrinterTimeZonesTest.testCalendarTimezoneRespected[239] » NullPointer
  FastDatePrinterTimeZonesTest.testCalendarTimezoneRespected[23] » NullPointer
  FastDatePrinterTimeZonesTest.testCalendarTimezoneRespected[240] » NullPointer
  FastDatePrinterTimeZonesTest.testCalendarTimezoneRespected[241] » NullPointer
  FastDatePrinterTimeZonesTest.testCalendarTimezoneRespected[242] » NullPointer
  FastDatePrinterTimeZonesTest.testCalendarTimezoneRespected[243] » NullPointer
  FastDatePrinterTimeZonesTest.testCalendarTimezoneRespected[244] » NullPointer
  FastDatePrinterTimeZonesTest.testCalendarTimezoneRespected[245] » NullPointer
  FastDatePrinterTimeZonesTest.testCalendarTimezoneRespected[246] » NullPointer
  FastDatePrinterTimeZonesTest.testCalendarTimezoneRespected[247] » NullPointer
  FastDatePrinterTimeZonesTest.testCalendarTimezoneRespected[248] » NullPointer
  FastDatePrinterTimeZonesTest.testCalendarTimezoneRespected[249] » NullPointer
  FastDatePrinterTimeZonesTest.testCalendarTimezoneRespected[24] » NullPointer
  FastDatePrinterTimeZonesTest.testCalendarTimezoneRespected[250] » NullPointer
  FastDatePrinterTimeZonesTest.testCalendarTimezoneRespected[251] » NullPointer
  FastDatePrinterTimeZonesTest.testCalendarTimezoneRespected[252] » NullPointer
  FastDatePrinterTimeZonesTest.testCalendarTimezoneRespected[253] » NullPointer
  FastDatePrinterTimeZonesTest.testCalendarTimezoneRespected[254] » NullPointer
  FastDatePrinterTimeZonesTest.testCalendarTimezoneRespected[255] » NullPointer
  FastDatePrinterTimeZonesTest.testCalendarTimezoneRespected[256] » NullPointer
  FastDatePrinterTimeZonesTest.testCalendarTimezoneRespected[257] » NullPointer
  FastDatePrinterTimeZonesTest.testCalendarTimezoneRespected[258] » NullPointer
  FastDatePrinterTimeZonesTest.testCalendarTimezoneRespected[259] » NullPointer
  FastDatePrinterTimeZonesTest.testCalendarTimezoneRespected[25] » NullPointer
  FastDatePrinterTimeZonesTest.testCalendarTimezoneRespected[260] » NullPointer
  FastDatePrinterTimeZonesTest.testCalendarTimezoneRespected[261] » NullPointer
  FastDatePrinterTimeZonesTest.testCalendarTimezoneRespected[262] » NullPointer
  FastDatePrinterTimeZonesTest.testCalendarTimezoneRespected[263] » NullPointer
  FastDatePrinterTimeZonesTest.testCalendarTimezoneRespected[264] » NullPointer
  FastDatePrinterTimeZonesTest.testCalendarTimezoneRespected[265] » NullPointer
  FastDatePrinterTimeZonesTest.testCalendarTimezoneRespected[266] » NullPointer
  FastDatePrinterTimeZonesTest.testCalendarTimezoneRespected[267] » NullPointer
  FastDatePrinterTimeZonesTest.testCalendarTimezoneRespected[268] » NullPointer
  FastDatePrinterTimeZonesTest.testCalendarTimezoneRespected[269] » NullPointer
  FastDatePrinterTimeZonesTest.testCalendarTimezoneRespected[26] » NullPointer
  FastDatePrinterTimeZonesTest.testCalendarTimezoneRespected[270] » NullPointer
  FastDatePrinterTimeZonesTest.testCalendarTimezoneRespected[271] » NullPointer
  FastDatePrinterTimeZonesTest.testCalendarTimezoneRespected[272] » NullPointer
  FastDatePrinterTimeZonesTest.testCalendarTimezoneRespected[273] » NullPointer
  FastDatePrinterTimeZonesTest.testCalendarTimezoneRespected[274] » NullPointer
  FastDatePrinterTimeZonesTest.testCalendarTimezoneRespected[275] » NullPointer
  FastDatePrinterTimeZonesTest.testCalendarTimezoneRespected[276] » NullPointer
  FastDatePrinterTimeZonesTest.testCalendarTimezoneRespected[277] » NullPointer
  FastDatePrinterTimeZonesTest.testCalendarTimezoneRespected[278] » NullPointer
  FastDatePrinterTimeZonesTest.testCalendarTimezoneRespected[279] » NullPointer
  FastDatePrinterTimeZonesTest.testCalendarTimezoneRespected[27] » NullPointer
  FastDatePrinterTimeZonesTest.testCalendarTimezoneRespected[280] » NullPointer
  FastDatePrinterTimeZonesTest.testCalendarTimezoneRespected[281] » NullPointer
  FastDatePrinterTimeZonesTest.testCalendarTimezoneRespected[282] » NullPointer
  FastDatePrinterTimeZonesTest.testCalendarTimezoneRespected[283] » NullPointer
  FastDatePrinterTimeZonesTest.testCalendarTimezoneRespected[284] » NullPointer
  FastDatePrinterTimeZonesTest.testCalendarTimezoneRespected[285] » NullPointer
  FastDatePrinterTimeZonesTest.testCalendarTimezoneRespected[286] » NullPointer
  FastDatePrinterTimeZonesTest.testCalendarTimezoneRespected[287] » NullPointer
  FastDatePrinterTimeZonesTest.testCalendarTimezoneRespected[288] » NullPointer
  FastDatePrinterTimeZonesTest.testCalendarTimezoneRespected[289] » NullPointer
  FastDatePrinterTimeZonesTest.testCalendarTimezoneRespected[28] » NullPointer
  FastDatePrinterTimeZonesTest.testCalendarTimezoneRespected[290] » NullPointer
  FastDatePrinterTimeZonesTest.testCalendarTimezoneRespected[291] » NullPointer
  FastDatePrinterTimeZonesTest.testCalendarTimezoneRespected[292] » NullPointer
  FastDatePrinterTimeZonesTest.testCalendarTimezoneRespected[293] » NullPointer
  FastDatePrinterTimeZonesTest.testCalendarTimezoneRespected[294] » NullPointer
  FastDatePrinterTimeZonesTest.testCalendarTimezoneRespected[295] » NullPointer
  FastDatePrinterTimeZonesTest.testCalendarTimezoneRespected[296] » NullPointer
  FastDatePrinterTimeZonesTest.testCalendarTimezoneRespected[297] » NullPointer
  FastDatePrinterTimeZonesTest.testCalendarTimezoneRespected[298] » NullPointer
  FastDatePrinterTimeZonesTest.testCalendarTimezoneRespected[299] » NullPointer
  FastDatePrinterTimeZonesTest.testCalendarTimezoneRespected[29] » NullPointer
  FastDatePrinterTimeZonesTest.testCalendarTimezoneRespected[2] » NullPointer
  FastDatePrinterTimeZonesTest.testCalendarTimezoneRespected[300] » NullPointer
  FastDatePrinterTimeZonesTest.testCalendarTimezoneRespected[301] » NullPointer
  FastDatePrinterTimeZonesTest.testCalendarTimezoneRespected[302] » NullPointer
  FastDatePrinterTimeZonesTest.testCalendarTimezoneRespected[303] » NullPointer
  FastDatePrinterTimeZonesTest.testCalendarTimezoneRespected[304] » NullPointer
  FastDatePrinterTimeZonesTest.testCalendarTimezoneRespected[305] » NullPointer
  FastDatePrinterTimeZonesTest.testCalendarTimezoneRespected[306] » NullPointer
  FastDatePrinterTimeZonesTest.testCalendarTimezoneRespected[307] » NullPointer
  FastDatePrinterTimeZonesTest.testCalendarTimezoneRespected[308] » NullPointer
  FastDatePrinterTimeZonesTest.testCalendarTimezoneRespected[309] » NullPointer
  FastDatePrinterTimeZonesTest.testCalendarTimezoneRespected[30] » NullPointer
  FastDatePrinterTimeZonesTest.testCalendarTimezoneRespected[310] » NullPointer
  FastDatePrinterTimeZonesTest.testCalendarTimezoneRespected[311] » NullPointer
  FastDatePrinterTimeZonesTest.testCalendarTimezoneRespected[312] » NullPointer
  FastDatePrinterTimeZonesTest.testCalendarTimezoneRespected[313] » NullPointer
  FastDatePrinterTimeZonesTest.testCalendarTimezoneRespected[314] » NullPointer
  FastDatePrinterTimeZonesTest.testCalendarTimezoneRespected[315] » NullPointer
  FastDatePrinterTimeZonesTest.testCalendarTimezoneRespected[316] » NullPointer
  FastDatePrinterTimeZonesTest.testCalendarTimezoneRespected[317] » NullPointer
  FastDatePrinterTimeZonesTest.testCalendarTimezoneRespected[318] » NullPointer
  FastDatePrinterTimeZonesTest.testCalendarTimezoneRespected[319] » NullPointer
  FastDatePrinterTimeZonesTest.testCalendarTimezoneRespected[31] » NullPointer
  FastDatePrinterTimeZonesTest.testCalendarTimezoneRespected[320] » NullPointer
  FastDatePrinterTimeZonesTest.testCalendarTimezoneRespected[321] » NullPointer
  FastDatePrinterTimeZonesTest.testCalendarTimezoneRespected[322] » NullPointer
  FastDatePrinterTimeZonesTest.testCalendarTimezoneRespected[323] » NullPointer
  FastDatePrinterTimeZonesTest.testCalendarTimezoneRespected[324] » NullPointer
  FastDatePrinterTimeZonesTest.testCalendarTimezoneRespected[325] » NullPointer
  FastDatePrinterTimeZonesTest.testCalendarTimezoneRespected[326] » NullPointer
  FastDatePrinterTimeZonesTest.testCalendarTimezoneRespected[327] » NullPointer
  FastDatePrinterTimeZonesTest.testCalendarTimezoneRespected[328] » NullPointer
  FastDatePrinterTimeZonesTest.testCalendarTimezoneRespected[329] » NullPointer
  FastDatePrinterTimeZonesTest.testCalendarTimezoneRespected[32] » NullPointer
  FastDatePrinterTimeZonesTest.testCalendarTimezoneRespected[330] » NullPointer
  FastDatePrinterTimeZonesTest.testCalendarTimezoneRespected[331] » NullPointer
  FastDatePrinterTimeZonesTest.testCalendarTimezoneRespected[332] » NullPointer
  FastDatePrinterTimeZonesTest.testCalendarTimezoneRespected[333] » NullPointer
  FastDatePrinterTimeZonesTest.testCalendarTimezoneRespected[334] » NullPointer
  FastDatePrinterTimeZonesTest.testCalendarTimezoneRespected[335] » NullPointer
  FastDatePrinterTimeZonesTest.testCalendarTimezoneRespected[336] » NullPointer
  FastDatePrinterTimeZonesTest.testCalendarTimezoneRespected[337] » NullPointer
  FastDatePrinterTimeZonesTest.testCalendarTimezoneRespected[338] » NullPointer
  FastDatePrinterTimeZonesTest.testCalendarTimezoneRespected[339] » NullPointer
  FastDatePrinterTimeZonesTest.testCalendarTimezoneRespected[33] » NullPointer
  FastDatePrinterTimeZonesTest.testCalendarTimezoneRespected[340] » NullPointer
  FastDatePrinterTimeZonesTest.testCalendarTimezoneRespected[341] » NullPointer
  FastDatePrinterTimeZonesTest.testCalendarTimezoneRespected[342] » NullPointer
  FastDatePrinterTimeZonesTest.testCalendarTimezoneRespected[343] » NullPointer
  FastDatePrinterTimeZonesTest.testCalendarTimezoneRespected[344] » NullPointer
  FastDatePrinterTimeZonesTest.testCalendarTimezoneRespected[345] » NullPointer
  FastDatePrinterTimeZonesTest.testCalendarTimezoneRespected[346] » NullPointer
  FastDatePrinterTimeZonesTest.testCalendarTimezoneRespected[347] » NullPointer
  FastDatePrinterTimeZonesTest.testCalendarTimezoneRespected[348] » NullPointer
  FastDatePrinterTimeZonesTest.testCalendarTimezoneRespected[349] » NullPointer
  FastDatePrinterTimeZonesTest.testCalendarTimezoneRespected[34] » NullPointer
  FastDatePrinterTimeZonesTest.testCalendarTimezoneRespected[350] » NullPointer
  FastDatePrinterTimeZonesTest.testCalendarTimezoneRespected[351] » NullPointer
  FastDatePrinterTimeZonesTest.testCalendarTimezoneRespected[352] » NullPointer
  FastDatePrinterTimeZonesTest.testCalendarTimezoneRespected[353] » NullPointer
  FastDatePrinterTimeZonesTest.testCalendarTimezoneRespected[354] » NullPointer
  FastDatePrinterTimeZonesTest.testCalendarTimezoneRespected[355] » NullPointer
  FastDatePrinterTimeZonesTest.testCalendarTimezoneRespected[356] » NullPointer
  FastDatePrinterTimeZonesTest.testCalendarTimezoneRespected[357] » NullPointer
  FastDatePrinterTimeZonesTest.testCalendarTimezoneRespected[358] » NullPointer
  FastDatePrinterTimeZonesTest.testCalendarTimezoneRespected[359] » NullPointer
  FastDatePrinterTimeZonesTest.testCalendarTimezoneRespected[35] » NullPointer
  FastDatePrinterTimeZonesTest.testCalendarTimezoneRespected[360] » NullPointer
  FastDatePrinterTimeZonesTest.testCalendarTimezoneRespected[361] » NullPointer
  FastDatePrinterTimeZonesTest.testCalendarTimezoneRespected[362] » NullPointer
  FastDatePrinterTimeZonesTest.testCalendarTimezoneRespected[363] » NullPointer
  FastDatePrinterTimeZonesTest.testCalendarTimezoneRespected[364] » NullPointer
  FastDatePrinterTimeZonesTest.testCalendarTimezoneRespected[365] » NullPointer
  FastDatePrinterTimeZonesTest.testCalendarTimezoneRespected[366] » NullPointer
  FastDatePrinterTimeZonesTest.testCalendarTimezoneRespected[367] » NullPointer
  FastDatePrinterTimeZonesTest.testCalendarTimezoneRespected[368] » NullPointer
  FastDatePrinterTimeZonesTest.testCalendarTimezoneRespected[369] » NullPointer
  FastDatePrinterTimeZonesTest.testCalendarTimezoneRespected[36] » NullPointer
  FastDatePrinterTimeZonesTest.testCalendarTimezoneRespected[370] » NullPointer
  FastDatePrinterTimeZonesTest.testCalendarTimezoneRespected[371] » NullPointer
  FastDatePrinterTimeZonesTest.testCalendarTimezoneRespected[372] » NullPointer
  FastDatePrinterTimeZonesTest.testCalendarTimezoneRespected[373] » NullPointer
  FastDatePrinterTimeZonesTest.testCalendarTimezoneRespected[374] » NullPointer
  FastDatePrinterTimeZonesTest.testCalendarTimezoneRespected[375] » NullPointer
  FastDatePrinterTimeZonesTest.testCalendarTimezoneRespected[376] » NullPointer
  FastDatePrinterTimeZonesTest.testCalendarTimezoneRespected[377] » NullPointer
  FastDatePrinterTimeZonesTest.testCalendarTimezoneRespected[378] » NullPointer
  FastDatePrinterTimeZonesTest.testCalendarTimezoneRespected[379] » NullPointer
  FastDatePrinterTimeZonesTest.testCalendarTimezoneRespected[37] » NullPointer
  FastDatePrinterTimeZonesTest.testCalendarTimezoneRespected[380] » NullPointer
  FastDatePrinterTimeZonesTest.testCalendarTimezoneRespected[381] » NullPointer
  FastDatePrinterTimeZonesTest.testCalendarTimezoneRespected[382] » NullPointer
  FastDatePrinterTimeZonesTest.testCalendarTimezoneRespected[383] » NullPointer
  FastDatePrinterTimeZonesTest.testCalendarTimezoneRespected[384] » NullPointer
  FastDatePrinterTimeZonesTest.testCalendarTimezoneRespected[385] » NullPointer
  FastDatePrinterTimeZonesTest.testCalendarTimezoneRespected[386] » NullPointer
  FastDatePrinterTimeZonesTest.testCalendarTimezoneRespected[387] » NullPointer
  FastDatePrinterTimeZonesTest.testCalendarTimezoneRespected[388] » NullPointer
  FastDatePrinterTimeZonesTest.testCalendarTimezoneRespected[389] » NullPointer
  FastDatePrinterTimeZonesTest.testCalendarTimezoneRespected[38] » NullPointer
  FastDatePrinterTimeZonesTest.testCalendarTimezoneRespected[390] » NullPointer
  FastDatePrinterTimeZonesTest.testCalendarTimezoneRespected[391] » NullPointer
  FastDatePrinterTimeZonesTest.testCalendarTimezoneRespected[392] » NullPointer
  FastDatePrinterTimeZonesTest.testCalendarTimezoneRespected[393] » NullPointer
  FastDatePrinterTimeZonesTest.testCalendarTimezoneRespected[394] » NullPointer
  FastDatePrinterTimeZonesTest.testCalendarTimezoneRespected[395] » NullPointer
  FastDatePrinterTimeZonesTest.testCalendarTimezoneRespected[396] » NullPointer
  FastDatePrinterTimeZonesTest.testCalendarTimezoneRespected[397] » NullPointer
  FastDatePrinterTimeZonesTest.testCalendarTimezoneRespected[398] » NullPointer
  FastDatePrinterTimeZonesTest.testCalendarTimezoneRespected[399] » NullPointer
  FastDatePrinterTimeZonesTest.testCalendarTimezoneRespected[39] » NullPointer
  FastDatePrinterTimeZonesTest.testCalendarTimezoneRespected[3] » NullPointer
  FastDatePrinterTimeZonesTest.testCalendarTimezoneRespected[400] » NullPointer
  FastDatePrinterTimeZonesTest.testCalendarTimezoneRespected[401] » NullPointer
  FastDatePrinterTimeZonesTest.testCalendarTimezoneRespected[402] » NullPointer
  FastDatePrinterTimeZonesTest.testCalendarTimezoneRespected[403] » NullPointer
  FastDatePrinterTimeZonesTest.testCalendarTimezoneRespected[404] » NullPointer
  FastDatePrinterTimeZonesTest.testCalendarTimezoneRespected[405] » NullPointer
  FastDatePrinterTimeZonesTest.testCalendarTimezoneRespected[406] » NullPointer
  FastDatePrinterTimeZonesTest.testCalendarTimezoneRespected[407] » NullPointer
  FastDatePrinterTimeZonesTest.testCalendarTimezoneRespected[408] » NullPointer
  FastDatePrinterTimeZonesTest.testCalendarTimezoneRespected[409] » NullPointer
  FastDatePrinterTimeZonesTest.testCalendarTimezoneRespected[40] » NullPointer
  FastDatePrinterTimeZonesTest.testCalendarTimezoneRespected[410] » NullPointer
  FastDatePrinterTimeZonesTest.testCalendarTimezoneRespected[411] » NullPointer
  FastDatePrinterTimeZonesTest.testCalendarTimezoneRespected[412] » NullPointer
  FastDatePrinterTimeZonesTest.testCalendarTimezoneRespected[413] » NullPointer
  FastDatePrinterTimeZonesTest.testCalendarTimezoneRespected[414] » NullPointer
  FastDatePrinterTimeZonesTest.testCalendarTimezoneRespected[415] » NullPointer
  FastDatePrinterTimeZonesTest.testCalendarTimezoneRespected[416] » NullPointer
  FastDatePrinterTimeZonesTest.testCalendarTimezoneRespected[417] » NullPointer
  FastDatePrinterTimeZonesTest.testCalendarTimezoneRespected[418] » NullPointer
  FastDatePrinterTimeZonesTest.testCalendarTimezoneRespected[419] » NullPointer
  FastDatePrinterTimeZonesTest.testCalendarTimezoneRespected[41] » NullPointer
  FastDatePrinterTimeZonesTest.testCalendarTimezoneRespected[420] » NullPointer
  FastDatePrinterTimeZonesTest.testCalendarTimezoneRespected[421] » NullPointer
  FastDatePrinterTimeZonesTest.testCalendarTimezoneRespected[422] » NullPointer
  FastDatePrinterTimeZonesTest.testCalendarTimezoneRespected[423] » NullPointer
  FastDatePrinterTimeZonesTest.testCalendarTimezoneRespected[424] » NullPointer
  FastDatePrinterTimeZonesTest.testCalendarTimezoneRespected[425] » NullPointer
  FastDatePrinterTimeZonesTest.testCalendarTimezoneRespected[426] » NullPointer
  FastDatePrinterTimeZonesTest.testCalendarTimezoneRespected[427] » NullPointer
  FastDatePrinterTimeZonesTest.testCalendarTimezoneRespected[428] » NullPointer
  FastDatePrinterTimeZonesTest.testCalendarTimezoneRespected[429] » NullPointer
  FastDatePrinterTimeZonesTest.testCalendarTimezoneRespected[42] » NullPointer
  FastDatePrinterTimeZonesTest.testCalendarTimezoneRespected[430] » NullPointer
  FastDatePrinterTimeZonesTest.testCalendarTimezoneRespected[431] » NullPointer
  FastDatePrinterTimeZonesTest.testCalendarTimezoneRespected[432] » NullPointer
  FastDatePrinterTimeZonesTest.testCalendarTimezoneRespected[433] » NullPointer
  FastDatePrinterTimeZonesTest.testCalendarTimezoneRespected[434] » NullPointer
  FastDatePrinterTimeZonesTest.testCalendarTimezoneRespected[435] » NullPointer
  FastDatePrinterTimeZonesTest.testCalendarTimezoneRespected[436] » NullPointer
  FastDatePrinterTimeZonesTest.testCalendarTimezoneRespected[437] » NullPointer
  FastDatePrinterTimeZonesTest.testCalendarTimezoneRespected[438] » NullPointer
  FastDatePrinterTimeZonesTest.testCalendarTimezoneRespected[439] » NullPointer
  FastDatePrinterTimeZonesTest.testCalendarTimezoneRespected[43] » NullPointer
  FastDatePrinterTimeZonesTest.testCalendarTimezoneRespected[440] » NullPointer
  FastDatePrinterTimeZonesTest.testCalendarTimezoneRespected[441] » NullPointer
  FastDatePrinterTimeZonesTest.testCalendarTimezoneRespected[442] » NullPointer
  FastDatePrinterTimeZonesTest.testCalendarTimezoneRespected[443] » NullPointer
  FastDatePrinterTimeZonesTest.testCalendarTimezoneRespected[444] » NullPointer
  FastDatePrinterTimeZonesTest.testCalendarTimezoneRespected[445] » NullPointer
  FastDatePrinterTimeZonesTest.testCalendarTimezoneRespected[446] » NullPointer
  FastDatePrinterTimeZonesTest.testCalendarTimezoneRespected[447] » NullPointer
  FastDatePrinterTimeZonesTest.testCalendarTimezoneRespected[448] » NullPointer
  FastDatePrinterTimeZonesTest.testCalendarTimezoneRespected[449] » NullPointer
  FastDatePrinterTimeZonesTest.testCalendarTimezoneRespected[44] » NullPointer
  FastDatePrinterTimeZonesTest.testCalendarTimezoneRespected[450] » NullPointer
  FastDatePrinterTimeZonesTest.testCalendarTimezoneRespected[451] » NullPointer
  FastDatePrinterTimeZonesTest.testCalendarTimezoneRespected[452] » NullPointer
  FastDatePrinterTimeZonesTest.testCalendarTimezoneRespected[453] » NullPointer
  FastDatePrinterTimeZonesTest.testCalendarTimezoneRespected[454] » NullPointer
  FastDatePrinterTimeZonesTest.testCalendarTimezoneRespected[455] » NullPointer
  FastDatePrinterTimeZonesTest.testCalendarTimezoneRespected[456] » NullPointer
  FastDatePrinterTimeZonesTest.testCalendarTimezoneRespected[457] » NullPointer
  FastDatePrinterTimeZonesTest.testCalendarTimezoneRespected[458] » NullPointer
  FastDatePrinterTimeZonesTest.testCalendarTimezoneRespected[459] » NullPointer
  FastDatePrinterTimeZonesTest.testCalendarTimezoneRespected[45] » NullPointer
  FastDatePrinterTimeZonesTest.testCalendarTimezoneRespected[460] » NullPointer
  FastDatePrinterTimeZonesTest.testCalendarTimezoneRespected[461] » NullPointer
  FastDatePrinterTimeZonesTest.testCalendarTimezoneRespected[462] » NullPointer
  FastDatePrinterTimeZonesTest.testCalendarTimezoneRespected[463] » NullPointer
  FastDatePrinterTimeZonesTest.testCalendarTimezoneRespected[464] » NullPointer
  FastDatePrinterTimeZonesTest.testCalendarTimezoneRespected[465] » NullPointer
  FastDatePrinterTimeZonesTest.testCalendarTimezoneRespected[466] » NullPointer
  FastDatePrinterTimeZonesTest.testCalendarTimezoneRespected[467] » NullPointer
  FastDatePrinterTimeZonesTest.testCalendarTimezoneRespected[468] » NullPointer
  FastDatePrinterTimeZonesTest.testCalendarTimezoneRespected[469] » NullPointer
  FastDatePrinterTimeZonesTest.testCalendarTimezoneRespected[46] » NullPointer
  FastDatePrinterTimeZonesTest.testCalendarTimezoneRespected[470] » NullPointer
  FastDatePrinterTimeZonesTest.testCalendarTimezoneRespected[471] » NullPointer
  FastDatePrinterTimeZonesTest.testCalendarTimezoneRespected[472] » NullPointer
  FastDatePrinterTimeZonesTest.testCalendarTimezoneRespected[473] » NullPointer
  FastDatePrinterTimeZonesTest.testCalendarTimezoneRespected[474] » NullPointer
  FastDatePrinterTimeZonesTest.testCalendarTimezoneRespected[475] » NullPointer
  FastDatePrinterTimeZonesTest.testCalendarTimezoneRespected[476] » NullPointer
  FastDatePrinterTimeZonesTest.testCalendarTimezoneRespected[477] » NullPointer
  FastDatePrinterTimeZonesTest.testCalendarTimezoneRespected[478] » NullPointer
  FastDatePrinterTimeZonesTest.testCalendarTimezoneRespected[479] » NullPointer
  FastDatePrinterTimeZonesTest.testCalendarTimezoneRespected[47] » NullPointer
  FastDatePrinterTimeZonesTest.testCalendarTimezoneRespected[480] » NullPointer
  FastDatePrinterTimeZonesTest.testCalendarTimezoneRespected[481] » NullPointer
  FastDatePrinterTimeZonesTest.testCalendarTimezoneRespected[482] » NullPointer
  FastDatePrinterTimeZonesTest.testCalendarTimezoneRespected[483] » NullPointer
  FastDatePrinterTimeZonesTest.testCalendarTimezoneRespected[484] » NullPointer
  FastDatePrinterTimeZonesTest.testCalendarTimezoneRespected[485] » NullPointer
  FastDatePrinterTimeZonesTest.testCalendarTimezoneRespected[486] » NullPointer
  FastDatePrinterTimeZonesTest.testCalendarTimezoneRespected[487] » NullPointer
  FastDatePrinterTimeZonesTest.testCalendarTimezoneRespected[488] » NullPointer
  FastDatePrinterTimeZonesTest.testCalendarTimezoneRespected[489] » NullPointer
  FastDatePrinterTimeZonesTest.testCalendarTimezoneRespected[48] » NullPointer
  FastDatePrinterTimeZonesTest.testCalendarTimezoneRespected[490] » NullPointer
  FastDatePrinterTimeZonesTest.testCalendarTimezoneRespected[491] » NullPointer
  FastDatePrinterTimeZonesTest.testCalendarTimezoneRespected[492] » NullPointer
  FastDatePrinterTimeZonesTest.testCalendarTimezoneRespected[493] » NullPointer
  FastDatePrinterTimeZonesTest.testCalendarTimezoneRespected[494] » NullPointer
  FastDatePrinterTimeZonesTest.testCalendarTimezoneRespected[495] » NullPointer
  FastDatePrinterTimeZonesTest.testCalendarTimezoneRespected[496] » NullPointer
  FastDatePrinterTimeZonesTest.testCalendarTimezoneRespected[497] » NullPointer
  FastDatePrinterTimeZonesTest.testCalendarTimezoneRespected[498] » NullPointer
  FastDatePrinterTimeZonesTest.testCalendarTimezoneRespected[499] » NullPointer
  FastDatePrinterTimeZonesTest.testCalendarTimezoneRespected[49] » NullPointer
  FastDatePrinterTimeZonesTest.testCalendarTimezoneRespected[4] » NullPointer
  FastDatePrinterTimeZonesTest.testCalendarTimezoneRespected[500] » NullPointer
  FastDatePrinterTimeZonesTest.testCalendarTimezoneRespected[501] » NullPointer
  FastDatePrinterTimeZonesTest.testCalendarTimezoneRespected[502] » NullPointer
  FastDatePrinterTimeZonesTest.testCalendarTimezoneRespected[503] » NullPointer
  FastDatePrinterTimeZonesTest.testCalendarTimezoneRespected[504] » NullPointer
  FastDatePrinterTimeZonesTest.testCalendarTimezoneRespected[505] » NullPointer
  FastDatePrinterTimeZonesTest.testCalendarTimezoneRespected[506] » NullPointer
  FastDatePrinterTimeZonesTest.testCalendarTimezoneRespected[507] » NullPointer
  FastDatePrinterTimeZonesTest.testCalendarTimezoneRespected[508] » NullPointer
  FastDatePrinterTimeZonesTest.testCalendarTimezoneRespected[509] » NullPointer
  FastDatePrinterTimeZonesTest.testCalendarTimezoneRespected[50] » NullPointer
  FastDatePrinterTimeZonesTest.testCalendarTimezoneRespected[510] » NullPointer
  FastDatePrinterTimeZonesTest.testCalendarTimezoneRespected[511] » NullPointer
  FastDatePrinterTimeZonesTest.testCalendarTimezoneRespected[512] » NullPointer
  FastDatePrinterTimeZonesTest.testCalendarTimezoneRespected[513] » NullPointer
  FastDatePrinterTimeZonesTest.testCalendarTimezoneRespected[514] » NullPointer
  FastDatePrinterTimeZonesTest.testCalendarTimezoneRespected[515] » NullPointer
  FastDatePrinterTimeZonesTest.testCalendarTimezoneRespected[516] » NullPointer
  FastDatePrinterTimeZonesTest.testCalendarTimezoneRespected[517] » NullPointer
  FastDatePrinterTimeZonesTest.testCalendarTimezoneRespected[518] » NullPointer
  FastDatePrinterTimeZonesTest.testCalendarTimezoneRespected[519] » NullPointer
  FastDatePrinterTimeZonesTest.testCalendarTimezoneRespected[51] » NullPointer
  FastDatePrinterTimeZonesTest.testCalendarTimezoneRespected[520] » NullPointer
  FastDatePrinterTimeZonesTest.testCalendarTimezoneRespected[521] » NullPointer
  FastDatePrinterTimeZonesTest.testCalendarTimezoneRespected[522] » NullPointer
  FastDatePrinterTimeZonesTest.testCalendarTimezoneRespected[523] » NullPointer
  FastDatePrinterTimeZonesTest.testCalendarTimezoneRespected[524] » NullPointer
  FastDatePrinterTimeZonesTest.testCalendarTimezoneRespected[525] » NullPointer
  FastDatePrinterTimeZonesTest.testCalendarTimezoneRespected[526] » NullPointer
  FastDatePrinterTimeZonesTest.testCalendarTimezoneRespected[527] » NullPointer
  FastDatePrinterTimeZonesTest.testCalendarTimezoneRespected[528] » NullPointer
  FastDatePrinterTimeZonesTest.testCalendarTimezoneRespected[529] » NullPointer
  FastDatePrinterTimeZonesTest.testCalendarTimezoneRespected[52] » NullPointer
  FastDatePrinterTimeZonesTest.testCalendarTimezoneRespected[530] » NullPointer
  FastDatePrinterTimeZonesTest.testCalendarTimezoneRespected[531] » NullPointer
  FastDatePrinterTimeZonesTest.testCalendarTimezoneRespected[532] » NullPointer
  FastDatePrinterTimeZonesTest.testCalendarTimezoneRespected[533] » NullPointer
  FastDatePrinterTimeZonesTest.testCalendarTimezoneRespected[534] » NullPointer
  FastDatePrinterTimeZonesTest.testCalendarTimezoneRespected[535] » NullPointer
  FastDatePrinterTimeZonesTest.testCalendarTimezoneRespected[536] » NullPointer
  FastDatePrinterTimeZonesTest.testCalendarTimezoneRespected[537] » NullPointer
  FastDatePrinterTimeZonesTest.testCalendarTimezoneRespected[538] » NullPointer
  FastDatePrinterTimeZonesTest.testCalendarTimezoneRespected[539] » NullPointer
  FastDatePrinterTimeZonesTest.testCalendarTimezoneRespected[53] » NullPointer
  FastDatePrinterTimeZonesTest.testCalendarTimezoneRespected[540] » NullPointer
  FastDatePrinterTimeZonesTest.testCalendarTimezoneRespected[541] » NullPointer
  FastDatePrinterTimeZonesTest.testCalendarTimezoneRespected[542] » NullPointer
  FastDatePrinterTimeZonesTest.testCalendarTimezoneRespected[543] » NullPointer
  FastDatePrinterTimeZonesTest.testCalendarTimezoneRespected[544] » NullPointer
  FastDatePrinterTimeZonesTest.testCalendarTimezoneRespected[545] » NullPointer
  FastDatePrinterTimeZonesTest.testCalendarTimezoneRespected[546] » NullPointer
  FastDatePrinterTimeZonesTest.testCalendarTimezoneRespected[547] » NullPointer
  FastDatePrinterTimeZonesTest.testCalendarTimezoneRespected[548] » NullPointer
  FastDatePrinterTimeZonesTest.testCalendarTimezoneRespected[549] » NullPointer
  FastDatePrinterTimeZonesTest.testCalendarTimezoneRespected[54] » NullPointer
  FastDatePrinterTimeZonesTest.testCalendarTimezoneRespected[550] » NullPointer
  FastDatePrinterTimeZonesTest.testCalendarTimezoneRespected[551] » NullPointer
  FastDatePrinterTimeZonesTest.testCalendarTimezoneRespected[552] » NullPointer
  FastDatePrinterTimeZonesTest.testCalendarTimezoneRespected[553] » NullPointer
  FastDatePrinterTimeZonesTest.testCalendarTimezoneRespected[554] » NullPointer
  FastDatePrinterTimeZonesTest.testCalendarTimezoneRespected[555] » NullPointer
  FastDatePrinterTimeZonesTest.testCalendarTimezoneRespected[556] » NullPointer
  FastDatePrinterTimeZonesTest.testCalendarTimezoneRespected[557] » NullPointer
  FastDatePrinterTimeZonesTest.testCalendarTimezoneRespected[558] » NullPointer
  FastDatePrinterTimeZonesTest.testCalendarTimezoneRespected[559] » NullPointer
  FastDatePrinterTimeZonesTest.testCalendarTimezoneRespected[55] » NullPointer
  FastDatePrinterTimeZonesTest.testCalendarTimezoneRespected[560] » NullPointer
  FastDatePrinterTimeZonesTest.testCalendarTimezoneRespected[561] » NullPointer
  FastDatePrinterTimeZonesTest.testCalendarTimezoneRespected[562] » NullPointer
  FastDatePrinterTimeZonesTest.testCalendarTimezoneRespected[563] » NullPointer
  FastDatePrinterTimeZonesTest.testCalendarTimezoneRespected[564] » NullPointer
  FastDatePrinterTimeZonesTest.testCalendarTimezoneRespected[565] » NullPointer
  FastDatePrinterTimeZonesTest.testCalendarTimezoneRespected[566] » NullPointer
  FastDatePrinterTimeZonesTest.testCalendarTimezoneRespected[567] » NullPointer
  FastDatePrinterTimeZonesTest.testCalendarTimezoneRespected[568] » NullPointer
  FastDatePrinterTimeZonesTest.testCalendarTimezoneRespected[569] » NullPointer
  FastDatePrinterTimeZonesTest.testCalendarTimezoneRespected[56] » NullPointer
  FastDatePrinterTimeZonesTest.testCalendarTimezoneRespected[570] » NullPointer
  FastDatePrinterTimeZonesTest.testCalendarTimezoneRespected[571] » NullPointer
  FastDatePrinterTimeZonesTest.testCalendarTimezoneRespected[572] » NullPointer
  FastDatePrinterTimeZonesTest.testCalendarTimezoneRespected[573] » NullPointer
  FastDatePrinterTimeZonesTest.testCalendarTimezoneRespected[574] » NullPointer
  FastDatePrinterTimeZonesTest.testCalendarTimezoneRespected[575] » NullPointer
  FastDatePrinterTimeZonesTest.testCalendarTimezoneRespected[576] » NullPointer
  FastDatePrinterTimeZonesTest.testCalendarTimezoneRespected[577] » NullPointer
  FastDatePrinterTimeZonesTest.testCalendarTimezoneRespected[578] » NullPointer
  FastDatePrinterTimeZonesTest.testCalendarTimezoneRespected[579] » NullPointer
  FastDatePrinterTimeZonesTest.testCalendarTimezoneRespected[57] » NullPointer
  FastDatePrinterTimeZonesTest.testCalendarTimezoneRespected[580] » NullPointer
  FastDatePrinterTimeZonesTest.testCalendarTimezoneRespected[581] » NullPointer
  FastDatePrinterTimeZonesTest.testCalendarTimezoneRespected[582] » NullPointer
  FastDatePrinterTimeZonesTest.testCalendarTimezoneRespected[583] » NullPointer
  FastDatePrinterTimeZonesTest.testCalendarTimezoneRespected[584] » NullPointer
  FastDatePrinterTimeZonesTest.testCalendarTimezoneRespected[585] » NullPointer
  FastDatePrinterTimeZonesTest.testCalendarTimezoneRespected[586] » NullPointer
  FastDatePrinterTimeZonesTest.testCalendarTimezoneRespected[587] » NullPointer
  FastDatePrinterTimeZonesTest.testCalendarTimezoneRespected[588] » NullPointer
  FastDatePrinterTimeZonesTest.testCalendarTimezoneRespected[589] » NullPointer
  FastDatePrinterTimeZonesTest.testCalendarTimezoneRespected[58] » NullPointer
  FastDatePrinterTimeZonesTest.testCalendarTimezoneRespected[590] » NullPointer
  FastDatePrinterTimeZonesTest.testCalendarTimezoneRespected[591] » NullPointer
  FastDatePrinterTimeZonesTest.testCalendarTimezoneRespected[592] » NullPointer
  FastDatePrinterTimeZonesTest.testCalendarTimezoneRespected[593] » NullPointer
  FastDatePrinterTimeZonesTest.testCalendarTimezoneRespected[594] » NullPointer
  FastDatePrinterTimeZonesTest.testCalendarTimezoneRespected[595] » NullPointer
  FastDatePrinterTimeZonesTest.testCalendarTimezoneRespected[596] » NullPointer
  FastDatePrinterTimeZonesTest.testCalendarTimezoneRespected[597] » NullPointer
  FastDatePrinterTimeZonesTest.testCalendarTimezoneRespected[598] » NullPointer
  FastDatePrinterTimeZonesTest.testCalendarTimezoneRespected[599] » NullPointer
  FastDatePrinterTimeZonesTest.testCalendarTimezoneRespected[59] » NullPointer
  FastDatePrinterTimeZonesTest.testCalendarTimezoneRespected[5] » NullPointer
  FastDatePrinterTimeZonesTest.testCalendarTimezoneRespected[600] » NullPointer
  FastDatePrinterTimeZonesTest.testCalendarTimezoneRespected[601] » NullPointer
  FastDatePrinterTimeZonesTest.testCalendarTimezoneRespected[602] » NullPointer
  FastDatePrinterTimeZonesTest.testCalendarTimezoneRespected[603] » NullPointer
  FastDatePrinterTimeZonesTest.testCalendarTimezoneRespected[604] » NullPointer
  FastDatePrinterTimeZonesTest.testCalendarTimezoneRespected[605] » NullPointer
  FastDatePrinterTimeZonesTest.testCalendarTimezoneRespected[606] » NullPointer
  FastDatePrinterTimeZonesTest.testCalendarTimezoneRespected[607] » NullPointer
  FastDatePrinterTimeZonesTest.testCalendarTimezoneRespected[608] » NullPointer
  FastDatePrinterTimeZonesTest.testCalendarTimezoneRespected[609] » NullPointer
  FastDatePrinterTimeZonesTest.testCalendarTimezoneRespected[60] » NullPointer
  FastDatePrinterTimeZonesTest.testCalendarTimezoneRespected[610] » NullPointer
  FastDatePrinterTimeZonesTest.testCalendarTimezoneRespected[611] » NullPointer
  FastDatePrinterTimeZonesTest.testCalendarTimezoneRespected[612] » NullPointer
  FastDatePrinterTimeZonesTest.testCalendarTimezoneRespected[613] » NullPointer
  FastDatePrinterTimeZonesTest.testCalendarTimezoneRespected[614] » NullPointer
  FastDatePrinterTimeZonesTest.testCalendarTimezoneRespected[615] » NullPointer
  FastDatePrinterTimeZonesTest.testCalendarTimezoneRespected[616] » NullPointer
  FastDatePrinterTimeZonesTest.testCalendarTimezoneRespected[61] » NullPointer
  FastDatePrinterTimeZonesTest.testCalendarTimezoneRespected[62] » NullPointer
  FastDatePrinterTimeZonesTest.testCalendarTimezoneRespected[63] » NullPointer
  FastDatePrinterTimeZonesTest.testCalendarTimezoneRespected[64] » NullPointer
  FastDatePrinterTimeZonesTest.testCalendarTimezoneRespected[65] » NullPointer
  FastDatePrinterTimeZonesTest.testCalendarTimezoneRespected[66] » NullPointer
  FastDatePrinterTimeZonesTest.testCalendarTimezoneRespected[67] » NullPointer
  FastDatePrinterTimeZonesTest.testCalendarTimezoneRespected[68] » NullPointer
  FastDatePrinterTimeZonesTest.testCalendarTimezoneRespected[69] » NullPointer
  FastDatePrinterTimeZonesTest.testCalendarTimezoneRespected[6] » NullPointer
  FastDatePrinterTimeZonesTest.testCalendarTimezoneRespected[70] » NullPointer
  FastDatePrinterTimeZonesTest.testCalendarTimezoneRespected[71] » NullPointer
  FastDatePrinterTimeZonesTest.testCalendarTimezoneRespected[72] » NullPointer
  FastDatePrinterTimeZonesTest.testCalendarTimezoneRespected[73] » NullPointer
  FastDatePrinterTimeZonesTest.testCalendarTimezoneRespected[74] » NullPointer
  FastDatePrinterTimeZonesTest.testCalendarTimezoneRespected[75] » NullPointer
  FastDatePrinterTimeZonesTest.testCalendarTimezoneRespected[76] » NullPointer
  FastDatePrinterTimeZonesTest.testCalendarTimezoneRespected[77] » NullPointer
  FastDatePrinterTimeZonesTest.testCalendarTimezoneRespected[78] » NullPointer
  FastDatePrinterTimeZonesTest.testCalendarTimezoneRespected[79] » NullPointer
  FastDatePrinterTimeZonesTest.testCalendarTimezoneRespected[7] » NullPointer
  FastDatePrinterTimeZonesTest.testCalendarTimezoneRespected[80] » NullPointer
  FastDatePrinterTimeZonesTest.testCalendarTimezoneRespected[81] » NullPointer
  FastDatePrinterTimeZonesTest.testCalendarTimezoneRespected[82] » NullPointer
  FastDatePrinterTimeZonesTest.testCalendarTimezoneRespected[83] » NullPointer
  FastDatePrinterTimeZonesTest.testCalendarTimezoneRespected[84] » NullPointer
  FastDatePrinterTimeZonesTest.testCalendarTimezoneRespected[85] » NullPointer
  FastDatePrinterTimeZonesTest.testCalendarTimezoneRespected[86] » NullPointer
  FastDatePrinterTimeZonesTest.testCalendarTimezoneRespected[87] » NullPointer
  FastDatePrinterTimeZonesTest.testCalendarTimezoneRespected[88] » NullPointer
  FastDatePrinterTimeZonesTest.testCalendarTimezoneRespected[89] » NullPointer
  FastDatePrinterTimeZonesTest.testCalendarTimezoneRespected[8] » NullPointer
  FastDatePrinterTimeZonesTest.testCalendarTimezoneRespected[90] » NullPointer
  FastDatePrinterTimeZonesTest.testCalendarTimezoneRespected[91] » NullPointer
  FastDatePrinterTimeZonesTest.testCalendarTimezoneRespected[92] » NullPointer
  FastDatePrinterTimeZonesTest.testCalendarTimezoneRespected[93] » NullPointer
  FastDatePrinterTimeZonesTest.testCalendarTimezoneRespected[94] » NullPointer
  FastDatePrinterTimeZonesTest.testCalendarTimezoneRespected[95] » NullPointer
  FastDatePrinterTimeZonesTest.testCalendarTimezoneRespected[96] » NullPointer
  FastDatePrinterTimeZonesTest.testCalendarTimezoneRespected[97] » NullPointer
  FastDatePrinterTimeZonesTest.testCalendarTimezoneRespected[98] » NullPointer
  FastDatePrinterTimeZonesTest.testCalendarTimezoneRespected[99] » NullPointer
  FastDatePrinterTimeZonesTest.testCalendarTimezoneRespected[9] » NullPointer


Tests run: 3526, Failures: 15, Errors: 658, Skipped: 97

[INFO] ------------------------------------------------------------------------
[INFO] BUILD FAILURE
[INFO] ------------------------------------------------------------------------
[INFO] Total time: 41.168s
[INFO] Finished at: Wed Aug 05 11:28:34 BST 2015
[INFO] Final Memory: 24M/415M
[INFO] ------------------------------------------------------------------------
[ERROR] Failed to execute goal org.apache.maven.plugins:maven-surefire-plugin:2.18:test (default-test) on project commons-lang3: There are test failures.
[ERROR] 
[ERROR] Please refer to /home/perham/Study/LittleDarwin/Cases/commons-lang3-3.4-src/target/surefire-reports for the individual test results.
[ERROR] -> [Help 1]
[ERROR] 
[ERROR] To see the full stack trace of the errors, re-run Maven with the -e switch.
[ERROR] Re-run Maven using the -X switch to enable full debug logging.
[ERROR] 
[ERROR] For more information about the errors and possible solutions, please read the following articles:
[ERROR] [Help 1] http://cwiki.apache.org/confluence/display/MAVEN/MojoFailureException
