[INFO] Scanning for projects...
[INFO]                                                                         
[INFO] ------------------------------------------------------------------------
[INFO] Building Apache Commons Lang 3.4
[INFO] ------------------------------------------------------------------------
[INFO] 
[INFO] --- maven-enforcer-plugin:1.3.1:enforce (enforce-maven-3) @ commons-lang3 ---
[INFO] 
[INFO] --- build-helper-maven-plugin:1.8:parse-version (parse-version) @ commons-lang3 ---
[INFO] 
[INFO] --- maven-antrun-plugin:1.8:run (javadoc.resources) @ commons-lang3 ---
[INFO] Executing tasks

main:
[INFO] Executed tasks
[INFO] 
[INFO] --- maven-remote-resources-plugin:1.5:process (default) @ commons-lang3 ---
[INFO] 
[INFO] --- buildnumber-maven-plugin:1.3:create (default) @ commons-lang3 ---
[INFO] Executing: /bin/sh -c cd /home/perham/Study/LittleDarwin/Cases/commons-lang3-3.4-src && svn --non-interactive info
[INFO] Working directory: /home/perham/Study/LittleDarwin/Cases/commons-lang3-3.4-src
[INFO] Storing buildNumber: ?????? at timestamp: 1438767374106
[INFO] Executing: /bin/sh -c cd /home/perham/Study/LittleDarwin/Cases/commons-lang3-3.4-src && svn --non-interactive info
[INFO] Working directory: /home/perham/Study/LittleDarwin/Cases/commons-lang3-3.4-src
[INFO] Storing buildScmBranch: UNKNOWN_BRANCH
[INFO] 
[INFO] --- maven-resources-plugin:2.7:resources (default-resources) @ commons-lang3 ---
[INFO] Using 'ISO-8859-1' encoding to copy filtered resources.
[INFO] Copying 0 resource
[INFO] Copying 2 resources to META-INF
[INFO] 
[INFO] --- maven-compiler-plugin:3.2:compile (default-compile) @ commons-lang3 ---
[INFO] Changes detected - recompiling the module!
[INFO] Compiling 133 source files to /home/perham/Study/LittleDarwin/Cases/commons-lang3-3.4-src/target/classes
[INFO] /home/perham/Study/LittleDarwin/Cases/commons-lang3-3.4-src/src/main/java/org/apache/commons/lang3/SerializationUtils.java: /home/perham/Study/LittleDarwin/Cases/commons-lang3-3.4-src/src/main/java/org/apache/commons/lang3/SerializationUtils.java uses unchecked or unsafe operations.
[INFO] /home/perham/Study/LittleDarwin/Cases/commons-lang3-3.4-src/src/main/java/org/apache/commons/lang3/SerializationUtils.java: Recompile with -Xlint:unchecked for details.
[INFO] 
[INFO] --- maven-bundle-plugin:2.5.3:manifest (bundle-manifest) @ commons-lang3 ---
[INFO] 
[INFO] --- animal-sniffer-maven-plugin:1.13:check (checkAPIcompatibility) @ commons-lang3 ---
[INFO] Checking unresolved references to org.codehaus.mojo.signature:java16:1.0
[INFO] 
[INFO] --- maven-resources-plugin:2.7:testResources (default-testResources) @ commons-lang3 ---
[INFO] Using 'ISO-8859-1' encoding to copy filtered resources.
[INFO] Copying 2 resources
[INFO] Copying 2 resources to META-INF
[INFO] 
[INFO] --- maven-compiler-plugin:3.2:testCompile (default-testCompile) @ commons-lang3 ---
[INFO] Nothing to compile - all classes are up to date
[INFO] 
[INFO] --- maven-surefire-plugin:2.18:test (default-test) @ commons-lang3 ---
[INFO] Surefire report directory: /home/perham/Study/LittleDarwin/Cases/commons-lang3-3.4-src/target/surefire-reports

-------------------------------------------------------
 T E S T S
-------------------------------------------------------
Running org.apache.commons.lang3.ValidateTest
Tests run: 63, Failures: 0, Errors: 0, Skipped: 0, Time elapsed: 0.043 sec - in org.apache.commons.lang3.ValidateTest
Running org.apache.commons.lang3.LocaleUtilsTest
Tests run: 15, Failures: 0, Errors: 0, Skipped: 0, Time elapsed: 0.026 sec - in org.apache.commons.lang3.LocaleUtilsTest
Running org.apache.commons.lang3.tuple.MutableTripleTest
Tests run: 8, Failures: 0, Errors: 0, Skipped: 0, Time elapsed: 0.012 sec - in org.apache.commons.lang3.tuple.MutableTripleTest
Running org.apache.commons.lang3.tuple.TripleTest
Tests run: 10, Failures: 0, Errors: 0, Skipped: 0, Time elapsed: 0.001 sec - in org.apache.commons.lang3.tuple.TripleTest
Running org.apache.commons.lang3.tuple.ImmutablePairTest
Tests run: 6, Failures: 0, Errors: 0, Skipped: 0, Time elapsed: 0.001 sec - in org.apache.commons.lang3.tuple.ImmutablePairTest
Running org.apache.commons.lang3.tuple.MutablePairTest
Tests run: 8, Failures: 0, Errors: 0, Skipped: 0, Time elapsed: 0.001 sec - in org.apache.commons.lang3.tuple.MutablePairTest
Running org.apache.commons.lang3.tuple.ImmutableTripleTest
Tests run: 6, Failures: 0, Errors: 0, Skipped: 0, Time elapsed: 0 sec - in org.apache.commons.lang3.tuple.ImmutableTripleTest
Running org.apache.commons.lang3.tuple.PairTest
Tests run: 9, Failures: 0, Errors: 0, Skipped: 0, Time elapsed: 0.001 sec - in org.apache.commons.lang3.tuple.PairTest
Running org.apache.commons.lang3.StringUtilsIsTest
Tests run: 8, Failures: 0, Errors: 0, Skipped: 0, Time elapsed: 0.001 sec - in org.apache.commons.lang3.StringUtilsIsTest
Running org.apache.commons.lang3.JavaVersionTest
Tests run: 3, Failures: 0, Errors: 0, Skipped: 0, Time elapsed: 0.001 sec - in org.apache.commons.lang3.JavaVersionTest
Running org.apache.commons.lang3.builder.NoFieldNamesToStringStyleTest
Tests run: 8, Failures: 0, Errors: 0, Skipped: 0, Time elapsed: 0.005 sec - in org.apache.commons.lang3.builder.NoFieldNamesToStringStyleTest
Running org.apache.commons.lang3.builder.ShortPrefixToStringStyleTest
Tests run: 8, Failures: 0, Errors: 0, Skipped: 0, Time elapsed: 0.006 sec - in org.apache.commons.lang3.builder.ShortPrefixToStringStyleTest
Running org.apache.commons.lang3.builder.DiffResultTest
Tests run: 9, Failures: 0, Errors: 0, Skipped: 0, Time elapsed: 0.014 sec - in org.apache.commons.lang3.builder.DiffResultTest
Running org.apache.commons.lang3.builder.CompareToBuilderTest
Tests run: 48, Failures: 0, Errors: 0, Skipped: 0, Time elapsed: 0.045 sec - in org.apache.commons.lang3.builder.CompareToBuilderTest
Running org.apache.commons.lang3.builder.MultilineRecursiveToStringStyleTest
Tests run: 10, Failures: 0, Errors: 0, Skipped: 0, Time elapsed: 0.016 sec - in org.apache.commons.lang3.builder.MultilineRecursiveToStringStyleTest
Running org.apache.commons.lang3.builder.RecursiveToStringStyleTest
Tests run: 8, Failures: 0, Errors: 0, Skipped: 0, Time elapsed: 0.014 sec - in org.apache.commons.lang3.builder.RecursiveToStringStyleTest
Running org.apache.commons.lang3.builder.DefaultToStringStyleTest
Tests run: 8, Failures: 0, Errors: 0, Skipped: 0, Time elapsed: 0.008 sec - in org.apache.commons.lang3.builder.DefaultToStringStyleTest
Running org.apache.commons.lang3.builder.ReflectionToStringBuilderExcludeTest
Tests run: 11, Failures: 0, Errors: 0, Skipped: 0, Time elapsed: 0.009 sec - in org.apache.commons.lang3.builder.ReflectionToStringBuilderExcludeTest
Running org.apache.commons.lang3.builder.StandardToStringStyleTest
Tests run: 8, Failures: 0, Errors: 0, Skipped: 0, Time elapsed: 0.008 sec - in org.apache.commons.lang3.builder.StandardToStringStyleTest
Running org.apache.commons.lang3.builder.ToStringStyleTest
Tests run: 12, Failures: 0, Errors: 0, Skipped: 0, Time elapsed: 0.009 sec - in org.apache.commons.lang3.builder.ToStringStyleTest
Running org.apache.commons.lang3.builder.DiffTest
Tests run: 4, Failures: 0, Errors: 0, Skipped: 0, Time elapsed: 0.003 sec - in org.apache.commons.lang3.builder.DiffTest
Running org.apache.commons.lang3.builder.SimpleToStringStyleTest
Tests run: 8, Failures: 0, Errors: 0, Skipped: 0, Time elapsed: 0.007 sec - in org.apache.commons.lang3.builder.SimpleToStringStyleTest
Running org.apache.commons.lang3.builder.MultiLineToStringStyleTest
Tests run: 8, Failures: 0, Errors: 0, Skipped: 0, Time elapsed: 0.008 sec - in org.apache.commons.lang3.builder.MultiLineToStringStyleTest
Running org.apache.commons.lang3.builder.ToStringStyleConcurrencyTest
Tests run: 3, Failures: 0, Errors: 0, Skipped: 0, Time elapsed: 4.845 sec - in org.apache.commons.lang3.builder.ToStringStyleConcurrencyTest
Running org.apache.commons.lang3.builder.ReflectionToStringBuilderMutateInspectConcurrencyTest
Tests run: 1, Failures: 0, Errors: 0, Skipped: 1, Time elapsed: 0.001 sec - in org.apache.commons.lang3.builder.ReflectionToStringBuilderMutateInspectConcurrencyTest
Running org.apache.commons.lang3.builder.ToStringBuilderTest
Tests run: 74, Failures: 0, Errors: 0, Skipped: 1, Time elapsed: 0.055 sec - in org.apache.commons.lang3.builder.ToStringBuilderTest
Running org.apache.commons.lang3.builder.EqualsBuilderTest
Tests run: 48, Failures: 0, Errors: 0, Skipped: 0, Time elapsed: 0.02 sec - in org.apache.commons.lang3.builder.EqualsBuilderTest
Running org.apache.commons.lang3.builder.HashCodeBuilderAndEqualsBuilderTest
Tests run: 4, Failures: 0, Errors: 0, Skipped: 0, Time elapsed: 0.006 sec - in org.apache.commons.lang3.builder.HashCodeBuilderAndEqualsBuilderTest
Running org.apache.commons.lang3.builder.ReflectionToStringBuilderConcurrencyTest
Tests run: 3, Failures: 0, Errors: 0, Skipped: 3, Time elapsed: 0 sec - in org.apache.commons.lang3.builder.ReflectionToStringBuilderConcurrencyTest
Running org.apache.commons.lang3.builder.JsonToStringStyleTest
Tests run: 9, Failures: 0, Errors: 0, Skipped: 0, Time elapsed: 0.002 sec - in org.apache.commons.lang3.builder.JsonToStringStyleTest
Running org.apache.commons.lang3.builder.NoClassNameToStringStyleTest
Tests run: 8, Failures: 0, Errors: 0, Skipped: 0, Time elapsed: 0.003 sec - in org.apache.commons.lang3.builder.NoClassNameToStringStyleTest
Running org.apache.commons.lang3.builder.DiffBuilderTest
Tests run: 30, Failures: 0, Errors: 0, Skipped: 0, Time elapsed: 0.025 sec - in org.apache.commons.lang3.builder.DiffBuilderTest
Running org.apache.commons.lang3.builder.HashCodeBuilderTest
Tests run: 44, Failures: 0, Errors: 0, Skipped: 0, Time elapsed: 0.022 sec - in org.apache.commons.lang3.builder.HashCodeBuilderTest
Running org.apache.commons.lang3.concurrent.AtomicInitializerTest
Tests run: 3, Failures: 0, Errors: 0, Skipped: 0, Time elapsed: 0.003 sec - in org.apache.commons.lang3.concurrent.AtomicInitializerTest
Running org.apache.commons.lang3.concurrent.CallableBackgroundInitializerTest
Tests run: 4, Failures: 0, Errors: 0, Skipped: 0, Time elapsed: 0.002 sec - in org.apache.commons.lang3.concurrent.CallableBackgroundInitializerTest
Running org.apache.commons.lang3.concurrent.BackgroundInitializerTest
Tests run: 15, Failures: 0, Errors: 0, Skipped: 0, Time elapsed: 0.025 sec - in org.apache.commons.lang3.concurrent.BackgroundInitializerTest
Running org.apache.commons.lang3.concurrent.LazyInitializerTest
Tests run: 3, Failures: 0, Errors: 0, Skipped: 0, Time elapsed: 0.004 sec - in org.apache.commons.lang3.concurrent.LazyInitializerTest
Running org.apache.commons.lang3.concurrent.BasicThreadFactoryTest
Tests run: 15, Failures: 0, Errors: 0, Skipped: 0, Time elapsed: 0.031 sec - in org.apache.commons.lang3.concurrent.BasicThreadFactoryTest
Running org.apache.commons.lang3.concurrent.ConstantInitializerTest
Tests run: 7, Failures: 0, Errors: 0, Skipped: 0, Time elapsed: 0.001 sec - in org.apache.commons.lang3.concurrent.ConstantInitializerTest
Running org.apache.commons.lang3.concurrent.MultiBackgroundInitializerTest
Tests run: 17, Failures: 0, Errors: 0, Skipped: 0, Time elapsed: 0.071 sec - in org.apache.commons.lang3.concurrent.MultiBackgroundInitializerTest
Running org.apache.commons.lang3.concurrent.AtomicSafeInitializerTest
Tests run: 4, Failures: 0, Errors: 0, Skipped: 0, Time elapsed: 0.005 sec - in org.apache.commons.lang3.concurrent.AtomicSafeInitializerTest
Running org.apache.commons.lang3.concurrent.ConcurrentUtilsTest
Tests run: 40, Failures: 0, Errors: 0, Skipped: 0, Time elapsed: 0.014 sec - in org.apache.commons.lang3.concurrent.ConcurrentUtilsTest
Running org.apache.commons.lang3.concurrent.TimedSemaphoreTest
Tests run: 15, Failures: 0, Errors: 0, Skipped: 0, Time elapsed: 1.182 sec - in org.apache.commons.lang3.concurrent.TimedSemaphoreTest
Running org.apache.commons.lang3.StringUtilsSubstringTest
Tests run: 14, Failures: 0, Errors: 0, Skipped: 0, Time elapsed: 0.001 sec - in org.apache.commons.lang3.StringUtilsSubstringTest
Running org.apache.commons.lang3.SystemUtilsTest
Tests run: 12, Failures: 0, Errors: 0, Skipped: 0, Time elapsed: 0.001 sec - in org.apache.commons.lang3.SystemUtilsTest
Running org.apache.commons.lang3.CharRangeTest
Tests run: 16, Failures: 0, Errors: 0, Skipped: 0, Time elapsed: 0.041 sec - in org.apache.commons.lang3.CharRangeTest
Running org.apache.commons.lang3.CharSetTest
Tests run: 14, Failures: 0, Errors: 0, Skipped: 0, Time elapsed: 0.011 sec - in org.apache.commons.lang3.CharSetTest
Running org.apache.commons.lang3.StringUtilsStartsEndsWithTest
Tests run: 6, Failures: 0, Errors: 0, Skipped: 0, Time elapsed: 0.003 sec - in org.apache.commons.lang3.StringUtilsStartsEndsWithTest
Running org.apache.commons.lang3.RandomStringUtilsTest
Tests run: 11, Failures: 0, Errors: 0, Skipped: 0, Time elapsed: 0.038 sec - in org.apache.commons.lang3.RandomStringUtilsTest
Running org.apache.commons.lang3.SerializationUtilsTest
Tests run: 26, Failures: 0, Errors: 0, Skipped: 0, Time elapsed: 0.055 sec - in org.apache.commons.lang3.SerializationUtilsTest
Running org.apache.commons.lang3.time.StopWatchTest
Tests run: 8, Failures: 0, Errors: 0, Skipped: 0, Time elapsed: 4.76 sec - in org.apache.commons.lang3.time.StopWatchTest
Running org.apache.commons.lang3.time.DateUtilsRoundingTest
Tests run: 22, Failures: 0, Errors: 22, Skipped: 0, Time elapsed: 0.021 sec <<< FAILURE! - in org.apache.commons.lang3.time.DateUtilsRoundingTest
testRoundMilliSecond(org.apache.commons.lang3.time.DateUtilsRoundingTest)  Time elapsed: 0.007 sec  <<< ERROR!
java.lang.ExceptionInInitializerError: null
	at org.apache.commons.lang3.time.FastDatePrinter$PaddedNumberField.<init>(FastDatePrinter.java:213)
	at org.apache.commons.lang3.time.FastDatePrinter.selectNumberRule(FastDatePrinter.java:142)
	at org.apache.commons.lang3.time.FastDatePrinter.parsePattern(FastDatePrinter.java:67)
	at org.apache.commons.lang3.time.FastDatePrinter.init(FastDatePrinter.java:38)
	at org.apache.commons.lang3.time.FastDatePrinter.<init>(FastDatePrinter.java:37)
	at org.apache.commons.lang3.time.FastDateFormat.<init>(FastDateFormat.java:394)
	at org.apache.commons.lang3.time.FastDateFormat.<init>(FastDateFormat.java:379)
	at org.apache.commons.lang3.time.FastDateFormat$1.createInstance(FastDateFormat.java:101)
	at org.apache.commons.lang3.time.FastDateFormat$1.createInstance(FastDateFormat.java:98)
	at org.apache.commons.lang3.time.FormatCache.getInstance(FormatCache.java:82)
	at org.apache.commons.lang3.time.FastDateFormat.getInstance(FastDateFormat.java:129)
	at org.apache.commons.lang3.time.DateFormatUtils.<clinit>(DateFormatUtils.java:47)
	at org.apache.commons.lang3.time.DateUtilsRoundingTest.<init>(DateUtilsRoundingTest.java:55)

testRoundDayOfMonth(org.apache.commons.lang3.time.DateUtilsRoundingTest)  Time elapsed: 0 sec  <<< ERROR!
java.lang.NoClassDefFoundError: Could not initialize class org.apache.commons.lang3.time.DateFormatUtils
	at org.apache.commons.lang3.time.DateUtilsRoundingTest.<init>(DateUtilsRoundingTest.java:55)

testRoundMinute(org.apache.commons.lang3.time.DateUtilsRoundingTest)  Time elapsed: 0 sec  <<< ERROR!
java.lang.NoClassDefFoundError: Could not initialize class org.apache.commons.lang3.time.DateFormatUtils
	at org.apache.commons.lang3.time.DateUtilsRoundingTest.<init>(DateUtilsRoundingTest.java:55)

testRoundSecond(org.apache.commons.lang3.time.DateUtilsRoundingTest)  Time elapsed: 0 sec  <<< ERROR!
java.lang.NoClassDefFoundError: Could not initialize class org.apache.commons.lang3.time.DateFormatUtils
	at org.apache.commons.lang3.time.DateUtilsRoundingTest.<init>(DateUtilsRoundingTest.java:55)

testRoundMonth(org.apache.commons.lang3.time.DateUtilsRoundingTest)  Time elapsed: 0 sec  <<< ERROR!
java.lang.NoClassDefFoundError: Could not initialize class org.apache.commons.lang3.time.DateFormatUtils
	at org.apache.commons.lang3.time.DateUtilsRoundingTest.<init>(DateUtilsRoundingTest.java:55)

testTruncateSemiMonth(org.apache.commons.lang3.time.DateUtilsRoundingTest)  Time elapsed: 0.001 sec  <<< ERROR!
java.lang.NoClassDefFoundError: Could not initialize class org.apache.commons.lang3.time.DateFormatUtils
	at org.apache.commons.lang3.time.DateUtilsRoundingTest.<init>(DateUtilsRoundingTest.java:55)

testTruncateMinute(org.apache.commons.lang3.time.DateUtilsRoundingTest)  Time elapsed: 0 sec  <<< ERROR!
java.lang.NoClassDefFoundError: Could not initialize class org.apache.commons.lang3.time.DateFormatUtils
	at org.apache.commons.lang3.time.DateUtilsRoundingTest.<init>(DateUtilsRoundingTest.java:55)

testRoundSemiMonth(org.apache.commons.lang3.time.DateUtilsRoundingTest)  Time elapsed: 0 sec  <<< ERROR!
java.lang.NoClassDefFoundError: Could not initialize class org.apache.commons.lang3.time.DateFormatUtils
	at org.apache.commons.lang3.time.DateUtilsRoundingTest.<init>(DateUtilsRoundingTest.java:55)

testTruncateSecond(org.apache.commons.lang3.time.DateUtilsRoundingTest)  Time elapsed: 0 sec  <<< ERROR!
java.lang.NoClassDefFoundError: Could not initialize class org.apache.commons.lang3.time.DateFormatUtils
	at org.apache.commons.lang3.time.DateUtilsRoundingTest.<init>(DateUtilsRoundingTest.java:55)

testRoundAmPm(org.apache.commons.lang3.time.DateUtilsRoundingTest)  Time elapsed: 0 sec  <<< ERROR!
java.lang.NoClassDefFoundError: Could not initialize class org.apache.commons.lang3.time.DateFormatUtils
	at org.apache.commons.lang3.time.DateUtilsRoundingTest.<init>(DateUtilsRoundingTest.java:55)

testRoundDate(org.apache.commons.lang3.time.DateUtilsRoundingTest)  Time elapsed: 0.001 sec  <<< ERROR!
java.lang.NoClassDefFoundError: Could not initialize class org.apache.commons.lang3.time.DateFormatUtils
	at org.apache.commons.lang3.time.DateUtilsRoundingTest.<init>(DateUtilsRoundingTest.java:55)

testRoundHour(org.apache.commons.lang3.time.DateUtilsRoundingTest)  Time elapsed: 0 sec  <<< ERROR!
java.lang.NoClassDefFoundError: Could not initialize class org.apache.commons.lang3.time.DateFormatUtils
	at org.apache.commons.lang3.time.DateUtilsRoundingTest.<init>(DateUtilsRoundingTest.java:55)

testRoundYear(org.apache.commons.lang3.time.DateUtilsRoundingTest)  Time elapsed: 0 sec  <<< ERROR!
java.lang.NoClassDefFoundError: Could not initialize class org.apache.commons.lang3.time.DateFormatUtils
	at org.apache.commons.lang3.time.DateUtilsRoundingTest.<init>(DateUtilsRoundingTest.java:55)

testTruncateMilliSecond(org.apache.commons.lang3.time.DateUtilsRoundingTest)  Time elapsed: 0.001 sec  <<< ERROR!
java.lang.NoClassDefFoundError: Could not initialize class org.apache.commons.lang3.time.DateFormatUtils
	at org.apache.commons.lang3.time.DateUtilsRoundingTest.<init>(DateUtilsRoundingTest.java:55)

testTruncateHourOfDay(org.apache.commons.lang3.time.DateUtilsRoundingTest)  Time elapsed: 0 sec  <<< ERROR!
java.lang.NoClassDefFoundError: Could not initialize class org.apache.commons.lang3.time.DateFormatUtils
	at org.apache.commons.lang3.time.DateUtilsRoundingTest.<init>(DateUtilsRoundingTest.java:55)

testTruncateMonth(org.apache.commons.lang3.time.DateUtilsRoundingTest)  Time elapsed: 0 sec  <<< ERROR!
java.lang.NoClassDefFoundError: Could not initialize class org.apache.commons.lang3.time.DateFormatUtils
	at org.apache.commons.lang3.time.DateUtilsRoundingTest.<init>(DateUtilsRoundingTest.java:55)

testRoundHourOfDay(org.apache.commons.lang3.time.DateUtilsRoundingTest)  Time elapsed: 0 sec  <<< ERROR!
java.lang.NoClassDefFoundError: Could not initialize class org.apache.commons.lang3.time.DateFormatUtils
	at org.apache.commons.lang3.time.DateUtilsRoundingTest.<init>(DateUtilsRoundingTest.java:55)

testTruncateAmPm(org.apache.commons.lang3.time.DateUtilsRoundingTest)  Time elapsed: 0 sec  <<< ERROR!
java.lang.NoClassDefFoundError: Could not initialize class org.apache.commons.lang3.time.DateFormatUtils
	at org.apache.commons.lang3.time.DateUtilsRoundingTest.<init>(DateUtilsRoundingTest.java:55)

testTruncateDate(org.apache.commons.lang3.time.DateUtilsRoundingTest)  Time elapsed: 0 sec  <<< ERROR!
java.lang.NoClassDefFoundError: Could not initialize class org.apache.commons.lang3.time.DateFormatUtils
	at org.apache.commons.lang3.time.DateUtilsRoundingTest.<init>(DateUtilsRoundingTest.java:55)

testTruncateHour(org.apache.commons.lang3.time.DateUtilsRoundingTest)  Time elapsed: 0.001 sec  <<< ERROR!
java.lang.NoClassDefFoundError: Could not initialize class org.apache.commons.lang3.time.DateFormatUtils
	at org.apache.commons.lang3.time.DateUtilsRoundingTest.<init>(DateUtilsRoundingTest.java:55)

testTruncateYear(org.apache.commons.lang3.time.DateUtilsRoundingTest)  Time elapsed: 0 sec  <<< ERROR!
java.lang.NoClassDefFoundError: Could not initialize class org.apache.commons.lang3.time.DateFormatUtils
	at org.apache.commons.lang3.time.DateUtilsRoundingTest.<init>(DateUtilsRoundingTest.java:55)

testTruncateDayOfMonth(org.apache.commons.lang3.time.DateUtilsRoundingTest)  Time elapsed: 0 sec  <<< ERROR!
java.lang.NoClassDefFoundError: Could not initialize class org.apache.commons.lang3.time.DateFormatUtils
	at org.apache.commons.lang3.time.DateUtilsRoundingTest.<init>(DateUtilsRoundingTest.java:55)

Running org.apache.commons.lang3.time.FastDateParserTest
Tests run: 33, Failures: 0, Errors: 0, Skipped: 0, Time elapsed: 2.42 sec - in org.apache.commons.lang3.time.FastDateParserTest
Running org.apache.commons.lang3.time.FastDateFormat_ParserTest
Tests run: 33, Failures: 0, Errors: 28, Skipped: 0, Time elapsed: 0.582 sec <<< FAILURE! - in org.apache.commons.lang3.time.FastDateFormat_ParserTest
testSpecialCharacters(org.apache.commons.lang3.time.FastDateFormat_ParserTest)  Time elapsed: 0.002 sec  <<< ERROR!
java.lang.IllegalArgumentException: null
	at org.apache.commons.lang3.time.FastDatePrinter$PaddedNumberField.<init>(FastDatePrinter.java:213)
	at org.apache.commons.lang3.time.FastDatePrinter.selectNumberRule(FastDatePrinter.java:142)
	at org.apache.commons.lang3.time.FastDatePrinter.parsePattern(FastDatePrinter.java:67)
	at org.apache.commons.lang3.time.FastDatePrinter.init(FastDatePrinter.java:38)
	at org.apache.commons.lang3.time.FastDatePrinter.<init>(FastDatePrinter.java:37)
	at org.apache.commons.lang3.time.FastDateFormat.<init>(FastDateFormat.java:394)
	at org.apache.commons.lang3.time.FastDateFormat.<init>(FastDateFormat.java:379)
	at org.apache.commons.lang3.time.FastDateFormat$1.createInstance(FastDateFormat.java:101)
	at org.apache.commons.lang3.time.FastDateFormat$1.createInstance(FastDateFormat.java:98)
	at org.apache.commons.lang3.time.FormatCache.getInstance(FormatCache.java:82)
	at org.apache.commons.lang3.time.FastDateFormat.getInstance(FastDateFormat.java:175)
	at org.apache.commons.lang3.time.FastDateFormat_ParserTest.getInstance(FastDateFormat_ParserTest.java:31)

testShortDateStyleWithLocales(org.apache.commons.lang3.time.FastDateFormat_ParserTest)  Time elapsed: 0.001 sec  <<< ERROR!
java.lang.IllegalArgumentException: null
	at org.apache.commons.lang3.time.FastDatePrinter$PaddedNumberField.<init>(FastDatePrinter.java:213)
	at org.apache.commons.lang3.time.FastDatePrinter.selectNumberRule(FastDatePrinter.java:142)
	at org.apache.commons.lang3.time.FastDatePrinter.parsePattern(FastDatePrinter.java:67)
	at org.apache.commons.lang3.time.FastDatePrinter.init(FastDatePrinter.java:38)
	at org.apache.commons.lang3.time.FastDatePrinter.<init>(FastDatePrinter.java:37)
	at org.apache.commons.lang3.time.FastDateFormat.<init>(FastDateFormat.java:394)
	at org.apache.commons.lang3.time.FastDateFormat.<init>(FastDateFormat.java:379)
	at org.apache.commons.lang3.time.FastDateFormat$1.createInstance(FastDateFormat.java:101)
	at org.apache.commons.lang3.time.FastDateFormat$1.createInstance(FastDateFormat.java:98)
	at org.apache.commons.lang3.time.FormatCache.getInstance(FormatCache.java:82)
	at org.apache.commons.lang3.time.FastDateFormat.getInstance(FastDateFormat.java:175)
	at org.apache.commons.lang3.time.FastDateFormat_ParserTest.getInstance(FastDateFormat_ParserTest.java:31)

testMilleniumBug(org.apache.commons.lang3.time.FastDateFormat_ParserTest)  Time elapsed: 0.001 sec  <<< ERROR!
java.lang.IllegalArgumentException: null
	at org.apache.commons.lang3.time.FastDatePrinter$PaddedNumberField.<init>(FastDatePrinter.java:213)
	at org.apache.commons.lang3.time.FastDatePrinter.selectNumberRule(FastDatePrinter.java:142)
	at org.apache.commons.lang3.time.FastDatePrinter.parsePattern(FastDatePrinter.java:67)
	at org.apache.commons.lang3.time.FastDatePrinter.init(FastDatePrinter.java:38)
	at org.apache.commons.lang3.time.FastDatePrinter.<init>(FastDatePrinter.java:37)
	at org.apache.commons.lang3.time.FastDateFormat.<init>(FastDateFormat.java:394)
	at org.apache.commons.lang3.time.FastDateFormat.<init>(FastDateFormat.java:379)
	at org.apache.commons.lang3.time.FastDateFormat$1.createInstance(FastDateFormat.java:101)
	at org.apache.commons.lang3.time.FastDateFormat$1.createInstance(FastDateFormat.java:98)
	at org.apache.commons.lang3.time.FormatCache.getInstance(FormatCache.java:82)
	at org.apache.commons.lang3.time.FastDateFormat.getInstance(FastDateFormat.java:175)
	at org.apache.commons.lang3.time.FastDateFormat_ParserTest.getInstance(FastDateFormat_ParserTest.java:31)

testLocaleMatches(org.apache.commons.lang3.time.FastDateFormat_ParserTest)  Time elapsed: 0.001 sec  <<< ERROR!
java.lang.IllegalArgumentException: null
	at org.apache.commons.lang3.time.FastDatePrinter$PaddedNumberField.<init>(FastDatePrinter.java:213)
	at org.apache.commons.lang3.time.FastDatePrinter.selectNumberRule(FastDatePrinter.java:142)
	at org.apache.commons.lang3.time.FastDatePrinter.parsePattern(FastDatePrinter.java:67)
	at org.apache.commons.lang3.time.FastDatePrinter.init(FastDatePrinter.java:38)
	at org.apache.commons.lang3.time.FastDatePrinter.<init>(FastDatePrinter.java:37)
	at org.apache.commons.lang3.time.FastDateFormat.<init>(FastDateFormat.java:394)
	at org.apache.commons.lang3.time.FastDateFormat.<init>(FastDateFormat.java:379)
	at org.apache.commons.lang3.time.FastDateFormat$1.createInstance(FastDateFormat.java:101)
	at org.apache.commons.lang3.time.FastDateFormat$1.createInstance(FastDateFormat.java:98)
	at org.apache.commons.lang3.time.FormatCache.getInstance(FormatCache.java:82)
	at org.apache.commons.lang3.time.FastDateFormat.getInstance(FastDateFormat.java:175)
	at org.apache.commons.lang3.time.FastDateFormat_ParserTest.getInstance(FastDateFormat_ParserTest.java:31)

testDayOf(org.apache.commons.lang3.time.FastDateFormat_ParserTest)  Time elapsed: 0.001 sec  <<< ERROR!
java.lang.IllegalArgumentException: null
	at org.apache.commons.lang3.time.FastDatePrinter$PaddedNumberField.<init>(FastDatePrinter.java:213)
	at org.apache.commons.lang3.time.FastDatePrinter.selectNumberRule(FastDatePrinter.java:142)
	at org.apache.commons.lang3.time.FastDatePrinter.parsePattern(FastDatePrinter.java:67)
	at org.apache.commons.lang3.time.FastDatePrinter.init(FastDatePrinter.java:38)
	at org.apache.commons.lang3.time.FastDatePrinter.<init>(FastDatePrinter.java:37)
	at org.apache.commons.lang3.time.FastDateFormat.<init>(FastDateFormat.java:394)
	at org.apache.commons.lang3.time.FastDateFormat.<init>(FastDateFormat.java:379)
	at org.apache.commons.lang3.time.FastDateFormat$1.createInstance(FastDateFormat.java:101)
	at org.apache.commons.lang3.time.FastDateFormat$1.createInstance(FastDateFormat.java:98)
	at org.apache.commons.lang3.time.FormatCache.getInstance(FormatCache.java:82)
	at org.apache.commons.lang3.time.FastDateFormat.getInstance(FastDateFormat.java:175)
	at org.apache.commons.lang3.time.FastDateFormat_ParserTest.getInstance(FastDateFormat_ParserTest.java:31)

testParseZone(org.apache.commons.lang3.time.FastDateFormat_ParserTest)  Time elapsed: 0 sec  <<< ERROR!
java.lang.IllegalArgumentException: null
	at org.apache.commons.lang3.time.FastDatePrinter$PaddedNumberField.<init>(FastDatePrinter.java:213)
	at org.apache.commons.lang3.time.FastDatePrinter.selectNumberRule(FastDatePrinter.java:142)
	at org.apache.commons.lang3.time.FastDatePrinter.parsePattern(FastDatePrinter.java:67)
	at org.apache.commons.lang3.time.FastDatePrinter.init(FastDatePrinter.java:38)
	at org.apache.commons.lang3.time.FastDatePrinter.<init>(FastDatePrinter.java:37)
	at org.apache.commons.lang3.time.FastDateFormat.<init>(FastDateFormat.java:394)
	at org.apache.commons.lang3.time.FastDateFormat.<init>(FastDateFormat.java:379)
	at org.apache.commons.lang3.time.FastDateFormat$1.createInstance(FastDateFormat.java:101)
	at org.apache.commons.lang3.time.FastDateFormat$1.createInstance(FastDateFormat.java:98)
	at org.apache.commons.lang3.time.FormatCache.getInstance(FormatCache.java:82)
	at org.apache.commons.lang3.time.FastDateFormat.getInstance(FastDateFormat.java:175)
	at org.apache.commons.lang3.time.FastDateFormat_ParserTest.getInstance(FastDateFormat_ParserTest.java:31)

test1806(org.apache.commons.lang3.time.FastDateFormat_ParserTest)  Time elapsed: 0.001 sec  <<< ERROR!
java.lang.IllegalArgumentException: null
	at org.apache.commons.lang3.time.FastDatePrinter$PaddedNumberField.<init>(FastDatePrinter.java:213)
	at org.apache.commons.lang3.time.FastDatePrinter.selectNumberRule(FastDatePrinter.java:142)
	at org.apache.commons.lang3.time.FastDatePrinter.parsePattern(FastDatePrinter.java:67)
	at org.apache.commons.lang3.time.FastDatePrinter.init(FastDatePrinter.java:38)
	at org.apache.commons.lang3.time.FastDatePrinter.<init>(FastDatePrinter.java:37)
	at org.apache.commons.lang3.time.FastDateFormat.<init>(FastDateFormat.java:394)
	at org.apache.commons.lang3.time.FastDateFormat.<init>(FastDateFormat.java:379)
	at org.apache.commons.lang3.time.FastDateFormat$1.createInstance(FastDateFormat.java:101)
	at org.apache.commons.lang3.time.FastDateFormat$1.createInstance(FastDateFormat.java:98)
	at org.apache.commons.lang3.time.FormatCache.getInstance(FormatCache.java:82)
	at org.apache.commons.lang3.time.FastDateFormat.getInstance(FastDateFormat.java:175)
	at org.apache.commons.lang3.time.FastDateFormat_ParserTest.getInstance(FastDateFormat_ParserTest.java:31)

testAmPm(org.apache.commons.lang3.time.FastDateFormat_ParserTest)  Time elapsed: 0 sec  <<< ERROR!
java.lang.IllegalArgumentException: null
	at org.apache.commons.lang3.time.FastDatePrinter$PaddedNumberField.<init>(FastDatePrinter.java:213)
	at org.apache.commons.lang3.time.FastDatePrinter.selectNumberRule(FastDatePrinter.java:142)
	at org.apache.commons.lang3.time.FastDatePrinter.parsePattern(FastDatePrinter.java:67)
	at org.apache.commons.lang3.time.FastDatePrinter.init(FastDatePrinter.java:38)
	at org.apache.commons.lang3.time.FastDatePrinter.<init>(FastDatePrinter.java:37)
	at org.apache.commons.lang3.time.FastDateFormat.<init>(FastDateFormat.java:394)
	at org.apache.commons.lang3.time.FastDateFormat.<init>(FastDateFormat.java:379)
	at org.apache.commons.lang3.time.FastDateFormat$1.createInstance(FastDateFormat.java:101)
	at org.apache.commons.lang3.time.FastDateFormat$1.createInstance(FastDateFormat.java:98)
	at org.apache.commons.lang3.time.FormatCache.getInstance(FormatCache.java:82)
	at org.apache.commons.lang3.time.FastDateFormat.getInstance(FastDateFormat.java:175)
	at org.apache.commons.lang3.time.FastDateFormat_ParserTest.getInstance(FastDateFormat_ParserTest.java:31)

testLowYearPadding(org.apache.commons.lang3.time.FastDateFormat_ParserTest)  Time elapsed: 0 sec  <<< ERROR!
java.lang.IllegalArgumentException: null
	at org.apache.commons.lang3.time.FastDatePrinter$PaddedNumberField.<init>(FastDatePrinter.java:213)
	at org.apache.commons.lang3.time.FastDatePrinter.selectNumberRule(FastDatePrinter.java:142)
	at org.apache.commons.lang3.time.FastDatePrinter.parsePattern(FastDatePrinter.java:67)
	at org.apache.commons.lang3.time.FastDatePrinter.init(FastDatePrinter.java:38)
	at org.apache.commons.lang3.time.FastDatePrinter.<init>(FastDatePrinter.java:37)
	at org.apache.commons.lang3.time.FastDateFormat.<init>(FastDateFormat.java:394)
	at org.apache.commons.lang3.time.FastDateFormat.<init>(FastDateFormat.java:379)
	at org.apache.commons.lang3.time.FastDateFormat$1.createInstance(FastDateFormat.java:101)
	at org.apache.commons.lang3.time.FastDateFormat$1.createInstance(FastDateFormat.java:98)
	at org.apache.commons.lang3.time.FormatCache.getInstance(FormatCache.java:82)
	at org.apache.commons.lang3.time.FastDateFormat.getInstance(FastDateFormat.java:175)
	at org.apache.commons.lang3.time.FastDateFormat_ParserTest.getInstance(FastDateFormat_ParserTest.java:31)

testLocales_Long_AD(org.apache.commons.lang3.time.FastDateFormat_ParserTest)  Time elapsed: 0.001 sec  <<< ERROR!
java.lang.IllegalArgumentException: null
	at org.apache.commons.lang3.time.FastDatePrinter$PaddedNumberField.<init>(FastDatePrinter.java:213)
	at org.apache.commons.lang3.time.FastDatePrinter.selectNumberRule(FastDatePrinter.java:142)
	at org.apache.commons.lang3.time.FastDatePrinter.parsePattern(FastDatePrinter.java:67)
	at org.apache.commons.lang3.time.FastDatePrinter.init(FastDatePrinter.java:38)
	at org.apache.commons.lang3.time.FastDatePrinter.<init>(FastDatePrinter.java:37)
	at org.apache.commons.lang3.time.FastDateFormat.<init>(FastDateFormat.java:394)
	at org.apache.commons.lang3.time.FastDateFormat.<init>(FastDateFormat.java:379)
	at org.apache.commons.lang3.time.FastDateFormat$1.createInstance(FastDateFormat.java:101)
	at org.apache.commons.lang3.time.FastDateFormat$1.createInstance(FastDateFormat.java:98)
	at org.apache.commons.lang3.time.FormatCache.getInstance(FormatCache.java:82)
	at org.apache.commons.lang3.time.FastDateFormat.getInstance(FastDateFormat.java:175)
	at org.apache.commons.lang3.time.FastDateFormat_ParserTest.getInstance(FastDateFormat_ParserTest.java:31)

testLocales_Long_BC(org.apache.commons.lang3.time.FastDateFormat_ParserTest)  Time elapsed: 0.001 sec  <<< ERROR!
java.lang.IllegalArgumentException: null
	at org.apache.commons.lang3.time.FastDatePrinter$PaddedNumberField.<init>(FastDatePrinter.java:213)
	at org.apache.commons.lang3.time.FastDatePrinter.selectNumberRule(FastDatePrinter.java:142)
	at org.apache.commons.lang3.time.FastDatePrinter.parsePattern(FastDatePrinter.java:67)
	at org.apache.commons.lang3.time.FastDatePrinter.init(FastDatePrinter.java:38)
	at org.apache.commons.lang3.time.FastDatePrinter.<init>(FastDatePrinter.java:37)
	at org.apache.commons.lang3.time.FastDateFormat.<init>(FastDateFormat.java:394)
	at org.apache.commons.lang3.time.FastDateFormat.<init>(FastDateFormat.java:379)
	at org.apache.commons.lang3.time.FastDateFormat$1.createInstance(FastDateFormat.java:101)
	at org.apache.commons.lang3.time.FastDateFormat$1.createInstance(FastDateFormat.java:98)
	at org.apache.commons.lang3.time.FormatCache.getInstance(FormatCache.java:82)
	at org.apache.commons.lang3.time.FastDateFormat.getInstance(FastDateFormat.java:175)
	at org.apache.commons.lang3.time.FastDateFormat_ParserTest.getInstance(FastDateFormat_ParserTest.java:31)

testParseNumerics(org.apache.commons.lang3.time.FastDateFormat_ParserTest)  Time elapsed: 0 sec  <<< ERROR!
java.lang.IllegalArgumentException: null
	at org.apache.commons.lang3.time.FastDatePrinter$PaddedNumberField.<init>(FastDatePrinter.java:213)
	at org.apache.commons.lang3.time.FastDatePrinter.selectNumberRule(FastDatePrinter.java:142)
	at org.apache.commons.lang3.time.FastDatePrinter.parsePattern(FastDatePrinter.java:67)
	at org.apache.commons.lang3.time.FastDatePrinter.init(FastDatePrinter.java:38)
	at org.apache.commons.lang3.time.FastDatePrinter.<init>(FastDatePrinter.java:37)
	at org.apache.commons.lang3.time.FastDateFormat.<init>(FastDateFormat.java:394)
	at org.apache.commons.lang3.time.FastDateFormat.<init>(FastDateFormat.java:379)
	at org.apache.commons.lang3.time.FastDateFormat$1.createInstance(FastDateFormat.java:101)
	at org.apache.commons.lang3.time.FastDateFormat$1.createInstance(FastDateFormat.java:98)
	at org.apache.commons.lang3.time.FormatCache.getInstance(FormatCache.java:82)
	at org.apache.commons.lang3.time.FastDateFormat.getInstance(FastDateFormat.java:175)
	at org.apache.commons.lang3.time.FastDateFormat_ParserTest.getInstance(FastDateFormat_ParserTest.java:31)

testLang303(org.apache.commons.lang3.time.FastDateFormat_ParserTest)  Time elapsed: 0.001 sec  <<< ERROR!
java.lang.IllegalArgumentException: null
	at org.apache.commons.lang3.time.FastDatePrinter$PaddedNumberField.<init>(FastDatePrinter.java:213)
	at org.apache.commons.lang3.time.FastDatePrinter.selectNumberRule(FastDatePrinter.java:142)
	at org.apache.commons.lang3.time.FastDatePrinter.parsePattern(FastDatePrinter.java:67)
	at org.apache.commons.lang3.time.FastDatePrinter.init(FastDatePrinter.java:38)
	at org.apache.commons.lang3.time.FastDatePrinter.<init>(FastDatePrinter.java:37)
	at org.apache.commons.lang3.time.FastDateFormat.<init>(FastDateFormat.java:394)
	at org.apache.commons.lang3.time.FastDateFormat.<init>(FastDateFormat.java:379)
	at org.apache.commons.lang3.time.FastDateFormat$1.createInstance(FastDateFormat.java:101)
	at org.apache.commons.lang3.time.FastDateFormat$1.createInstance(FastDateFormat.java:98)
	at org.apache.commons.lang3.time.FormatCache.getInstance(FormatCache.java:82)
	at org.apache.commons.lang3.time.FastDateFormat.getInstance(FastDateFormat.java:175)
	at org.apache.commons.lang3.time.FastDateFormat_ParserTest.getInstance(FastDateFormat_ParserTest.java:31)

testLang538(org.apache.commons.lang3.time.FastDateFormat_ParserTest)  Time elapsed: 0 sec  <<< ERROR!
java.lang.IllegalArgumentException: null
	at org.apache.commons.lang3.time.FastDatePrinter$PaddedNumberField.<init>(FastDatePrinter.java:213)
	at org.apache.commons.lang3.time.FastDatePrinter.selectNumberRule(FastDatePrinter.java:142)
	at org.apache.commons.lang3.time.FastDatePrinter.parsePattern(FastDatePrinter.java:67)
	at org.apache.commons.lang3.time.FastDatePrinter.init(FastDatePrinter.java:38)
	at org.apache.commons.lang3.time.FastDatePrinter.<init>(FastDatePrinter.java:37)
	at org.apache.commons.lang3.time.FastDateFormat.<init>(FastDateFormat.java:394)
	at org.apache.commons.lang3.time.FastDateFormat.<init>(FastDateFormat.java:379)
	at org.apache.commons.lang3.time.FastDateFormat$1.createInstance(FastDateFormat.java:101)
	at org.apache.commons.lang3.time.FastDateFormat$1.createInstance(FastDateFormat.java:98)
	at org.apache.commons.lang3.time.FormatCache.getInstance(FormatCache.java:82)
	at org.apache.commons.lang3.time.FastDateFormat.getInstance(FastDateFormat.java:175)
	at org.apache.commons.lang3.time.FastDateFormat_ParserTest.getInstance(FastDateFormat_ParserTest.java:31)

testLang996(org.apache.commons.lang3.time.FastDateFormat_ParserTest)  Time elapsed: 0 sec  <<< ERROR!
java.lang.IllegalArgumentException: null
	at org.apache.commons.lang3.time.FastDatePrinter$PaddedNumberField.<init>(FastDatePrinter.java:213)
	at org.apache.commons.lang3.time.FastDatePrinter.selectNumberRule(FastDatePrinter.java:142)
	at org.apache.commons.lang3.time.FastDatePrinter.parsePattern(FastDatePrinter.java:67)
	at org.apache.commons.lang3.time.FastDatePrinter.init(FastDatePrinter.java:38)
	at org.apache.commons.lang3.time.FastDatePrinter.<init>(FastDatePrinter.java:37)
	at org.apache.commons.lang3.time.FastDateFormat.<init>(FastDateFormat.java:394)
	at org.apache.commons.lang3.time.FastDateFormat.<init>(FastDateFormat.java:379)
	at org.apache.commons.lang3.time.FastDateFormat$1.createInstance(FastDateFormat.java:101)
	at org.apache.commons.lang3.time.FastDateFormat$1.createInstance(FastDateFormat.java:98)
	at org.apache.commons.lang3.time.FormatCache.getInstance(FormatCache.java:82)
	at org.apache.commons.lang3.time.FastDateFormat.getInstance(FastDateFormat.java:175)
	at org.apache.commons.lang3.time.FastDateFormat_ParserTest.getInstance(FastDateFormat_ParserTest.java:31)

testToStringContainsName(org.apache.commons.lang3.time.FastDateFormat_ParserTest)  Time elapsed: 0 sec  <<< ERROR!
java.lang.IllegalArgumentException: null
	at org.apache.commons.lang3.time.FastDatePrinter$PaddedNumberField.<init>(FastDatePrinter.java:213)
	at org.apache.commons.lang3.time.FastDatePrinter.selectNumberRule(FastDatePrinter.java:142)
	at org.apache.commons.lang3.time.FastDatePrinter.parsePattern(FastDatePrinter.java:67)
	at org.apache.commons.lang3.time.FastDatePrinter.init(FastDatePrinter.java:38)
	at org.apache.commons.lang3.time.FastDatePrinter.<init>(FastDatePrinter.java:37)
	at org.apache.commons.lang3.time.FastDateFormat.<init>(FastDateFormat.java:394)
	at org.apache.commons.lang3.time.FastDateFormat.<init>(FastDateFormat.java:379)
	at org.apache.commons.lang3.time.FastDateFormat$1.createInstance(FastDateFormat.java:101)
	at org.apache.commons.lang3.time.FastDateFormat$1.createInstance(FastDateFormat.java:98)
	at org.apache.commons.lang3.time.FormatCache.getInstance(FormatCache.java:82)
	at org.apache.commons.lang3.time.FastDateFormat.getInstance(FastDateFormat.java:175)
	at org.apache.commons.lang3.time.FastDateFormat_ParserTest.getInstance(FastDateFormat_ParserTest.java:31)

test_Equality_Hash(org.apache.commons.lang3.time.FastDateFormat_ParserTest)  Time elapsed: 0 sec  <<< ERROR!
java.lang.IllegalArgumentException: null
	at org.apache.commons.lang3.time.FastDatePrinter$PaddedNumberField.<init>(FastDatePrinter.java:213)
	at org.apache.commons.lang3.time.FastDatePrinter.selectNumberRule(FastDatePrinter.java:142)
	at org.apache.commons.lang3.time.FastDatePrinter.parsePattern(FastDatePrinter.java:67)
	at org.apache.commons.lang3.time.FastDatePrinter.init(FastDatePrinter.java:38)
	at org.apache.commons.lang3.time.FastDatePrinter.<init>(FastDatePrinter.java:37)
	at org.apache.commons.lang3.time.FastDateFormat.<init>(FastDateFormat.java:394)
	at org.apache.commons.lang3.time.FastDateFormat.<init>(FastDateFormat.java:379)
	at org.apache.commons.lang3.time.FastDateFormat$1.createInstance(FastDateFormat.java:101)
	at org.apache.commons.lang3.time.FastDateFormat$1.createInstance(FastDateFormat.java:98)
	at org.apache.commons.lang3.time.FormatCache.getInstance(FormatCache.java:82)
	at org.apache.commons.lang3.time.FastDateFormat.getInstance(FastDateFormat.java:175)
	at org.apache.commons.lang3.time.FastDateFormat_ParserTest.getInstance(FastDateFormat_ParserTest.java:31)

testLocales_ShortNoEra_AD(org.apache.commons.lang3.time.FastDateFormat_ParserTest)  Time elapsed: 0 sec  <<< ERROR!
java.lang.IllegalArgumentException: null
	at org.apache.commons.lang3.time.FastDatePrinter$PaddedNumberField.<init>(FastDatePrinter.java:213)
	at org.apache.commons.lang3.time.FastDatePrinter.selectNumberRule(FastDatePrinter.java:142)
	at org.apache.commons.lang3.time.FastDatePrinter.parsePattern(FastDatePrinter.java:67)
	at org.apache.commons.lang3.time.FastDatePrinter.init(FastDatePrinter.java:38)
	at org.apache.commons.lang3.time.FastDatePrinter.<init>(FastDatePrinter.java:37)
	at org.apache.commons.lang3.time.FastDateFormat.<init>(FastDateFormat.java:394)
	at org.apache.commons.lang3.time.FastDateFormat.<init>(FastDateFormat.java:379)
	at org.apache.commons.lang3.time.FastDateFormat$1.createInstance(FastDateFormat.java:101)
	at org.apache.commons.lang3.time.FastDateFormat$1.createInstance(FastDateFormat.java:98)
	at org.apache.commons.lang3.time.FormatCache.getInstance(FormatCache.java:82)
	at org.apache.commons.lang3.time.FastDateFormat.getInstance(FastDateFormat.java:175)
	at org.apache.commons.lang3.time.FastDateFormat_ParserTest.getInstance(FastDateFormat_ParserTest.java:31)

testLocales_ShortNoEra_BC(org.apache.commons.lang3.time.FastDateFormat_ParserTest)  Time elapsed: 0 sec  <<< ERROR!
java.lang.IllegalArgumentException: null
	at org.apache.commons.lang3.time.FastDatePrinter$PaddedNumberField.<init>(FastDatePrinter.java:213)
	at org.apache.commons.lang3.time.FastDatePrinter.selectNumberRule(FastDatePrinter.java:142)
	at org.apache.commons.lang3.time.FastDatePrinter.parsePattern(FastDatePrinter.java:67)
	at org.apache.commons.lang3.time.FastDatePrinter.init(FastDatePrinter.java:38)
	at org.apache.commons.lang3.time.FastDatePrinter.<init>(FastDatePrinter.java:37)
	at org.apache.commons.lang3.time.FastDateFormat.<init>(FastDateFormat.java:394)
	at org.apache.commons.lang3.time.FastDateFormat.<init>(FastDateFormat.java:379)
	at org.apache.commons.lang3.time.FastDateFormat$1.createInstance(FastDateFormat.java:101)
	at org.apache.commons.lang3.time.FastDateFormat$1.createInstance(FastDateFormat.java:98)
	at org.apache.commons.lang3.time.FormatCache.getInstance(FormatCache.java:82)
	at org.apache.commons.lang3.time.FastDateFormat.getInstance(FastDateFormat.java:175)
	at org.apache.commons.lang3.time.FastDateFormat_ParserTest.getInstance(FastDateFormat_ParserTest.java:31)

testParseLongShort(org.apache.commons.lang3.time.FastDateFormat_ParserTest)  Time elapsed: 0 sec  <<< ERROR!
java.lang.IllegalArgumentException: null
	at org.apache.commons.lang3.time.FastDatePrinter$PaddedNumberField.<init>(FastDatePrinter.java:213)
	at org.apache.commons.lang3.time.FastDatePrinter.selectNumberRule(FastDatePrinter.java:142)
	at org.apache.commons.lang3.time.FastDatePrinter.parsePattern(FastDatePrinter.java:67)
	at org.apache.commons.lang3.time.FastDatePrinter.init(FastDatePrinter.java:38)
	at org.apache.commons.lang3.time.FastDatePrinter.<init>(FastDatePrinter.java:37)
	at org.apache.commons.lang3.time.FastDateFormat.<init>(FastDateFormat.java:394)
	at org.apache.commons.lang3.time.FastDateFormat.<init>(FastDateFormat.java:379)
	at org.apache.commons.lang3.time.FastDateFormat$1.createInstance(FastDateFormat.java:101)
	at org.apache.commons.lang3.time.FastDateFormat$1.createInstance(FastDateFormat.java:98)
	at org.apache.commons.lang3.time.FormatCache.getInstance(FormatCache.java:82)
	at org.apache.commons.lang3.time.FastDateFormat.getInstance(FastDateFormat.java:175)
	at org.apache.commons.lang3.time.FastDateFormat_ParserTest.getInstance(FastDateFormat_ParserTest.java:31)

testLocales_LongNoEra_AD(org.apache.commons.lang3.time.FastDateFormat_ParserTest)  Time elapsed: 0 sec  <<< ERROR!
java.lang.IllegalArgumentException: null
	at org.apache.commons.lang3.time.FastDatePrinter$PaddedNumberField.<init>(FastDatePrinter.java:213)
	at org.apache.commons.lang3.time.FastDatePrinter.selectNumberRule(FastDatePrinter.java:142)
	at org.apache.commons.lang3.time.FastDatePrinter.parsePattern(FastDatePrinter.java:67)
	at org.apache.commons.lang3.time.FastDatePrinter.init(FastDatePrinter.java:38)
	at org.apache.commons.lang3.time.FastDatePrinter.<init>(FastDatePrinter.java:37)
	at org.apache.commons.lang3.time.FastDateFormat.<init>(FastDateFormat.java:394)
	at org.apache.commons.lang3.time.FastDateFormat.<init>(FastDateFormat.java:379)
	at org.apache.commons.lang3.time.FastDateFormat$1.createInstance(FastDateFormat.java:101)
	at org.apache.commons.lang3.time.FastDateFormat$1.createInstance(FastDateFormat.java:98)
	at org.apache.commons.lang3.time.FormatCache.getInstance(FormatCache.java:82)
	at org.apache.commons.lang3.time.FastDateFormat.getInstance(FastDateFormat.java:175)
	at org.apache.commons.lang3.time.FastDateFormat_ParserTest.getInstance(FastDateFormat_ParserTest.java:31)

testLocales_LongNoEra_BC(org.apache.commons.lang3.time.FastDateFormat_ParserTest)  Time elapsed: 0 sec  <<< ERROR!
java.lang.IllegalArgumentException: null
	at org.apache.commons.lang3.time.FastDatePrinter$PaddedNumberField.<init>(FastDatePrinter.java:213)
	at org.apache.commons.lang3.time.FastDatePrinter.selectNumberRule(FastDatePrinter.java:142)
	at org.apache.commons.lang3.time.FastDatePrinter.parsePattern(FastDatePrinter.java:67)
	at org.apache.commons.lang3.time.FastDatePrinter.init(FastDatePrinter.java:38)
	at org.apache.commons.lang3.time.FastDatePrinter.<init>(FastDatePrinter.java:37)
	at org.apache.commons.lang3.time.FastDateFormat.<init>(FastDateFormat.java:394)
	at org.apache.commons.lang3.time.FastDateFormat.<init>(FastDateFormat.java:379)
	at org.apache.commons.lang3.time.FastDateFormat$1.createInstance(FastDateFormat.java:101)
	at org.apache.commons.lang3.time.FastDateFormat$1.createInstance(FastDateFormat.java:98)
	at org.apache.commons.lang3.time.FormatCache.getInstance(FormatCache.java:82)
	at org.apache.commons.lang3.time.FastDateFormat.getInstance(FastDateFormat.java:175)
	at org.apache.commons.lang3.time.FastDateFormat_ParserTest.getInstance(FastDateFormat_ParserTest.java:31)

testLocales_Short_AD(org.apache.commons.lang3.time.FastDateFormat_ParserTest)  Time elapsed: 0 sec  <<< ERROR!
java.lang.IllegalArgumentException: null
	at org.apache.commons.lang3.time.FastDatePrinter$PaddedNumberField.<init>(FastDatePrinter.java:213)
	at org.apache.commons.lang3.time.FastDatePrinter.selectNumberRule(FastDatePrinter.java:142)
	at org.apache.commons.lang3.time.FastDatePrinter.parsePattern(FastDatePrinter.java:67)
	at org.apache.commons.lang3.time.FastDatePrinter.init(FastDatePrinter.java:38)
	at org.apache.commons.lang3.time.FastDatePrinter.<init>(FastDatePrinter.java:37)
	at org.apache.commons.lang3.time.FastDateFormat.<init>(FastDateFormat.java:394)
	at org.apache.commons.lang3.time.FastDateFormat.<init>(FastDateFormat.java:379)
	at org.apache.commons.lang3.time.FastDateFormat$1.createInstance(FastDateFormat.java:101)
	at org.apache.commons.lang3.time.FastDateFormat$1.createInstance(FastDateFormat.java:98)
	at org.apache.commons.lang3.time.FormatCache.getInstance(FormatCache.java:82)
	at org.apache.commons.lang3.time.FastDateFormat.getInstance(FastDateFormat.java:175)
	at org.apache.commons.lang3.time.FastDateFormat_ParserTest.getInstance(FastDateFormat_ParserTest.java:31)

testLocales_Short_BC(org.apache.commons.lang3.time.FastDateFormat_ParserTest)  Time elapsed: 0 sec  <<< ERROR!
java.lang.IllegalArgumentException: null
	at org.apache.commons.lang3.time.FastDatePrinter$PaddedNumberField.<init>(FastDatePrinter.java:213)
	at org.apache.commons.lang3.time.FastDatePrinter.selectNumberRule(FastDatePrinter.java:142)
	at org.apache.commons.lang3.time.FastDatePrinter.parsePattern(FastDatePrinter.java:67)
	at org.apache.commons.lang3.time.FastDatePrinter.init(FastDatePrinter.java:38)
	at org.apache.commons.lang3.time.FastDatePrinter.<init>(FastDatePrinter.java:37)
	at org.apache.commons.lang3.time.FastDateFormat.<init>(FastDateFormat.java:394)
	at org.apache.commons.lang3.time.FastDateFormat.<init>(FastDateFormat.java:379)
	at org.apache.commons.lang3.time.FastDateFormat$1.createInstance(FastDateFormat.java:101)
	at org.apache.commons.lang3.time.FastDateFormat$1.createInstance(FastDateFormat.java:98)
	at org.apache.commons.lang3.time.FormatCache.getInstance(FormatCache.java:82)
	at org.apache.commons.lang3.time.FastDateFormat.getInstance(FastDateFormat.java:175)
	at org.apache.commons.lang3.time.FastDateFormat_ParserTest.getInstance(FastDateFormat_ParserTest.java:31)

testEquals(org.apache.commons.lang3.time.FastDateFormat_ParserTest)  Time elapsed: 0 sec  <<< ERROR!
java.lang.IllegalArgumentException: null
	at org.apache.commons.lang3.time.FastDatePrinter$PaddedNumberField.<init>(FastDatePrinter.java:213)
	at org.apache.commons.lang3.time.FastDatePrinter.selectNumberRule(FastDatePrinter.java:142)
	at org.apache.commons.lang3.time.FastDatePrinter.parsePattern(FastDatePrinter.java:67)
	at org.apache.commons.lang3.time.FastDatePrinter.init(FastDatePrinter.java:38)
	at org.apache.commons.lang3.time.FastDatePrinter.<init>(FastDatePrinter.java:37)
	at org.apache.commons.lang3.time.FastDateFormat.<init>(FastDateFormat.java:394)
	at org.apache.commons.lang3.time.FastDateFormat.<init>(FastDateFormat.java:379)
	at org.apache.commons.lang3.time.FastDateFormat$1.createInstance(FastDateFormat.java:101)
	at org.apache.commons.lang3.time.FastDateFormat$1.createInstance(FastDateFormat.java:98)
	at org.apache.commons.lang3.time.FormatCache.getInstance(FormatCache.java:82)
	at org.apache.commons.lang3.time.FastDateFormat.getInstance(FastDateFormat.java:175)
	at org.apache.commons.lang3.time.FastDateFormat_ParserTest.getInstance(FastDateFormat_ParserTest.java:31)

testQuotes(org.apache.commons.lang3.time.FastDateFormat_ParserTest)  Time elapsed: 0 sec  <<< ERROR!
java.lang.IllegalArgumentException: null
	at org.apache.commons.lang3.time.FastDatePrinter$PaddedNumberField.<init>(FastDatePrinter.java:213)
	at org.apache.commons.lang3.time.FastDatePrinter.selectNumberRule(FastDatePrinter.java:142)
	at org.apache.commons.lang3.time.FastDatePrinter.parsePattern(FastDatePrinter.java:67)
	at org.apache.commons.lang3.time.FastDatePrinter.init(FastDatePrinter.java:38)
	at org.apache.commons.lang3.time.FastDatePrinter.<init>(FastDatePrinter.java:37)
	at org.apache.commons.lang3.time.FastDateFormat.<init>(FastDateFormat.java:394)
	at org.apache.commons.lang3.time.FastDateFormat.<init>(FastDateFormat.java:379)
	at org.apache.commons.lang3.time.FastDateFormat$1.createInstance(FastDateFormat.java:101)
	at org.apache.commons.lang3.time.FastDateFormat$1.createInstance(FastDateFormat.java:98)
	at org.apache.commons.lang3.time.FormatCache.getInstance(FormatCache.java:82)
	at org.apache.commons.lang3.time.FastDateFormat.getInstance(FastDateFormat.java:175)
	at org.apache.commons.lang3.time.FastDateFormat_ParserTest.getInstance(FastDateFormat_ParserTest.java:31)

testTimeZoneMatches(org.apache.commons.lang3.time.FastDateFormat_ParserTest)  Time elapsed: 0 sec  <<< ERROR!
java.lang.IllegalArgumentException: null
	at org.apache.commons.lang3.time.FastDatePrinter$PaddedNumberField.<init>(FastDatePrinter.java:213)
	at org.apache.commons.lang3.time.FastDatePrinter.selectNumberRule(FastDatePrinter.java:142)
	at org.apache.commons.lang3.time.FastDatePrinter.parsePattern(FastDatePrinter.java:67)
	at org.apache.commons.lang3.time.FastDatePrinter.init(FastDatePrinter.java:38)
	at org.apache.commons.lang3.time.FastDatePrinter.<init>(FastDatePrinter.java:37)
	at org.apache.commons.lang3.time.FastDateFormat.<init>(FastDateFormat.java:394)
	at org.apache.commons.lang3.time.FastDateFormat.<init>(FastDateFormat.java:379)
	at org.apache.commons.lang3.time.FastDateFormat$1.createInstance(FastDateFormat.java:101)
	at org.apache.commons.lang3.time.FastDateFormat$1.createInstance(FastDateFormat.java:98)
	at org.apache.commons.lang3.time.FormatCache.getInstance(FormatCache.java:82)
	at org.apache.commons.lang3.time.FastDateFormat.getInstance(FastDateFormat.java:175)
	at org.apache.commons.lang3.time.FastDateFormat_ParserTest.getInstance(FastDateFormat_ParserTest.java:31)

testPatternMatches(org.apache.commons.lang3.time.FastDateFormat_ParserTest)  Time elapsed: 0 sec  <<< ERROR!
java.lang.IllegalArgumentException: null
	at org.apache.commons.lang3.time.FastDatePrinter$PaddedNumberField.<init>(FastDatePrinter.java:213)
	at org.apache.commons.lang3.time.FastDatePrinter.selectNumberRule(FastDatePrinter.java:142)
	at org.apache.commons.lang3.time.FastDatePrinter.parsePattern(FastDatePrinter.java:67)
	at org.apache.commons.lang3.time.FastDatePrinter.init(FastDatePrinter.java:38)
	at org.apache.commons.lang3.time.FastDatePrinter.<init>(FastDatePrinter.java:37)
	at org.apache.commons.lang3.time.FastDateFormat.<init>(FastDateFormat.java:394)
	at org.apache.commons.lang3.time.FastDateFormat.<init>(FastDateFormat.java:379)
	at org.apache.commons.lang3.time.FastDateFormat$1.createInstance(FastDateFormat.java:101)
	at org.apache.commons.lang3.time.FastDateFormat$1.createInstance(FastDateFormat.java:98)
	at org.apache.commons.lang3.time.FormatCache.getInstance(FormatCache.java:82)
	at org.apache.commons.lang3.time.FastDateFormat.getInstance(FastDateFormat.java:175)
	at org.apache.commons.lang3.time.FastDateFormat_ParserTest.getInstance(FastDateFormat_ParserTest.java:31)

Running org.apache.commons.lang3.time.DurationFormatUtilsTest
Tests run: 25, Failures: 0, Errors: 1, Skipped: 0, Time elapsed: 0.596 sec <<< FAILURE! - in org.apache.commons.lang3.time.DurationFormatUtilsTest
testFormatPeriodISO(org.apache.commons.lang3.time.DurationFormatUtilsTest)  Time elapsed: 0.001 sec  <<< ERROR!
java.lang.NoClassDefFoundError: Could not initialize class org.apache.commons.lang3.time.DateFormatUtils
	at org.apache.commons.lang3.time.DurationFormatUtilsTest.testFormatPeriodISO(DurationFormatUtilsTest.java:269)

Running org.apache.commons.lang3.time.DateFormatUtilsTest
Tests run: 10, Failures: 0, Errors: 10, Skipped: 0, Time elapsed: 0.004 sec <<< FAILURE! - in org.apache.commons.lang3.time.DateFormatUtilsTest
testFormatUTC(org.apache.commons.lang3.time.DateFormatUtilsTest)  Time elapsed: 0 sec  <<< ERROR!
java.lang.NoClassDefFoundError: Could not initialize class org.apache.commons.lang3.time.DateFormatUtils
	at org.apache.commons.lang3.time.DateFormatUtilsTest.testFormatUTC(DateFormatUtilsTest.java:99)

testTimeISO(org.apache.commons.lang3.time.DateFormatUtilsTest)  Time elapsed: 0 sec  <<< ERROR!
java.lang.NoClassDefFoundError: Could not initialize class org.apache.commons.lang3.time.DateFormatUtils
	at org.apache.commons.lang3.time.DateFormatUtilsTest.testTimeISO(DateFormatUtilsTest.java:169)

testFormatCalendar(org.apache.commons.lang3.time.DateFormatUtilsTest)  Time elapsed: 0 sec  <<< ERROR!
java.lang.NoClassDefFoundError: Could not initialize class org.apache.commons.lang3.time.DateFormatUtils
	at org.apache.commons.lang3.time.DateFormatUtilsTest.testFormatCalendar(DateFormatUtilsTest.java:86)

testSMTP(org.apache.commons.lang3.time.DateFormatUtilsTest)  Time elapsed: 0 sec  <<< ERROR!
java.lang.NoClassDefFoundError: Could not initialize class org.apache.commons.lang3.time.DateFormatUtils
	at org.apache.commons.lang3.time.DateFormatUtilsTest.testSMTP(DateFormatUtilsTest.java:217)

testDateTimeISO(org.apache.commons.lang3.time.DateFormatUtilsTest)  Time elapsed: 0 sec  <<< ERROR!
java.lang.NoClassDefFoundError: Could not initialize class org.apache.commons.lang3.time.DateFormatUtils
	at org.apache.commons.lang3.time.DateFormatUtilsTest.testDateTimeISO(DateFormatUtilsTest.java:113)

testLANG1000(org.apache.commons.lang3.time.DateFormatUtilsTest)  Time elapsed: 0 sec  <<< ERROR!
java.lang.NoClassDefFoundError: Could not initialize class org.apache.commons.lang3.time.DateFormatUtils
	at org.apache.commons.lang3.time.DateFormatUtilsTest.testLANG1000(DateFormatUtilsTest.java:266)

testTimeNoTISO(org.apache.commons.lang3.time.DateFormatUtilsTest)  Time elapsed: 0 sec  <<< ERROR!
java.lang.NoClassDefFoundError: Could not initialize class org.apache.commons.lang3.time.DateFormatUtils
	at org.apache.commons.lang3.time.DateFormatUtilsTest.testTimeNoTISO(DateFormatUtilsTest.java:193)

testDateISO(org.apache.commons.lang3.time.DateFormatUtilsTest)  Time elapsed: 0.001 sec  <<< ERROR!
java.lang.NoClassDefFoundError: Could not initialize class org.apache.commons.lang3.time.DateFormatUtils
	at org.apache.commons.lang3.time.DateFormatUtilsTest.testDateISO(DateFormatUtilsTest.java:145)

testFormat(org.apache.commons.lang3.time.DateFormatUtilsTest)  Time elapsed: 0 sec  <<< ERROR!
java.lang.NoClassDefFoundError: Could not initialize class org.apache.commons.lang3.time.DateFormatUtils
	at org.apache.commons.lang3.time.DateFormatUtilsTest.testFormat(DateFormatUtilsTest.java:62)

testConstructor(org.apache.commons.lang3.time.DateFormatUtilsTest)  Time elapsed: 0.001 sec  <<< ERROR!
java.lang.NoClassDefFoundError: Could not initialize class org.apache.commons.lang3.time.DateFormatUtils
	at org.apache.commons.lang3.time.DateFormatUtilsTest.testConstructor(DateFormatUtilsTest.java:39)

Running org.apache.commons.lang3.time.DateUtilsFragmentTest
Tests run: 57, Failures: 0, Errors: 0, Skipped: 0, Time elapsed: 0.013 sec - in org.apache.commons.lang3.time.DateUtilsFragmentTest
Running org.apache.commons.lang3.time.FastDatePrinterTimeZonesTest
Tests run: 617, Failures: 0, Errors: 0, Skipped: 0, Time elapsed: 0.233 sec - in org.apache.commons.lang3.time.FastDatePrinterTimeZonesTest
Running org.apache.commons.lang3.time.FastDateFormatTest
Tests run: 14, Failures: 0, Errors: 11, Skipped: 0, Time elapsed: 0.001 sec <<< FAILURE! - in org.apache.commons.lang3.time.FastDateFormatTest
testParseSync(org.apache.commons.lang3.time.FastDateFormatTest)  Time elapsed: 0 sec  <<< ERROR!
java.lang.IllegalArgumentException: null
	at org.apache.commons.lang3.time.FastDatePrinter$PaddedNumberField.<init>(FastDatePrinter.java:213)
	at org.apache.commons.lang3.time.FastDatePrinter.selectNumberRule(FastDatePrinter.java:142)
	at org.apache.commons.lang3.time.FastDatePrinter.parsePattern(FastDatePrinter.java:67)
	at org.apache.commons.lang3.time.FastDatePrinter.init(FastDatePrinter.java:38)
	at org.apache.commons.lang3.time.FastDatePrinter.<init>(FastDatePrinter.java:37)
	at org.apache.commons.lang3.time.FastDateFormat.<init>(FastDateFormat.java:394)
	at org.apache.commons.lang3.time.FastDateFormat.<init>(FastDateFormat.java:379)
	at org.apache.commons.lang3.time.FastDateFormat$1.createInstance(FastDateFormat.java:101)
	at org.apache.commons.lang3.time.FastDateFormat$1.createInstance(FastDateFormat.java:98)
	at org.apache.commons.lang3.time.FormatCache.getInstance(FormatCache.java:82)
	at org.apache.commons.lang3.time.FastDateFormat.getInstance(FastDateFormat.java:129)
	at org.apache.commons.lang3.time.FastDateFormatTest.testParseSync(FastDateFormatTest.java:265)

testLang954(org.apache.commons.lang3.time.FastDateFormatTest)  Time elapsed: 0 sec  <<< ERROR!
java.lang.IllegalArgumentException: null
	at org.apache.commons.lang3.time.FastDatePrinter$PaddedNumberField.<init>(FastDatePrinter.java:213)
	at org.apache.commons.lang3.time.FastDatePrinter.selectNumberRule(FastDatePrinter.java:142)
	at org.apache.commons.lang3.time.FastDatePrinter.parsePattern(FastDatePrinter.java:67)
	at org.apache.commons.lang3.time.FastDatePrinter.init(FastDatePrinter.java:38)
	at org.apache.commons.lang3.time.FastDatePrinter.<init>(FastDatePrinter.java:37)
	at org.apache.commons.lang3.time.FastDateFormat.<init>(FastDateFormat.java:394)
	at org.apache.commons.lang3.time.FastDateFormat.<init>(FastDateFormat.java:379)
	at org.apache.commons.lang3.time.FastDateFormat$1.createInstance(FastDateFormat.java:101)
	at org.apache.commons.lang3.time.FastDateFormat$1.createInstance(FastDateFormat.java:98)
	at org.apache.commons.lang3.time.FormatCache.getInstance(FormatCache.java:82)
	at org.apache.commons.lang3.time.FastDateFormat.getInstance(FastDateFormat.java:129)
	at org.apache.commons.lang3.time.FastDateFormatTest.testLang954(FastDateFormatTest.java:259)

test_getInstance_String_TimeZone_Locale(org.apache.commons.lang3.time.FastDateFormatTest)  Time elapsed: 0 sec  <<< ERROR!
java.lang.IllegalArgumentException: null
	at org.apache.commons.lang3.time.FastDatePrinter$PaddedNumberField.<init>(FastDatePrinter.java:213)
	at org.apache.commons.lang3.time.FastDatePrinter.selectNumberRule(FastDatePrinter.java:142)
	at org.apache.commons.lang3.time.FastDatePrinter.parsePattern(FastDatePrinter.java:67)
	at org.apache.commons.lang3.time.FastDatePrinter.init(FastDatePrinter.java:38)
	at org.apache.commons.lang3.time.FastDatePrinter.<init>(FastDatePrinter.java:37)
	at org.apache.commons.lang3.time.FastDateFormat.<init>(FastDateFormat.java:394)
	at org.apache.commons.lang3.time.FastDateFormat.<init>(FastDateFormat.java:379)
	at org.apache.commons.lang3.time.FastDateFormat$1.createInstance(FastDateFormat.java:101)
	at org.apache.commons.lang3.time.FastDateFormat$1.createInstance(FastDateFormat.java:98)
	at org.apache.commons.lang3.time.FormatCache.getInstance(FormatCache.java:82)
	at org.apache.commons.lang3.time.FastDateFormat.getInstance(FastDateFormat.java:175)
	at org.apache.commons.lang3.time.FastDateFormatTest.test_getInstance_String_TimeZone_Locale(FastDateFormatTest.java:169)

test_changeDefault_Locale_DateInstance(org.apache.commons.lang3.time.FastDateFormatTest)  Time elapsed: 0 sec  <<< ERROR!
java.lang.IllegalArgumentException: null
	at org.apache.commons.lang3.time.FastDatePrinter$PaddedNumberField.<init>(FastDatePrinter.java:213)
	at org.apache.commons.lang3.time.FastDatePrinter.selectNumberRule(FastDatePrinter.java:142)
	at org.apache.commons.lang3.time.FastDatePrinter.parsePattern(FastDatePrinter.java:67)
	at org.apache.commons.lang3.time.FastDatePrinter.init(FastDatePrinter.java:38)
	at org.apache.commons.lang3.time.FastDatePrinter.<init>(FastDatePrinter.java:37)
	at org.apache.commons.lang3.time.FastDateFormat.<init>(FastDateFormat.java:394)
	at org.apache.commons.lang3.time.FastDateFormat.<init>(FastDateFormat.java:379)
	at org.apache.commons.lang3.time.FastDateFormat$1.createInstance(FastDateFormat.java:101)
	at org.apache.commons.lang3.time.FastDateFormat$1.createInstance(FastDateFormat.java:98)
	at org.apache.commons.lang3.time.FormatCache.getInstance(FormatCache.java:82)
	at org.apache.commons.lang3.time.FormatCache.getDateTimeInstance(FormatCache.java:125)
	at org.apache.commons.lang3.time.FormatCache.getDateInstance(FormatCache.java:160)
	at org.apache.commons.lang3.time.FastDateFormat.getDateInstance(FastDateFormat.java:205)
	at org.apache.commons.lang3.time.FastDateFormatTest.test_changeDefault_Locale_DateInstance(FastDateFormatTest.java:124)

testTimeDateDefaults(org.apache.commons.lang3.time.FastDateFormatTest)  Time elapsed: 0 sec  <<< ERROR!
java.lang.IllegalArgumentException: null
	at org.apache.commons.lang3.time.FastDatePrinter$PaddedNumberField.<init>(FastDatePrinter.java:213)
	at org.apache.commons.lang3.time.FastDatePrinter.selectNumberRule(FastDatePrinter.java:142)
	at org.apache.commons.lang3.time.FastDatePrinter.parsePattern(FastDatePrinter.java:67)
	at org.apache.commons.lang3.time.FastDatePrinter.init(FastDatePrinter.java:38)
	at org.apache.commons.lang3.time.FastDatePrinter.<init>(FastDatePrinter.java:37)
	at org.apache.commons.lang3.time.FastDateFormat.<init>(FastDateFormat.java:394)
	at org.apache.commons.lang3.time.FastDateFormat.<init>(FastDateFormat.java:379)
	at org.apache.commons.lang3.time.FastDateFormat$1.createInstance(FastDateFormat.java:101)
	at org.apache.commons.lang3.time.FastDateFormat$1.createInstance(FastDateFormat.java:98)
	at org.apache.commons.lang3.time.FormatCache.getInstance(FormatCache.java:82)
	at org.apache.commons.lang3.time.FormatCache.getDateTimeInstance(FormatCache.java:125)
	at org.apache.commons.lang3.time.FormatCache.getDateTimeInstance(FormatCache.java:143)
	at org.apache.commons.lang3.time.FastDateFormat.getDateTimeInstance(FastDateFormat.java:331)
	at org.apache.commons.lang3.time.FastDateFormatTest.testTimeDateDefaults(FastDateFormatTest.java:243)

test_getInstance_String(org.apache.commons.lang3.time.FastDateFormatTest)  Time elapsed: 0 sec  <<< ERROR!
java.lang.IllegalArgumentException: null
	at org.apache.commons.lang3.time.FastDatePrinter$PaddedNumberField.<init>(FastDatePrinter.java:213)
	at org.apache.commons.lang3.time.FastDatePrinter.selectNumberRule(FastDatePrinter.java:142)
	at org.apache.commons.lang3.time.FastDatePrinter.parsePattern(FastDatePrinter.java:67)
	at org.apache.commons.lang3.time.FastDatePrinter.init(FastDatePrinter.java:38)
	at org.apache.commons.lang3.time.FastDatePrinter.<init>(FastDatePrinter.java:37)
	at org.apache.commons.lang3.time.FastDateFormat.<init>(FastDateFormat.java:394)
	at org.apache.commons.lang3.time.FastDateFormat.<init>(FastDateFormat.java:379)
	at org.apache.commons.lang3.time.FastDateFormat$1.createInstance(FastDateFormat.java:101)
	at org.apache.commons.lang3.time.FastDateFormat$1.createInstance(FastDateFormat.java:98)
	at org.apache.commons.lang3.time.FormatCache.getInstance(FormatCache.java:82)
	at org.apache.commons.lang3.time.FastDateFormat.getInstance(FastDateFormat.java:129)
	at org.apache.commons.lang3.time.FastDateFormatTest.test_getInstance_String(FastDateFormatTest.java:61)

testDateDefaults(org.apache.commons.lang3.time.FastDateFormatTest)  Time elapsed: 0 sec  <<< ERROR!
java.lang.IllegalArgumentException: null
	at org.apache.commons.lang3.time.FastDatePrinter$PaddedNumberField.<init>(FastDatePrinter.java:213)
	at org.apache.commons.lang3.time.FastDatePrinter.selectNumberRule(FastDatePrinter.java:142)
	at org.apache.commons.lang3.time.FastDatePrinter.parsePattern(FastDatePrinter.java:67)
	at org.apache.commons.lang3.time.FastDatePrinter.init(FastDatePrinter.java:38)
	at org.apache.commons.lang3.time.FastDatePrinter.<init>(FastDatePrinter.java:37)
	at org.apache.commons.lang3.time.FastDateFormat.<init>(FastDateFormat.java:394)
	at org.apache.commons.lang3.time.FastDateFormat.<init>(FastDateFormat.java:379)
	at org.apache.commons.lang3.time.FastDateFormat$1.createInstance(FastDateFormat.java:101)
	at org.apache.commons.lang3.time.FastDateFormat$1.createInstance(FastDateFormat.java:98)
	at org.apache.commons.lang3.time.FormatCache.getInstance(FormatCache.java:82)
	at org.apache.commons.lang3.time.FormatCache.getDateTimeInstance(FormatCache.java:125)
	at org.apache.commons.lang3.time.FormatCache.getDateInstance(FormatCache.java:160)
	at org.apache.commons.lang3.time.FastDateFormat.getDateInstance(FastDateFormat.java:205)
	at org.apache.commons.lang3.time.FastDateFormatTest.testDateDefaults(FastDateFormatTest.java:219)

testCheckDifferingStyles(org.apache.commons.lang3.time.FastDateFormatTest)  Time elapsed: 0 sec  <<< ERROR!
java.lang.IllegalArgumentException: null
	at org.apache.commons.lang3.time.FastDatePrinter$PaddedNumberField.<init>(FastDatePrinter.java:213)
	at org.apache.commons.lang3.time.FastDatePrinter.selectNumberRule(FastDatePrinter.java:142)
	at org.apache.commons.lang3.time.FastDatePrinter.parsePattern(FastDatePrinter.java:67)
	at org.apache.commons.lang3.time.FastDatePrinter.init(FastDatePrinter.java:38)
	at org.apache.commons.lang3.time.FastDatePrinter.<init>(FastDatePrinter.java:37)
	at org.apache.commons.lang3.time.FastDateFormat.<init>(FastDateFormat.java:394)
	at org.apache.commons.lang3.time.FastDateFormat.<init>(FastDateFormat.java:379)
	at org.apache.commons.lang3.time.FastDateFormat$1.createInstance(FastDateFormat.java:101)
	at org.apache.commons.lang3.time.FastDateFormat$1.createInstance(FastDateFormat.java:98)
	at org.apache.commons.lang3.time.FormatCache.getInstance(FormatCache.java:82)
	at org.apache.commons.lang3.time.FormatCache.getDateTimeInstance(FormatCache.java:125)
	at org.apache.commons.lang3.time.FormatCache.getDateTimeInstance(FormatCache.java:143)
	at org.apache.commons.lang3.time.FastDateFormat.getDateTimeInstance(FastDateFormat.java:331)
	at org.apache.commons.lang3.time.FastDateFormatTest.testCheckDifferingStyles(FastDateFormatTest.java:206)

test_getInstance_String_TimeZone(org.apache.commons.lang3.time.FastDateFormatTest)  Time elapsed: 0 sec  <<< ERROR!
java.lang.IllegalArgumentException: null
	at org.apache.commons.lang3.time.FastDatePrinter$PaddedNumberField.<init>(FastDatePrinter.java:213)
	at org.apache.commons.lang3.time.FastDatePrinter.selectNumberRule(FastDatePrinter.java:142)
	at org.apache.commons.lang3.time.FastDatePrinter.parsePattern(FastDatePrinter.java:67)
	at org.apache.commons.lang3.time.FastDatePrinter.init(FastDatePrinter.java:38)
	at org.apache.commons.lang3.time.FastDatePrinter.<init>(FastDatePrinter.java:37)
	at org.apache.commons.lang3.time.FastDateFormat.<init>(FastDateFormat.java:394)
	at org.apache.commons.lang3.time.FastDateFormat.<init>(FastDateFormat.java:379)
	at org.apache.commons.lang3.time.FastDateFormat$1.createInstance(FastDateFormat.java:101)
	at org.apache.commons.lang3.time.FastDateFormat$1.createInstance(FastDateFormat.java:98)
	at org.apache.commons.lang3.time.FormatCache.getInstance(FormatCache.java:82)
	at org.apache.commons.lang3.time.FastDateFormat.getInstance(FastDateFormat.java:144)
	at org.apache.commons.lang3.time.FastDateFormatTest.test_getInstance_String_TimeZone(FastDateFormatTest.java:80)

test_getInstance_String_Locale(org.apache.commons.lang3.time.FastDateFormatTest)  Time elapsed: 0 sec  <<< ERROR!
java.lang.IllegalArgumentException: null
	at org.apache.commons.lang3.time.FastDatePrinter$PaddedNumberField.<init>(FastDatePrinter.java:213)
	at org.apache.commons.lang3.time.FastDatePrinter.selectNumberRule(FastDatePrinter.java:142)
	at org.apache.commons.lang3.time.FastDatePrinter.parsePattern(FastDatePrinter.java:67)
	at org.apache.commons.lang3.time.FastDatePrinter.init(FastDatePrinter.java:38)
	at org.apache.commons.lang3.time.FastDatePrinter.<init>(FastDatePrinter.java:37)
	at org.apache.commons.lang3.time.FastDateFormat.<init>(FastDateFormat.java:394)
	at org.apache.commons.lang3.time.FastDateFormat.<init>(FastDateFormat.java:379)
	at org.apache.commons.lang3.time.FastDateFormat$1.createInstance(FastDateFormat.java:101)
	at org.apache.commons.lang3.time.FastDateFormat$1.createInstance(FastDateFormat.java:98)
	at org.apache.commons.lang3.time.FormatCache.getInstance(FormatCache.java:82)
	at org.apache.commons.lang3.time.FastDateFormat.getInstance(FastDateFormat.java:158)
	at org.apache.commons.lang3.time.FastDateFormatTest.test_getInstance_String_Locale(FastDateFormatTest.java:106)

test_changeDefault_Locale_DateTimeInstance(org.apache.commons.lang3.time.FastDateFormatTest)  Time elapsed: 0 sec  <<< ERROR!
java.lang.IllegalArgumentException: null
	at org.apache.commons.lang3.time.FastDatePrinter$PaddedNumberField.<init>(FastDatePrinter.java:213)
	at org.apache.commons.lang3.time.FastDatePrinter.selectNumberRule(FastDatePrinter.java:142)
	at org.apache.commons.lang3.time.FastDatePrinter.parsePattern(FastDatePrinter.java:67)
	at org.apache.commons.lang3.time.FastDatePrinter.init(FastDatePrinter.java:38)
	at org.apache.commons.lang3.time.FastDatePrinter.<init>(FastDatePrinter.java:37)
	at org.apache.commons.lang3.time.FastDateFormat.<init>(FastDateFormat.java:394)
	at org.apache.commons.lang3.time.FastDateFormat.<init>(FastDateFormat.java:379)
	at org.apache.commons.lang3.time.FastDateFormat$1.createInstance(FastDateFormat.java:101)
	at org.apache.commons.lang3.time.FastDateFormat$1.createInstance(FastDateFormat.java:98)
	at org.apache.commons.lang3.time.FormatCache.getInstance(FormatCache.java:82)
	at org.apache.commons.lang3.time.FormatCache.getDateTimeInstance(FormatCache.java:125)
	at org.apache.commons.lang3.time.FormatCache.getDateTimeInstance(FormatCache.java:143)
	at org.apache.commons.lang3.time.FastDateFormat.getDateTimeInstance(FastDateFormat.java:331)
	at org.apache.commons.lang3.time.FastDateFormatTest.test_changeDefault_Locale_DateTimeInstance(FastDateFormatTest.java:145)

Running org.apache.commons.lang3.time.FastDateFormat_PrinterTest
Tests run: 17, Failures: 0, Errors: 13, Skipped: 0, Time elapsed: 0.001 sec <<< FAILURE! - in org.apache.commons.lang3.time.FastDateFormat_PrinterTest
testSimpleDate(org.apache.commons.lang3.time.FastDateFormat_PrinterTest)  Time elapsed: 0 sec  <<< ERROR!
java.lang.IllegalArgumentException: null
	at org.apache.commons.lang3.time.FastDatePrinter$PaddedNumberField.<init>(FastDatePrinter.java:213)
	at org.apache.commons.lang3.time.FastDatePrinter.selectNumberRule(FastDatePrinter.java:142)
	at org.apache.commons.lang3.time.FastDatePrinter.parsePattern(FastDatePrinter.java:67)
	at org.apache.commons.lang3.time.FastDatePrinter.init(FastDatePrinter.java:38)
	at org.apache.commons.lang3.time.FastDatePrinter.<init>(FastDatePrinter.java:37)
	at org.apache.commons.lang3.time.FastDateFormat.<init>(FastDateFormat.java:394)
	at org.apache.commons.lang3.time.FastDateFormat.<init>(FastDateFormat.java:379)
	at org.apache.commons.lang3.time.FastDateFormat$1.createInstance(FastDateFormat.java:101)
	at org.apache.commons.lang3.time.FastDateFormat$1.createInstance(FastDateFormat.java:98)
	at org.apache.commons.lang3.time.FormatCache.getInstance(FormatCache.java:82)
	at org.apache.commons.lang3.time.FastDateFormat.getInstance(FastDateFormat.java:175)
	at org.apache.commons.lang3.time.FastDateFormat_PrinterTest.getInstance(FastDateFormat_PrinterTest.java:31)

testShortDateStyleWithLocales(org.apache.commons.lang3.time.FastDateFormat_PrinterTest)  Time elapsed: 0 sec  <<< ERROR!
java.lang.IllegalArgumentException: null
	at org.apache.commons.lang3.time.FastDatePrinter$PaddedNumberField.<init>(FastDatePrinter.java:213)
	at org.apache.commons.lang3.time.FastDatePrinter.selectNumberRule(FastDatePrinter.java:142)
	at org.apache.commons.lang3.time.FastDatePrinter.parsePattern(FastDatePrinter.java:67)
	at org.apache.commons.lang3.time.FastDatePrinter.init(FastDatePrinter.java:38)
	at org.apache.commons.lang3.time.FastDatePrinter.<init>(FastDatePrinter.java:37)
	at org.apache.commons.lang3.time.FastDateFormat.<init>(FastDateFormat.java:394)
	at org.apache.commons.lang3.time.FastDateFormat.<init>(FastDateFormat.java:379)
	at org.apache.commons.lang3.time.FastDateFormat$1.createInstance(FastDateFormat.java:101)
	at org.apache.commons.lang3.time.FastDateFormat$1.createInstance(FastDateFormat.java:98)
	at org.apache.commons.lang3.time.FormatCache.getInstance(FormatCache.java:82)
	at org.apache.commons.lang3.time.FastDateFormat.getInstance(FastDateFormat.java:175)
	at org.apache.commons.lang3.time.FastDateFormat_PrinterTest.getInstance(FastDateFormat_PrinterTest.java:31)

testMilleniumBug(org.apache.commons.lang3.time.FastDateFormat_PrinterTest)  Time elapsed: 0 sec  <<< ERROR!
java.lang.IllegalArgumentException: null
	at org.apache.commons.lang3.time.FastDatePrinter$PaddedNumberField.<init>(FastDatePrinter.java:213)
	at org.apache.commons.lang3.time.FastDatePrinter.selectNumberRule(FastDatePrinter.java:142)
	at org.apache.commons.lang3.time.FastDatePrinter.parsePattern(FastDatePrinter.java:67)
	at org.apache.commons.lang3.time.FastDatePrinter.init(FastDatePrinter.java:38)
	at org.apache.commons.lang3.time.FastDatePrinter.<init>(FastDatePrinter.java:37)
	at org.apache.commons.lang3.time.FastDateFormat.<init>(FastDateFormat.java:394)
	at org.apache.commons.lang3.time.FastDateFormat.<init>(FastDateFormat.java:379)
	at org.apache.commons.lang3.time.FastDateFormat$1.createInstance(FastDateFormat.java:101)
	at org.apache.commons.lang3.time.FastDateFormat$1.createInstance(FastDateFormat.java:98)
	at org.apache.commons.lang3.time.FormatCache.getInstance(FormatCache.java:82)
	at org.apache.commons.lang3.time.FastDateFormat.getInstance(FastDateFormat.java:175)
	at org.apache.commons.lang3.time.FastDateFormat_PrinterTest.getInstance(FastDateFormat_PrinterTest.java:31)

testLocaleMatches(org.apache.commons.lang3.time.FastDateFormat_PrinterTest)  Time elapsed: 0 sec  <<< ERROR!
java.lang.IllegalArgumentException: null
	at org.apache.commons.lang3.time.FastDatePrinter$PaddedNumberField.<init>(FastDatePrinter.java:213)
	at org.apache.commons.lang3.time.FastDatePrinter.selectNumberRule(FastDatePrinter.java:142)
	at org.apache.commons.lang3.time.FastDatePrinter.parsePattern(FastDatePrinter.java:67)
	at org.apache.commons.lang3.time.FastDatePrinter.init(FastDatePrinter.java:38)
	at org.apache.commons.lang3.time.FastDatePrinter.<init>(FastDatePrinter.java:37)
	at org.apache.commons.lang3.time.FastDateFormat.<init>(FastDateFormat.java:394)
	at org.apache.commons.lang3.time.FastDateFormat.<init>(FastDateFormat.java:379)
	at org.apache.commons.lang3.time.FastDateFormat$1.createInstance(FastDateFormat.java:101)
	at org.apache.commons.lang3.time.FastDateFormat$1.createInstance(FastDateFormat.java:98)
	at org.apache.commons.lang3.time.FormatCache.getInstance(FormatCache.java:82)
	at org.apache.commons.lang3.time.FastDateFormat.getInstance(FastDateFormat.java:175)
	at org.apache.commons.lang3.time.FastDateFormat_PrinterTest.getInstance(FastDateFormat_PrinterTest.java:31)

testLowYearPadding(org.apache.commons.lang3.time.FastDateFormat_PrinterTest)  Time elapsed: 0 sec  <<< ERROR!
java.lang.IllegalArgumentException: null
	at org.apache.commons.lang3.time.FastDatePrinter$PaddedNumberField.<init>(FastDatePrinter.java:213)
	at org.apache.commons.lang3.time.FastDatePrinter.selectNumberRule(FastDatePrinter.java:142)
	at org.apache.commons.lang3.time.FastDatePrinter.parsePattern(FastDatePrinter.java:67)
	at org.apache.commons.lang3.time.FastDatePrinter.init(FastDatePrinter.java:38)
	at org.apache.commons.lang3.time.FastDatePrinter.<init>(FastDatePrinter.java:37)
	at org.apache.commons.lang3.time.FastDateFormat.<init>(FastDateFormat.java:394)
	at org.apache.commons.lang3.time.FastDateFormat.<init>(FastDateFormat.java:379)
	at org.apache.commons.lang3.time.FastDateFormat$1.createInstance(FastDateFormat.java:101)
	at org.apache.commons.lang3.time.FastDateFormat$1.createInstance(FastDateFormat.java:98)
	at org.apache.commons.lang3.time.FormatCache.getInstance(FormatCache.java:82)
	at org.apache.commons.lang3.time.FastDateFormat.getInstance(FastDateFormat.java:175)
	at org.apache.commons.lang3.time.FastDateFormat_PrinterTest.getInstance(FastDateFormat_PrinterTest.java:31)

testLang1103(org.apache.commons.lang3.time.FastDateFormat_PrinterTest)  Time elapsed: 0 sec  <<< ERROR!
java.lang.IllegalArgumentException: null
	at org.apache.commons.lang3.time.FastDatePrinter$PaddedNumberField.<init>(FastDatePrinter.java:213)
	at org.apache.commons.lang3.time.FastDatePrinter.selectNumberRule(FastDatePrinter.java:142)
	at org.apache.commons.lang3.time.FastDatePrinter.parsePattern(FastDatePrinter.java:74)
	at org.apache.commons.lang3.time.FastDatePrinter.init(FastDatePrinter.java:38)
	at org.apache.commons.lang3.time.FastDatePrinter.<init>(FastDatePrinter.java:37)
	at org.apache.commons.lang3.time.FastDateFormat.<init>(FastDateFormat.java:394)
	at org.apache.commons.lang3.time.FastDateFormat.<init>(FastDateFormat.java:379)
	at org.apache.commons.lang3.time.FastDateFormat$1.createInstance(FastDateFormat.java:101)
	at org.apache.commons.lang3.time.FastDateFormat$1.createInstance(FastDateFormat.java:98)
	at org.apache.commons.lang3.time.FormatCache.getInstance(FormatCache.java:82)
	at org.apache.commons.lang3.time.FastDateFormat.getInstance(FastDateFormat.java:175)
	at org.apache.commons.lang3.time.FastDateFormat_PrinterTest.getInstance(FastDateFormat_PrinterTest.java:31)

testLang303(org.apache.commons.lang3.time.FastDateFormat_PrinterTest)  Time elapsed: 0 sec  <<< ERROR!
java.lang.IllegalArgumentException: null
	at org.apache.commons.lang3.time.FastDatePrinter$PaddedNumberField.<init>(FastDatePrinter.java:213)
	at org.apache.commons.lang3.time.FastDatePrinter.selectNumberRule(FastDatePrinter.java:142)
	at org.apache.commons.lang3.time.FastDatePrinter.parsePattern(FastDatePrinter.java:67)
	at org.apache.commons.lang3.time.FastDatePrinter.init(FastDatePrinter.java:38)
	at org.apache.commons.lang3.time.FastDatePrinter.<init>(FastDatePrinter.java:37)
	at org.apache.commons.lang3.time.FastDateFormat.<init>(FastDateFormat.java:394)
	at org.apache.commons.lang3.time.FastDateFormat.<init>(FastDateFormat.java:379)
	at org.apache.commons.lang3.time.FastDateFormat$1.createInstance(FastDateFormat.java:101)
	at org.apache.commons.lang3.time.FastDateFormat$1.createInstance(FastDateFormat.java:98)
	at org.apache.commons.lang3.time.FormatCache.getInstance(FormatCache.java:82)
	at org.apache.commons.lang3.time.FastDateFormat.getInstance(FastDateFormat.java:175)
	at org.apache.commons.lang3.time.FastDateFormat_PrinterTest.getInstance(FastDateFormat_PrinterTest.java:31)

testLang538(org.apache.commons.lang3.time.FastDateFormat_PrinterTest)  Time elapsed: 0 sec  <<< ERROR!
java.lang.IllegalArgumentException: null
	at org.apache.commons.lang3.time.FastDatePrinter$PaddedNumberField.<init>(FastDatePrinter.java:213)
	at org.apache.commons.lang3.time.FastDatePrinter.selectNumberRule(FastDatePrinter.java:142)
	at org.apache.commons.lang3.time.FastDatePrinter.parsePattern(FastDatePrinter.java:67)
	at org.apache.commons.lang3.time.FastDatePrinter.init(FastDatePrinter.java:38)
	at org.apache.commons.lang3.time.FastDatePrinter.<init>(FastDatePrinter.java:37)
	at org.apache.commons.lang3.time.FastDateFormat.<init>(FastDateFormat.java:394)
	at org.apache.commons.lang3.time.FastDateFormat.<init>(FastDateFormat.java:379)
	at org.apache.commons.lang3.time.FastDateFormat$1.createInstance(FastDateFormat.java:101)
	at org.apache.commons.lang3.time.FastDateFormat$1.createInstance(FastDateFormat.java:98)
	at org.apache.commons.lang3.time.FormatCache.getInstance(FormatCache.java:82)
	at org.apache.commons.lang3.time.FastDateFormat.getInstance(FastDateFormat.java:175)
	at org.apache.commons.lang3.time.FastDateFormat_PrinterTest.getInstance(FastDateFormat_PrinterTest.java:31)

testToStringContainsName(org.apache.commons.lang3.time.FastDateFormat_PrinterTest)  Time elapsed: 0 sec  <<< ERROR!
java.lang.IllegalArgumentException: null
	at org.apache.commons.lang3.time.FastDatePrinter$PaddedNumberField.<init>(FastDatePrinter.java:213)
	at org.apache.commons.lang3.time.FastDatePrinter.selectNumberRule(FastDatePrinter.java:142)
	at org.apache.commons.lang3.time.FastDatePrinter.parsePattern(FastDatePrinter.java:67)
	at org.apache.commons.lang3.time.FastDatePrinter.init(FastDatePrinter.java:38)
	at org.apache.commons.lang3.time.FastDatePrinter.<init>(FastDatePrinter.java:37)
	at org.apache.commons.lang3.time.FastDateFormat.<init>(FastDateFormat.java:394)
	at org.apache.commons.lang3.time.FastDateFormat.<init>(FastDateFormat.java:379)
	at org.apache.commons.lang3.time.FastDateFormat$1.createInstance(FastDateFormat.java:101)
	at org.apache.commons.lang3.time.FastDateFormat$1.createInstance(FastDateFormat.java:98)
	at org.apache.commons.lang3.time.FormatCache.getInstance(FormatCache.java:82)
	at org.apache.commons.lang3.time.FastDateFormat.getInstance(FastDateFormat.java:175)
	at org.apache.commons.lang3.time.FastDateFormat_PrinterTest.getInstance(FastDateFormat_PrinterTest.java:31)

testEquals(org.apache.commons.lang3.time.FastDateFormat_PrinterTest)  Time elapsed: 0 sec  <<< ERROR!
java.lang.IllegalArgumentException: null
	at org.apache.commons.lang3.time.FastDatePrinter$PaddedNumberField.<init>(FastDatePrinter.java:213)
	at org.apache.commons.lang3.time.FastDatePrinter.selectNumberRule(FastDatePrinter.java:142)
	at org.apache.commons.lang3.time.FastDatePrinter.parsePattern(FastDatePrinter.java:67)
	at org.apache.commons.lang3.time.FastDatePrinter.init(FastDatePrinter.java:38)
	at org.apache.commons.lang3.time.FastDatePrinter.<init>(FastDatePrinter.java:37)
	at org.apache.commons.lang3.time.FastDateFormat.<init>(FastDateFormat.java:394)
	at org.apache.commons.lang3.time.FastDateFormat.<init>(FastDateFormat.java:379)
	at org.apache.commons.lang3.time.FastDateFormat$1.createInstance(FastDateFormat.java:101)
	at org.apache.commons.lang3.time.FastDateFormat$1.createInstance(FastDateFormat.java:98)
	at org.apache.commons.lang3.time.FormatCache.getInstance(FormatCache.java:82)
	at org.apache.commons.lang3.time.FastDateFormat.getInstance(FastDateFormat.java:175)
	at org.apache.commons.lang3.time.FastDateFormat_PrinterTest.getInstance(FastDateFormat_PrinterTest.java:31)

testFormat(org.apache.commons.lang3.time.FastDateFormat_PrinterTest)  Time elapsed: 0 sec  <<< ERROR!
java.lang.IllegalArgumentException: null
	at org.apache.commons.lang3.time.FastDatePrinter$PaddedNumberField.<init>(FastDatePrinter.java:213)
	at org.apache.commons.lang3.time.FastDatePrinter.selectNumberRule(FastDatePrinter.java:142)
	at org.apache.commons.lang3.time.FastDatePrinter.parsePattern(FastDatePrinter.java:67)
	at org.apache.commons.lang3.time.FastDatePrinter.init(FastDatePrinter.java:38)
	at org.apache.commons.lang3.time.FastDatePrinter.<init>(FastDatePrinter.java:37)
	at org.apache.commons.lang3.time.FastDateFormat.<init>(FastDateFormat.java:394)
	at org.apache.commons.lang3.time.FastDateFormat.<init>(FastDateFormat.java:379)
	at org.apache.commons.lang3.time.FastDateFormat$1.createInstance(FastDateFormat.java:101)
	at org.apache.commons.lang3.time.FastDateFormat$1.createInstance(FastDateFormat.java:98)
	at org.apache.commons.lang3.time.FormatCache.getInstance(FormatCache.java:82)
	at org.apache.commons.lang3.time.FastDateFormat.getInstance(FastDateFormat.java:175)
	at org.apache.commons.lang3.time.FastDateFormat_PrinterTest.getInstance(FastDateFormat_PrinterTest.java:31)

testTimeZoneMatches(org.apache.commons.lang3.time.FastDateFormat_PrinterTest)  Time elapsed: 0 sec  <<< ERROR!
java.lang.IllegalArgumentException: null
	at org.apache.commons.lang3.time.FastDatePrinter$PaddedNumberField.<init>(FastDatePrinter.java:213)
	at org.apache.commons.lang3.time.FastDatePrinter.selectNumberRule(FastDatePrinter.java:142)
	at org.apache.commons.lang3.time.FastDatePrinter.parsePattern(FastDatePrinter.java:67)
	at org.apache.commons.lang3.time.FastDatePrinter.init(FastDatePrinter.java:38)
	at org.apache.commons.lang3.time.FastDatePrinter.<init>(FastDatePrinter.java:37)
	at org.apache.commons.lang3.time.FastDateFormat.<init>(FastDateFormat.java:394)
	at org.apache.commons.lang3.time.FastDateFormat.<init>(FastDateFormat.java:379)
	at org.apache.commons.lang3.time.FastDateFormat$1.createInstance(FastDateFormat.java:101)
	at org.apache.commons.lang3.time.FastDateFormat$1.createInstance(FastDateFormat.java:98)
	at org.apache.commons.lang3.time.FormatCache.getInstance(FormatCache.java:82)
	at org.apache.commons.lang3.time.FastDateFormat.getInstance(FastDateFormat.java:175)
	at org.apache.commons.lang3.time.FastDateFormat_PrinterTest.getInstance(FastDateFormat_PrinterTest.java:31)

testPatternMatches(org.apache.commons.lang3.time.FastDateFormat_PrinterTest)  Time elapsed: 0 sec  <<< ERROR!
java.lang.IllegalArgumentException: null
	at org.apache.commons.lang3.time.FastDatePrinter$PaddedNumberField.<init>(FastDatePrinter.java:213)
	at org.apache.commons.lang3.time.FastDatePrinter.selectNumberRule(FastDatePrinter.java:142)
	at org.apache.commons.lang3.time.FastDatePrinter.parsePattern(FastDatePrinter.java:67)
	at org.apache.commons.lang3.time.FastDatePrinter.init(FastDatePrinter.java:38)
	at org.apache.commons.lang3.time.FastDatePrinter.<init>(FastDatePrinter.java:37)
	at org.apache.commons.lang3.time.FastDateFormat.<init>(FastDateFormat.java:394)
	at org.apache.commons.lang3.time.FastDateFormat.<init>(FastDateFormat.java:379)
	at org.apache.commons.lang3.time.FastDateFormat$1.createInstance(FastDateFormat.java:101)
	at org.apache.commons.lang3.time.FastDateFormat$1.createInstance(FastDateFormat.java:98)
	at org.apache.commons.lang3.time.FormatCache.getInstance(FormatCache.java:82)
	at org.apache.commons.lang3.time.FastDateFormat.getInstance(FastDateFormat.java:175)
	at org.apache.commons.lang3.time.FastDateFormat_PrinterTest.getInstance(FastDateFormat_PrinterTest.java:31)

Running org.apache.commons.lang3.time.FastDatePrinterTest
Tests run: 17, Failures: 0, Errors: 13, Skipped: 0, Time elapsed: 0.001 sec <<< FAILURE! - in org.apache.commons.lang3.time.FastDatePrinterTest
testSimpleDate(org.apache.commons.lang3.time.FastDatePrinterTest)  Time elapsed: 0 sec  <<< ERROR!
java.lang.IllegalArgumentException: null
	at org.apache.commons.lang3.time.FastDatePrinter$PaddedNumberField.<init>(FastDatePrinter.java:213)
	at org.apache.commons.lang3.time.FastDatePrinter.selectNumberRule(FastDatePrinter.java:142)
	at org.apache.commons.lang3.time.FastDatePrinter.parsePattern(FastDatePrinter.java:67)
	at org.apache.commons.lang3.time.FastDatePrinter.init(FastDatePrinter.java:38)
	at org.apache.commons.lang3.time.FastDatePrinter.<init>(FastDatePrinter.java:37)
	at org.apache.commons.lang3.time.FastDatePrinterTest.getInstance(FastDatePrinterTest.java:71)
	at org.apache.commons.lang3.time.FastDatePrinterTest.getInstance(FastDatePrinterTest.java:48)
	at org.apache.commons.lang3.time.FastDatePrinterTest.testSimpleDate(FastDatePrinterTest.java:183)

testShortDateStyleWithLocales(org.apache.commons.lang3.time.FastDatePrinterTest)  Time elapsed: 0 sec  <<< ERROR!
java.lang.IllegalArgumentException: null
	at org.apache.commons.lang3.time.FastDatePrinter$PaddedNumberField.<init>(FastDatePrinter.java:213)
	at org.apache.commons.lang3.time.FastDatePrinter.selectNumberRule(FastDatePrinter.java:142)
	at org.apache.commons.lang3.time.FastDatePrinter.parsePattern(FastDatePrinter.java:67)
	at org.apache.commons.lang3.time.FastDatePrinter.init(FastDatePrinter.java:38)
	at org.apache.commons.lang3.time.FastDatePrinter.<init>(FastDatePrinter.java:37)
	at org.apache.commons.lang3.time.FastDatePrinterTest.getInstance(FastDatePrinterTest.java:71)
	at org.apache.commons.lang3.time.FastDatePrinterTest.getDateInstance(FastDatePrinterTest.java:52)
	at org.apache.commons.lang3.time.FastDatePrinterTest.testShortDateStyleWithLocales(FastDatePrinterTest.java:142)

testMilleniumBug(org.apache.commons.lang3.time.FastDatePrinterTest)  Time elapsed: 0 sec  <<< ERROR!
java.lang.IllegalArgumentException: null
	at org.apache.commons.lang3.time.FastDatePrinter$PaddedNumberField.<init>(FastDatePrinter.java:213)
	at org.apache.commons.lang3.time.FastDatePrinter.selectNumberRule(FastDatePrinter.java:142)
	at org.apache.commons.lang3.time.FastDatePrinter.parsePattern(FastDatePrinter.java:67)
	at org.apache.commons.lang3.time.FastDatePrinter.init(FastDatePrinter.java:38)
	at org.apache.commons.lang3.time.FastDatePrinter.<init>(FastDatePrinter.java:37)
	at org.apache.commons.lang3.time.FastDatePrinterTest.getInstance(FastDatePrinterTest.java:71)
	at org.apache.commons.lang3.time.FastDatePrinterTest.getInstance(FastDatePrinterTest.java:48)
	at org.apache.commons.lang3.time.FastDatePrinterTest.testMilleniumBug(FastDatePrinterTest.java:170)

testLocaleMatches(org.apache.commons.lang3.time.FastDatePrinterTest)  Time elapsed: 0 sec  <<< ERROR!
java.lang.IllegalArgumentException: null
	at org.apache.commons.lang3.time.FastDatePrinter$PaddedNumberField.<init>(FastDatePrinter.java:213)
	at org.apache.commons.lang3.time.FastDatePrinter.selectNumberRule(FastDatePrinter.java:142)
	at org.apache.commons.lang3.time.FastDatePrinter.parsePattern(FastDatePrinter.java:67)
	at org.apache.commons.lang3.time.FastDatePrinter.init(FastDatePrinter.java:38)
	at org.apache.commons.lang3.time.FastDatePrinter.<init>(FastDatePrinter.java:37)
	at org.apache.commons.lang3.time.FastDatePrinterTest.getInstance(FastDatePrinterTest.java:71)
	at org.apache.commons.lang3.time.FastDatePrinterTest.getInstance(FastDatePrinterTest.java:56)
	at org.apache.commons.lang3.time.FastDatePrinterTest.testLocaleMatches(FastDatePrinterTest.java:256)

testLowYearPadding(org.apache.commons.lang3.time.FastDatePrinterTest)  Time elapsed: 0 sec  <<< ERROR!
java.lang.IllegalArgumentException: null
	at org.apache.commons.lang3.time.FastDatePrinter$PaddedNumberField.<init>(FastDatePrinter.java:213)
	at org.apache.commons.lang3.time.FastDatePrinter.selectNumberRule(FastDatePrinter.java:142)
	at org.apache.commons.lang3.time.FastDatePrinter.parsePattern(FastDatePrinter.java:67)
	at org.apache.commons.lang3.time.FastDatePrinter.init(FastDatePrinter.java:38)
	at org.apache.commons.lang3.time.FastDatePrinter.<init>(FastDatePrinter.java:37)
	at org.apache.commons.lang3.time.FastDatePrinterTest.getInstance(FastDatePrinterTest.java:71)
	at org.apache.commons.lang3.time.FastDatePrinterTest.getInstance(FastDatePrinterTest.java:48)
	at org.apache.commons.lang3.time.FastDatePrinterTest.testLowYearPadding(FastDatePrinterTest.java:153)

testLang1103(org.apache.commons.lang3.time.FastDatePrinterTest)  Time elapsed: 0.001 sec  <<< ERROR!
java.lang.IllegalArgumentException: null
	at org.apache.commons.lang3.time.FastDatePrinter$PaddedNumberField.<init>(FastDatePrinter.java:213)
	at org.apache.commons.lang3.time.FastDatePrinter.selectNumberRule(FastDatePrinter.java:142)
	at org.apache.commons.lang3.time.FastDatePrinter.parsePattern(FastDatePrinter.java:74)
	at org.apache.commons.lang3.time.FastDatePrinter.init(FastDatePrinter.java:38)
	at org.apache.commons.lang3.time.FastDatePrinter.<init>(FastDatePrinter.java:37)
	at org.apache.commons.lang3.time.FastDatePrinterTest.getInstance(FastDatePrinterTest.java:71)
	at org.apache.commons.lang3.time.FastDatePrinterTest.getInstance(FastDatePrinterTest.java:56)
	at org.apache.commons.lang3.time.FastDatePrinterTest.testLang1103(FastDatePrinterTest.java:336)

testLang303(org.apache.commons.lang3.time.FastDatePrinterTest)  Time elapsed: 0 sec  <<< ERROR!
java.lang.IllegalArgumentException: null
	at org.apache.commons.lang3.time.FastDatePrinter$PaddedNumberField.<init>(FastDatePrinter.java:213)
	at org.apache.commons.lang3.time.FastDatePrinter.selectNumberRule(FastDatePrinter.java:142)
	at org.apache.commons.lang3.time.FastDatePrinter.parsePattern(FastDatePrinter.java:67)
	at org.apache.commons.lang3.time.FastDatePrinter.init(FastDatePrinter.java:38)
	at org.apache.commons.lang3.time.FastDatePrinter.<init>(FastDatePrinter.java:37)
	at org.apache.commons.lang3.time.FastDatePrinterTest.getInstance(FastDatePrinterTest.java:71)
	at org.apache.commons.lang3.time.FastDatePrinterTest.getInstance(FastDatePrinterTest.java:48)
	at org.apache.commons.lang3.time.FastDatePrinterTest.testLang303(FastDatePrinterTest.java:198)

testLang538(org.apache.commons.lang3.time.FastDatePrinterTest)  Time elapsed: 0 sec  <<< ERROR!
java.lang.IllegalArgumentException: null
	at org.apache.commons.lang3.time.FastDatePrinter$PaddedNumberField.<init>(FastDatePrinter.java:213)
	at org.apache.commons.lang3.time.FastDatePrinter.selectNumberRule(FastDatePrinter.java:142)
	at org.apache.commons.lang3.time.FastDatePrinter.parsePattern(FastDatePrinter.java:67)
	at org.apache.commons.lang3.time.FastDatePrinter.init(FastDatePrinter.java:38)
	at org.apache.commons.lang3.time.FastDatePrinter.<init>(FastDatePrinter.java:37)
	at org.apache.commons.lang3.time.FastDatePrinterTest.getInstance(FastDatePrinterTest.java:71)
	at org.apache.commons.lang3.time.FastDatePrinterTest.getInstance(FastDatePrinterTest.java:60)
	at org.apache.commons.lang3.time.FastDatePrinterTest.testLang538(FastDatePrinterTest.java:213)

testToStringContainsName(org.apache.commons.lang3.time.FastDatePrinterTest)  Time elapsed: 0 sec  <<< ERROR!
java.lang.IllegalArgumentException: null
	at org.apache.commons.lang3.time.FastDatePrinter$PaddedNumberField.<init>(FastDatePrinter.java:213)
	at org.apache.commons.lang3.time.FastDatePrinter.selectNumberRule(FastDatePrinter.java:142)
	at org.apache.commons.lang3.time.FastDatePrinter.parsePattern(FastDatePrinter.java:67)
	at org.apache.commons.lang3.time.FastDatePrinter.init(FastDatePrinter.java:38)
	at org.apache.commons.lang3.time.FastDatePrinter.<init>(FastDatePrinter.java:37)
	at org.apache.commons.lang3.time.FastDatePrinterTest.getInstance(FastDatePrinterTest.java:71)
	at org.apache.commons.lang3.time.FastDatePrinterTest.getInstance(FastDatePrinterTest.java:48)
	at org.apache.commons.lang3.time.FastDatePrinterTest.testToStringContainsName(FastDatePrinterTest.java:244)

testEquals(org.apache.commons.lang3.time.FastDatePrinterTest)  Time elapsed: 0 sec  <<< ERROR!
java.lang.IllegalArgumentException: null
	at org.apache.commons.lang3.time.FastDatePrinter$PaddedNumberField.<init>(FastDatePrinter.java:213)
	at org.apache.commons.lang3.time.FastDatePrinter.selectNumberRule(FastDatePrinter.java:142)
	at org.apache.commons.lang3.time.FastDatePrinter.parsePattern(FastDatePrinter.java:67)
	at org.apache.commons.lang3.time.FastDatePrinter.init(FastDatePrinter.java:38)
	at org.apache.commons.lang3.time.FastDatePrinter.<init>(FastDatePrinter.java:37)
	at org.apache.commons.lang3.time.FastDatePrinterTest.getInstance(FastDatePrinterTest.java:71)
	at org.apache.commons.lang3.time.FastDatePrinterTest.getInstance(FastDatePrinterTest.java:48)
	at org.apache.commons.lang3.time.FastDatePrinterTest.testEquals(FastDatePrinterTest.java:233)

testFormat(org.apache.commons.lang3.time.FastDatePrinterTest)  Time elapsed: 0 sec  <<< ERROR!
java.lang.IllegalArgumentException: null
	at org.apache.commons.lang3.time.FastDatePrinter$PaddedNumberField.<init>(FastDatePrinter.java:213)
	at org.apache.commons.lang3.time.FastDatePrinter.selectNumberRule(FastDatePrinter.java:142)
	at org.apache.commons.lang3.time.FastDatePrinter.parsePattern(FastDatePrinter.java:67)
	at org.apache.commons.lang3.time.FastDatePrinter.init(FastDatePrinter.java:38)
	at org.apache.commons.lang3.time.FastDatePrinter.<init>(FastDatePrinter.java:37)
	at org.apache.commons.lang3.time.FastDatePrinterTest.getInstance(FastDatePrinterTest.java:71)
	at org.apache.commons.lang3.time.FastDatePrinterTest.getInstance(FastDatePrinterTest.java:48)
	at org.apache.commons.lang3.time.FastDatePrinterTest.testFormat(FastDatePrinterTest.java:89)

testTimeZoneMatches(org.apache.commons.lang3.time.FastDatePrinterTest)  Time elapsed: 0 sec  <<< ERROR!
java.lang.IllegalArgumentException: null
	at org.apache.commons.lang3.time.FastDatePrinter$PaddedNumberField.<init>(FastDatePrinter.java:213)
	at org.apache.commons.lang3.time.FastDatePrinter.selectNumberRule(FastDatePrinter.java:142)
	at org.apache.commons.lang3.time.FastDatePrinter.parsePattern(FastDatePrinter.java:67)
	at org.apache.commons.lang3.time.FastDatePrinter.init(FastDatePrinter.java:38)
	at org.apache.commons.lang3.time.FastDatePrinter.<init>(FastDatePrinter.java:37)
	at org.apache.commons.lang3.time.FastDatePrinterTest.getInstance(FastDatePrinterTest.java:71)
	at org.apache.commons.lang3.time.FastDatePrinterTest.getInstance(FastDatePrinterTest.java:60)
	at org.apache.commons.lang3.time.FastDatePrinterTest.testTimeZoneMatches(FastDatePrinterTest.java:262)

testPatternMatches(org.apache.commons.lang3.time.FastDatePrinterTest)  Time elapsed: 0 sec  <<< ERROR!
java.lang.IllegalArgumentException: null
	at org.apache.commons.lang3.time.FastDatePrinter$PaddedNumberField.<init>(FastDatePrinter.java:213)
	at org.apache.commons.lang3.time.FastDatePrinter.selectNumberRule(FastDatePrinter.java:142)
	at org.apache.commons.lang3.time.FastDatePrinter.parsePattern(FastDatePrinter.java:67)
	at org.apache.commons.lang3.time.FastDatePrinter.init(FastDatePrinter.java:38)
	at org.apache.commons.lang3.time.FastDatePrinter.<init>(FastDatePrinter.java:37)
	at org.apache.commons.lang3.time.FastDatePrinterTest.getInstance(FastDatePrinterTest.java:71)
	at org.apache.commons.lang3.time.FastDatePrinterTest.getInstance(FastDatePrinterTest.java:48)
	at org.apache.commons.lang3.time.FastDatePrinterTest.testPatternMatches(FastDatePrinterTest.java:250)

Running org.apache.commons.lang3.time.FastDateParserSDFTest
Tests run: 276, Failures: 0, Errors: 0, Skipped: 92, Time elapsed: 0.058 sec - in org.apache.commons.lang3.time.FastDateParserSDFTest
Running org.apache.commons.lang3.time.DateUtilsTest
DateUtilsTest: Default Locale=en_US
Tests run: 38, Failures: 0, Errors: 1, Skipped: 0, Time elapsed: 0.023 sec <<< FAILURE! - in org.apache.commons.lang3.time.DateUtilsTest
testLang530(org.apache.commons.lang3.time.DateUtilsTest)  Time elapsed: 0.001 sec  <<< ERROR!
java.lang.NoClassDefFoundError: Could not initialize class org.apache.commons.lang3.time.DateFormatUtils
	at org.apache.commons.lang3.time.DateUtilsTest.testLang530(DateUtilsTest.java:1222)

Running org.apache.commons.lang3.reflect.InheritanceUtilsTest
Tests run: 9, Failures: 0, Errors: 0, Skipped: 0, Time elapsed: 0.002 sec - in org.apache.commons.lang3.reflect.InheritanceUtilsTest
Running org.apache.commons.lang3.reflect.MethodUtilsTest
Tests run: 23, Failures: 0, Errors: 0, Skipped: 0, Time elapsed: 0.064 sec - in org.apache.commons.lang3.reflect.MethodUtilsTest
Running org.apache.commons.lang3.reflect.ConstructorUtilsTest
Tests run: 7, Failures: 0, Errors: 0, Skipped: 0, Time elapsed: 0.008 sec - in org.apache.commons.lang3.reflect.ConstructorUtilsTest
Running org.apache.commons.lang3.reflect.FieldUtilsTest
Tests run: 64, Failures: 0, Errors: 0, Skipped: 0, Time elapsed: 0.034 sec - in org.apache.commons.lang3.reflect.FieldUtilsTest
Running org.apache.commons.lang3.reflect.TypeLiteralTest
Tests run: 4, Failures: 0, Errors: 0, Skipped: 0, Time elapsed: 0.009 sec - in org.apache.commons.lang3.reflect.TypeLiteralTest
Running org.apache.commons.lang3.reflect.TypeUtilsTest
Tests run: 19, Failures: 0, Errors: 0, Skipped: 0, Time elapsed: 0.035 sec - in org.apache.commons.lang3.reflect.TypeUtilsTest
Running org.apache.commons.lang3.mutable.MutableByteTest
Tests run: 17, Failures: 0, Errors: 0, Skipped: 0, Time elapsed: 0.005 sec - in org.apache.commons.lang3.mutable.MutableByteTest
Running org.apache.commons.lang3.mutable.MutableShortTest
Tests run: 14, Failures: 0, Errors: 0, Skipped: 0, Time elapsed: 0.003 sec - in org.apache.commons.lang3.mutable.MutableShortTest
Running org.apache.commons.lang3.mutable.MutableIntTest
Tests run: 17, Failures: 0, Errors: 0, Skipped: 0, Time elapsed: 0.005 sec - in org.apache.commons.lang3.mutable.MutableIntTest
Running org.apache.commons.lang3.mutable.MutableDoubleTest
Tests run: 18, Failures: 0, Errors: 0, Skipped: 0, Time elapsed: 0.009 sec - in org.apache.commons.lang3.mutable.MutableDoubleTest
Running org.apache.commons.lang3.mutable.MutableFloatTest
Tests run: 18, Failures: 0, Errors: 0, Skipped: 0, Time elapsed: 0.009 sec - in org.apache.commons.lang3.mutable.MutableFloatTest
Running org.apache.commons.lang3.mutable.MutableLongTest
Tests run: 17, Failures: 0, Errors: 0, Skipped: 0, Time elapsed: 0.008 sec - in org.apache.commons.lang3.mutable.MutableLongTest
Running org.apache.commons.lang3.mutable.MutableBooleanTest
Tests run: 9, Failures: 0, Errors: 0, Skipped: 0, Time elapsed: 0.006 sec - in org.apache.commons.lang3.mutable.MutableBooleanTest
Running org.apache.commons.lang3.mutable.MutableObjectTest
Tests run: 5, Failures: 0, Errors: 0, Skipped: 0, Time elapsed: 0.002 sec - in org.apache.commons.lang3.mutable.MutableObjectTest
Running org.apache.commons.lang3.text.translate.UnicodeEscaperTest
Tests run: 3, Failures: 0, Errors: 0, Skipped: 0, Time elapsed: 0 sec - in org.apache.commons.lang3.text.translate.UnicodeEscaperTest
Running org.apache.commons.lang3.text.translate.EntityArraysTest
Tests run: 3, Failures: 0, Errors: 0, Skipped: 0, Time elapsed: 0 sec - in org.apache.commons.lang3.text.translate.EntityArraysTest
Running org.apache.commons.lang3.text.translate.UnicodeUnpairedSurrogateRemoverTest
Tests run: 2, Failures: 0, Errors: 0, Skipped: 0, Time elapsed: 0 sec - in org.apache.commons.lang3.text.translate.UnicodeUnpairedSurrogateRemoverTest
Running org.apache.commons.lang3.text.translate.NumericEntityUnescaperTest
Tests run: 3, Failures: 0, Errors: 0, Skipped: 0, Time elapsed: 0 sec - in org.apache.commons.lang3.text.translate.NumericEntityUnescaperTest
Running org.apache.commons.lang3.text.translate.NumericEntityEscaperTest
Tests run: 4, Failures: 0, Errors: 0, Skipped: 0, Time elapsed: 0.001 sec - in org.apache.commons.lang3.text.translate.NumericEntityEscaperTest
Running org.apache.commons.lang3.text.translate.LookupTranslatorTest
Tests run: 2, Failures: 0, Errors: 0, Skipped: 0, Time elapsed: 0 sec - in org.apache.commons.lang3.text.translate.LookupTranslatorTest
Running org.apache.commons.lang3.text.translate.UnicodeUnescaperTest
Tests run: 3, Failures: 0, Errors: 0, Skipped: 0, Time elapsed: 0 sec - in org.apache.commons.lang3.text.translate.UnicodeUnescaperTest
Running org.apache.commons.lang3.text.translate.OctalUnescaperTest
Tests run: 1, Failures: 0, Errors: 0, Skipped: 0, Time elapsed: 0 sec - in org.apache.commons.lang3.text.translate.OctalUnescaperTest
Running org.apache.commons.lang3.text.StrMatcherTest
Tests run: 14, Failures: 0, Errors: 0, Skipped: 0, Time elapsed: 0.002 sec - in org.apache.commons.lang3.text.StrMatcherTest
Running org.apache.commons.lang3.text.StrTokenizerTest
Tests run: 55, Failures: 0, Errors: 0, Skipped: 0, Time elapsed: 0.013 sec - in org.apache.commons.lang3.text.StrTokenizerTest
Running org.apache.commons.lang3.text.FormattableUtilsTest
Tests run: 5, Failures: 0, Errors: 0, Skipped: 0, Time elapsed: 0.001 sec - in org.apache.commons.lang3.text.FormattableUtilsTest
Running org.apache.commons.lang3.text.CompositeFormatTest
Tests run: 2, Failures: 0, Errors: 0, Skipped: 0, Time elapsed: 0.001 sec - in org.apache.commons.lang3.text.CompositeFormatTest
Running org.apache.commons.lang3.text.WordUtilsTest
Tests run: 12, Failures: 0, Errors: 0, Skipped: 0, Time elapsed: 0.004 sec - in org.apache.commons.lang3.text.WordUtilsTest
Running org.apache.commons.lang3.text.StrLookupTest
Tests run: 5, Failures: 0, Errors: 0, Skipped: 0, Time elapsed: 0.002 sec - in org.apache.commons.lang3.text.StrLookupTest
Running org.apache.commons.lang3.text.StrBuilderAppendInsertTest
Tests run: 51, Failures: 0, Errors: 0, Skipped: 0, Time elapsed: 0.012 sec - in org.apache.commons.lang3.text.StrBuilderAppendInsertTest
Running org.apache.commons.lang3.text.ExtendedMessageFormatTest
Tests run: 10, Failures: 0, Errors: 0, Skipped: 0, Time elapsed: 0.766 sec - in org.apache.commons.lang3.text.ExtendedMessageFormatTest
Running org.apache.commons.lang3.text.StrSubstitutorTest
Tests run: 40, Failures: 0, Errors: 0, Skipped: 0, Time elapsed: 0.04 sec - in org.apache.commons.lang3.text.StrSubstitutorTest
Running org.apache.commons.lang3.text.StrBuilderTest
Tests run: 90, Failures: 0, Errors: 0, Skipped: 0, Time elapsed: 0.05 sec - in org.apache.commons.lang3.text.StrBuilderTest
Running org.apache.commons.lang3.StringEscapeUtilsTest
Tests run: 28, Failures: 0, Errors: 0, Skipped: 0, Time elapsed: 0.528 sec - in org.apache.commons.lang3.StringEscapeUtilsTest
Running org.apache.commons.lang3.AnnotationUtilsTest
Tests run: 10, Failures: 0, Errors: 0, Skipped: 0, Time elapsed: 0.021 sec - in org.apache.commons.lang3.AnnotationUtilsTest
Running org.apache.commons.lang3.ConversionTest
Tests run: 42, Failures: 0, Errors: 0, Skipped: 0, Time elapsed: 0.01 sec - in org.apache.commons.lang3.ConversionTest
Running org.apache.commons.lang3.StringUtilsTrimEmptyTest
Tests run: 15, Failures: 0, Errors: 0, Skipped: 0, Time elapsed: 0.005 sec - in org.apache.commons.lang3.StringUtilsTrimEmptyTest
Running org.apache.commons.lang3.EnumUtilsTest
Tests run: 34, Failures: 0, Errors: 0, Skipped: 0, Time elapsed: 0.01 sec - in org.apache.commons.lang3.EnumUtilsTest
Running org.apache.commons.lang3.exception.ExceptionUtilsTest
Tests run: 28, Failures: 0, Errors: 0, Skipped: 0, Time elapsed: 0.027 sec - in org.apache.commons.lang3.exception.ExceptionUtilsTest
Running org.apache.commons.lang3.exception.DefaultExceptionContextTest
Tests run: 8, Failures: 0, Errors: 0, Skipped: 0, Time elapsed: 0.005 sec - in org.apache.commons.lang3.exception.DefaultExceptionContextTest
Running org.apache.commons.lang3.exception.ContextedExceptionTest
Tests run: 14, Failures: 0, Errors: 0, Skipped: 0, Time elapsed: 0.016 sec - in org.apache.commons.lang3.exception.ContextedExceptionTest
Running org.apache.commons.lang3.exception.ContextedRuntimeExceptionTest
Tests run: 14, Failures: 0, Errors: 0, Skipped: 0, Time elapsed: 0.009 sec - in org.apache.commons.lang3.exception.ContextedRuntimeExceptionTest
Running org.apache.commons.lang3.BitFieldTest
Tests run: 15, Failures: 0, Errors: 0, Skipped: 0, Time elapsed: 0.003 sec - in org.apache.commons.lang3.BitFieldTest
Running org.apache.commons.lang3.ArrayUtilsRemoveMultipleTest
Tests run: 55, Failures: 0, Errors: 0, Skipped: 0, Time elapsed: 0.021 sec - in org.apache.commons.lang3.ArrayUtilsRemoveMultipleTest
Running org.apache.commons.lang3.HashSetvBitSetTest
Ratio=8% array=100 count=1 extract=25875588 bitset=2106242
Ratio=11% array=100 count=10 extract=17379463 bitset=1969782
Ratio=16% array=100 count=50 extract=10732126 bitset=1797462
Ratio=5% array=100 count=100 extract=10708473 bitset=570823
Ratio=83% array=1000 count=10 extract=6554691 bitset=5457603
Ratio=33% array=1000 count=100 extract=15815816 bitset=5273318
Ratio=7% array=1000 count=500 extract=45742144 bitset=3380586
Ratio=1% array=1000 count=1000 extract=75428091 bitset=814316
Ratio=2% count=0 hash=5223014 bits=155773
Ratio=30% count=5 hash=656735 bits=197128
Ratio=29% count=10 hash=991683 bits=287948
Ratio=24% count=200 hash=20763988 bits=5109434
Ratio=14% count=50 hash=9173238 bits=1368709
Ratio=9% count=100 hash=24344310 bits=2336582
Ratio=21% count=1000 hash=79635218 bits=17498692
Ratio=21% count=2000 hash=159517828 bits=33777994
Tests run: 2, Failures: 0, Errors: 0, Skipped: 0, Time elapsed: 0.705 sec - in org.apache.commons.lang3.HashSetvBitSetTest
Running org.apache.commons.lang3.StringUtilsTest
Tests run: 124, Failures: 0, Errors: 0, Skipped: 0, Time elapsed: 0.222 sec - in org.apache.commons.lang3.StringUtilsTest
Running org.apache.commons.lang3.ArrayUtilsRemoveTest
Tests run: 19, Failures: 0, Errors: 0, Skipped: 0, Time elapsed: 0.027 sec - in org.apache.commons.lang3.ArrayUtilsRemoveTest
Running org.apache.commons.lang3.ObjectUtilsTest
Tests run: 36, Failures: 0, Errors: 0, Skipped: 0, Time elapsed: 0.035 sec - in org.apache.commons.lang3.ObjectUtilsTest
Running org.apache.commons.lang3.ClassPathUtilsTest
Tests run: 13, Failures: 0, Errors: 0, Skipped: 0, Time elapsed: 0.014 sec - in org.apache.commons.lang3.ClassPathUtilsTest
Running org.apache.commons.lang3.math.NumberUtilsTest
Tests run: 91, Failures: 0, Errors: 0, Skipped: 0, Time elapsed: 0.049 sec - in org.apache.commons.lang3.math.NumberUtilsTest
Running org.apache.commons.lang3.math.IEEE754rUtilsTest
Tests run: 3, Failures: 0, Errors: 0, Skipped: 0, Time elapsed: 0 sec - in org.apache.commons.lang3.math.IEEE754rUtilsTest
Running org.apache.commons.lang3.math.FractionTest
Tests run: 25, Failures: 0, Errors: 0, Skipped: 0, Time elapsed: 0.317 sec - in org.apache.commons.lang3.math.FractionTest
Running org.apache.commons.lang3.BooleanUtilsTest
Tests run: 72, Failures: 0, Errors: 0, Skipped: 0, Time elapsed: 0.034 sec - in org.apache.commons.lang3.BooleanUtilsTest
Running org.apache.commons.lang3.CharSequenceUtilsTest
Tests run: 2, Failures: 0, Errors: 0, Skipped: 0, Time elapsed: 0.001 sec - in org.apache.commons.lang3.CharSequenceUtilsTest
Running org.apache.commons.lang3.CharSetUtilsTest
Tests run: 11, Failures: 0, Errors: 0, Skipped: 0, Time elapsed: 0.006 sec - in org.apache.commons.lang3.CharSetUtilsTest
Running org.apache.commons.lang3.ArrayUtilsAddTest
Tests run: 13, Failures: 0, Errors: 0, Skipped: 0, Time elapsed: 0.006 sec - in org.apache.commons.lang3.ArrayUtilsAddTest
Running org.apache.commons.lang3.CharEncodingTest
Tests run: 6, Failures: 0, Errors: 0, Skipped: 0, Time elapsed: 0.056 sec - in org.apache.commons.lang3.CharEncodingTest
Running org.apache.commons.lang3.ClassUtilsTest
Tests run: 57, Failures: 0, Errors: 0, Skipped: 0, Time elapsed: 0.043 sec - in org.apache.commons.lang3.ClassUtilsTest
Running org.apache.commons.lang3.RangeTest
Tests run: 24, Failures: 0, Errors: 0, Skipped: 0, Time elapsed: 0.01 sec - in org.apache.commons.lang3.RangeTest
Running org.apache.commons.lang3.event.EventUtilsTest
Tests run: 8, Failures: 0, Errors: 0, Skipped: 0, Time elapsed: 0.019 sec - in org.apache.commons.lang3.event.EventUtilsTest
Running org.apache.commons.lang3.event.EventListenerSupportTest
Tests run: 9, Failures: 0, Errors: 0, Skipped: 0, Time elapsed: 0.022 sec - in org.apache.commons.lang3.event.EventListenerSupportTest
Running org.apache.commons.lang3.ArrayUtilsTest
Tests run: 205, Failures: 0, Errors: 0, Skipped: 0, Time elapsed: 0.066 sec - in org.apache.commons.lang3.ArrayUtilsTest
Running org.apache.commons.lang3.CharUtilsTest
Tests run: 24, Failures: 0, Errors: 0, Skipped: 0, Time elapsed: 0.012 sec - in org.apache.commons.lang3.CharUtilsTest
Running org.apache.commons.lang3.NotImplementedExceptionTest
Tests run: 1, Failures: 0, Errors: 0, Skipped: 0, Time elapsed: 0.006 sec - in org.apache.commons.lang3.NotImplementedExceptionTest
Running org.apache.commons.lang3.StringUtilsEqualsIndexOfTest
Tests run: 50, Failures: 0, Errors: 0, Skipped: 0, Time elapsed: 0.005 sec - in org.apache.commons.lang3.StringUtilsEqualsIndexOfTest
Running org.apache.commons.lang3.RandomUtilsTest
Tests run: 23, Failures: 0, Errors: 0, Skipped: 0, Time elapsed: 0.007 sec - in org.apache.commons.lang3.RandomUtilsTest

Results :


Tests in error: 
  DateFormatUtilsTest.testConstructor:39 NoClassDefFound Could not initialize cl...
  DateFormatUtilsTest.testDateISO:145 NoClassDefFound Could not initialize class...
  DateFormatUtilsTest.testDateTimeISO:113 NoClassDefFound Could not initialize c...
  DateFormatUtilsTest.testFormat:62 NoClassDefFound Could not initialize class o...
  DateFormatUtilsTest.testFormatCalendar:86 NoClassDefFound Could not initialize...
  DateFormatUtilsTest.testFormatUTC:99 NoClassDefFound Could not initialize clas...
  DateFormatUtilsTest.testLANG1000:266 NoClassDefFound Could not initialize clas...
  DateFormatUtilsTest.testSMTP:217 NoClassDefFound Could not initialize class or...
  DateFormatUtilsTest.testTimeISO:169 NoClassDefFound Could not initialize class...
  DateFormatUtilsTest.testTimeNoTISO:193 NoClassDefFound Could not initialize cl...
  DateUtilsRoundingTest.<init>:55 NoClassDefFound Could not initialize class org...
  DateUtilsRoundingTest.<init>:55 NoClassDefFound Could not initialize class org...
  DateUtilsRoundingTest.<init>:55 NoClassDefFound Could not initialize class org...
  DateUtilsRoundingTest.<init>:55 NoClassDefFound Could not initialize class org...
  DateUtilsRoundingTest.<init>:55 NoClassDefFound Could not initialize class org...
  DateUtilsRoundingTest.<init>:55 ExceptionInInitializer
  DateUtilsRoundingTest.<init>:55 NoClassDefFound Could not initialize class org...
  DateUtilsRoundingTest.<init>:55 NoClassDefFound Could not initialize class org...
  DateUtilsRoundingTest.<init>:55 NoClassDefFound Could not initialize class org...
  DateUtilsRoundingTest.<init>:55 NoClassDefFound Could not initialize class org...
  DateUtilsRoundingTest.<init>:55 NoClassDefFound Could not initialize class org...
  DateUtilsRoundingTest.<init>:55 NoClassDefFound Could not initialize class org...
  DateUtilsRoundingTest.<init>:55 NoClassDefFound Could not initialize class org...
  DateUtilsRoundingTest.<init>:55 NoClassDefFound Could not initialize class org...
  DateUtilsRoundingTest.<init>:55 NoClassDefFound Could not initialize class org...
  DateUtilsRoundingTest.<init>:55 NoClassDefFound Could not initialize class org...
  DateUtilsRoundingTest.<init>:55 NoClassDefFound Could not initialize class org...
  DateUtilsRoundingTest.<init>:55 NoClassDefFound Could not initialize class org...
  DateUtilsRoundingTest.<init>:55 NoClassDefFound Could not initialize class org...
  DateUtilsRoundingTest.<init>:55 NoClassDefFound Could not initialize class org...
  DateUtilsRoundingTest.<init>:55 NoClassDefFound Could not initialize class org...
  DateUtilsRoundingTest.<init>:55 NoClassDefFound Could not initialize class org...
  DateUtilsTest.testLang530:1222 NoClassDefFound Could not initialize class org....
  DurationFormatUtilsTest.testFormatPeriodISO:269 NoClassDefFound Could not init...
  FastDateFormatTest.testCheckDifferingStyles:206 » IllegalArgument
  FastDateFormatTest.testDateDefaults:219 » IllegalArgument
  FastDateFormatTest.testLang954:259 » IllegalArgument
  FastDateFormatTest.testParseSync:265 » IllegalArgument
  FastDateFormatTest.testTimeDateDefaults:243 » IllegalArgument
  FastDateFormatTest.test_changeDefault_Locale_DateInstance:124 » IllegalArgument
  FastDateFormatTest.test_changeDefault_Locale_DateTimeInstance:145 » IllegalArgument
  FastDateFormatTest.test_getInstance_String:61 » IllegalArgument
  FastDateFormatTest.test_getInstance_String_Locale:106 » IllegalArgument
  FastDateFormatTest.test_getInstance_String_TimeZone:80 » IllegalArgument
  FastDateFormatTest.test_getInstance_String_TimeZone_Locale:169 » IllegalArgument
  FastDateFormat_ParserTest>FastDateParserTest.test1806:632->FastDateParserTest.getInstance:76->getInstance:31 » IllegalArgument
  FastDateFormat_ParserTest>FastDateParserTest.testAmPm:168->getInstance:31 » IllegalArgument
  FastDateFormat_ParserTest>FastDateParserTest.testDayOf:464->getInstance:31 » IllegalArgument
  FastDateFormat_ParserTest>FastDateParserTest.testEquals:540->FastDateParserTest.getInstance:64->getInstance:31 » IllegalArgument
  FastDateFormat_ParserTest>FastDateParserTest.testLang303:517->FastDateParserTest.getInstance:64->getInstance:31 » IllegalArgument
  FastDateFormat_ParserTest>FastDateParserTest.testLang538:529->FastDateParserTest.getInstance:76->getInstance:31 » IllegalArgument
  FastDateFormat_ParserTest>FastDateParserTest.testLang996:579->getInstance:31 » IllegalArgument
  FastDateFormat_ParserTest>FastDateParserTest.testLocaleMatches:563->FastDateParserTest.getInstance:72->getInstance:31 » IllegalArgument
  FastDateFormat_ParserTest>FastDateParserTest.testLocales_LongNoEra_AD:303->FastDateParserTest.testLocales:335->FastDateParserTest.getInstance:72->getInstance:31 » IllegalArgument
  FastDateFormat_ParserTest>FastDateParserTest.testLocales_LongNoEra_BC:308->FastDateParserTest.testLocales:335->FastDateParserTest.getInstance:72->getInstance:31 » IllegalArgument
  FastDateFormat_ParserTest>FastDateParserTest.testLocales_Long_AD:283->FastDateParserTest.testLocales:335->FastDateParserTest.getInstance:72->getInstance:31 » IllegalArgument
  FastDateFormat_ParserTest>FastDateParserTest.testLocales_Long_BC:288->FastDateParserTest.testLocales:335->FastDateParserTest.getInstance:72->getInstance:31 » IllegalArgument
  FastDateFormat_ParserTest>FastDateParserTest.testLocales_ShortNoEra_AD:313->FastDateParserTest.testLocales:335->FastDateParserTest.getInstance:72->getInstance:31 » IllegalArgument
  FastDateFormat_ParserTest>FastDateParserTest.testLocales_ShortNoEra_BC:318->FastDateParserTest.testLocales:335->FastDateParserTest.getInstance:72->getInstance:31 » IllegalArgument
  FastDateFormat_ParserTest>FastDateParserTest.testLocales_Short_AD:293->FastDateParserTest.testLocales:335->FastDateParserTest.getInstance:72->getInstance:31 » IllegalArgument
  FastDateFormat_ParserTest>FastDateParserTest.testLocales_Short_BC:298->FastDateParserTest.testLocales:335->FastDateParserTest.getInstance:72->getInstance:31 » IllegalArgument
  FastDateFormat_ParserTest>FastDateParserTest.testLowYearPadding:491->FastDateParserTest.getInstance:64->getInstance:31 » IllegalArgument
  FastDateFormat_ParserTest>FastDateParserTest.testMilleniumBug:507->FastDateParserTest.getInstance:64->getInstance:31 » IllegalArgument
  FastDateFormat_ParserTest>FastDateParserTest.testParseLongShort:148->getInstance:31 » IllegalArgument
  FastDateFormat_ParserTest>FastDateParserTest.testParseNumerics:376->getInstance:31 » IllegalArgument
  FastDateFormat_ParserTest>FastDateParserTest.testParseZone:122->getInstance:31 » IllegalArgument
  FastDateFormat_ParserTest>FastDateParserTest.testPatternMatches:557->FastDateParserTest.getInstance:64->getInstance:31 » IllegalArgument
  FastDateFormat_ParserTest>FastDateParserTest.testQuotes:387->getInstance:31 » IllegalArgument
  FastDateFormat_ParserTest>FastDateParserTest.testShortDateStyleWithLocales:481->FastDateParserTest.getDateInstance:68->getInstance:31 » IllegalArgument
  FastDateFormat_ParserTest>FastDateParserTest.testSpecialCharacters:397->FastDateParserTest.testSdfAndFdp:442->getInstance:31 » IllegalArgument
  FastDateFormat_ParserTest>FastDateParserTest.testTimeZoneMatches:569->FastDateParserTest.getInstance:76->getInstance:31 » IllegalArgument
  FastDateFormat_ParserTest>FastDateParserTest.testToStringContainsName:551->FastDateParserTest.getInstance:64->getInstance:31 » IllegalArgument
  FastDateFormat_ParserTest>FastDateParserTest.test_Equality_Hash:94->getInstance:31 » IllegalArgument
  FastDateFormat_PrinterTest>FastDatePrinterTest.testEquals:233->FastDatePrinterTest.getInstance:48->getInstance:31 » IllegalArgument
  FastDateFormat_PrinterTest>FastDatePrinterTest.testFormat:89->FastDatePrinterTest.getInstance:48->getInstance:31 » IllegalArgument
  FastDateFormat_PrinterTest>FastDatePrinterTest.testLang1103:336->FastDatePrinterTest.getInstance:56->getInstance:31 » IllegalArgument
  FastDateFormat_PrinterTest>FastDatePrinterTest.testLang303:198->FastDatePrinterTest.getInstance:48->getInstance:31 » IllegalArgument
  FastDateFormat_PrinterTest>FastDatePrinterTest.testLang538:213->FastDatePrinterTest.getInstance:60->getInstance:31 » IllegalArgument
  FastDateFormat_PrinterTest>FastDatePrinterTest.testLocaleMatches:256->FastDatePrinterTest.getInstance:56->getInstance:31 » IllegalArgument
  FastDateFormat_PrinterTest>FastDatePrinterTest.testLowYearPadding:153->FastDatePrinterTest.getInstance:48->getInstance:31 » IllegalArgument
  FastDateFormat_PrinterTest>FastDatePrinterTest.testMilleniumBug:170->FastDatePrinterTest.getInstance:48->getInstance:31 » IllegalArgument
  FastDateFormat_PrinterTest>FastDatePrinterTest.testPatternMatches:250->FastDatePrinterTest.getInstance:48->getInstance:31 » IllegalArgument
  FastDateFormat_PrinterTest>FastDatePrinterTest.testShortDateStyleWithLocales:142->FastDatePrinterTest.getDateInstance:52->getInstance:31 » IllegalArgument
  FastDateFormat_PrinterTest>FastDatePrinterTest.testSimpleDate:183->FastDatePrinterTest.getInstance:48->getInstance:31 » IllegalArgument
  FastDateFormat_PrinterTest>FastDatePrinterTest.testTimeZoneMatches:262->FastDatePrinterTest.getInstance:60->getInstance:31 » IllegalArgument
  FastDateFormat_PrinterTest>FastDatePrinterTest.testToStringContainsName:244->FastDatePrinterTest.getInstance:48->getInstance:31 » IllegalArgument
  FastDatePrinterTest.testEquals:233->getInstance:48->getInstance:71 » IllegalArgument
  FastDatePrinterTest.testFormat:89->getInstance:48->getInstance:71 » IllegalArgument
  FastDatePrinterTest.testLang1103:336->getInstance:56->getInstance:71 » IllegalArgument
  FastDatePrinterTest.testLang303:198->getInstance:48->getInstance:71 » IllegalArgument
  FastDatePrinterTest.testLang538:213->getInstance:60->getInstance:71 » IllegalArgument
  FastDatePrinterTest.testLocaleMatches:256->getInstance:56->getInstance:71 » IllegalArgument
  FastDatePrinterTest.testLowYearPadding:153->getInstance:48->getInstance:71 » IllegalArgument
  FastDatePrinterTest.testMilleniumBug:170->getInstance:48->getInstance:71 » IllegalArgument
  FastDatePrinterTest.testPatternMatches:250->getInstance:48->getInstance:71 » IllegalArgument
  FastDatePrinterTest.testShortDateStyleWithLocales:142->getDateInstance:52->getInstance:71 » IllegalArgument
  FastDatePrinterTest.testSimpleDate:183->getInstance:48->getInstance:71 » IllegalArgument
  FastDatePrinterTest.testTimeZoneMatches:262->getInstance:60->getInstance:71 » IllegalArgument
  FastDatePrinterTest.testToStringContainsName:244->getInstance:48->getInstance:71 » IllegalArgument


Tests run: 3526, Failures: 0, Errors: 99, Skipped: 97

[INFO] ------------------------------------------------------------------------
[INFO] BUILD FAILURE
[INFO] ------------------------------------------------------------------------
[INFO] Total time: 34.571s
[INFO] Finished at: Wed Aug 05 10:36:45 BST 2015
[INFO] Final Memory: 25M/498M
[INFO] ------------------------------------------------------------------------
[ERROR] Failed to execute goal org.apache.maven.plugins:maven-surefire-plugin:2.18:test (default-test) on project commons-lang3: There are test failures.
[ERROR] 
[ERROR] Please refer to /home/perham/Study/LittleDarwin/Cases/commons-lang3-3.4-src/target/surefire-reports for the individual test results.
[ERROR] -> [Help 1]
[ERROR] 
[ERROR] To see the full stack trace of the errors, re-run Maven with the -e switch.
[ERROR] Re-run Maven using the -X switch to enable full debug logging.
[ERROR] 
[ERROR] For more information about the errors and possible solutions, please read the following articles:
[ERROR] [Help 1] http://cwiki.apache.org/confluence/display/MAVEN/MojoFailureException
