[INFO] Scanning for projects...
[INFO]                                                                         
[INFO] ------------------------------------------------------------------------
[INFO] Building Apache Commons Lang 3.4
[INFO] ------------------------------------------------------------------------
[INFO] 
[INFO] --- maven-enforcer-plugin:1.3.1:enforce (enforce-maven-3) @ commons-lang3 ---
[INFO] 
[INFO] --- build-helper-maven-plugin:1.8:parse-version (parse-version) @ commons-lang3 ---
[INFO] 
[INFO] --- maven-antrun-plugin:1.8:run (javadoc.resources) @ commons-lang3 ---
[INFO] Executing tasks

main:
[INFO] Executed tasks
[INFO] 
[INFO] --- maven-remote-resources-plugin:1.5:process (default) @ commons-lang3 ---
[INFO] 
[INFO] --- buildnumber-maven-plugin:1.3:create (default) @ commons-lang3 ---
[INFO] Executing: /bin/sh -c cd /home/perham/Study/LittleDarwin/Cases/commons-lang3-3.4-src && svn --non-interactive info
[INFO] Working directory: /home/perham/Study/LittleDarwin/Cases/commons-lang3-3.4-src
[INFO] Storing buildNumber: ?????? at timestamp: 1438764101629
[INFO] Executing: /bin/sh -c cd /home/perham/Study/LittleDarwin/Cases/commons-lang3-3.4-src && svn --non-interactive info
[INFO] Working directory: /home/perham/Study/LittleDarwin/Cases/commons-lang3-3.4-src
[INFO] Storing buildScmBranch: UNKNOWN_BRANCH
[INFO] 
[INFO] --- maven-resources-plugin:2.7:resources (default-resources) @ commons-lang3 ---
[INFO] Using 'ISO-8859-1' encoding to copy filtered resources.
[INFO] Copying 0 resource
[INFO] Copying 2 resources to META-INF
[INFO] 
[INFO] --- maven-compiler-plugin:3.2:compile (default-compile) @ commons-lang3 ---
[INFO] Changes detected - recompiling the module!
[INFO] Compiling 133 source files to /home/perham/Study/LittleDarwin/Cases/commons-lang3-3.4-src/target/classes
[INFO] /home/perham/Study/LittleDarwin/Cases/commons-lang3-3.4-src/src/main/java/org/apache/commons/lang3/SerializationUtils.java: /home/perham/Study/LittleDarwin/Cases/commons-lang3-3.4-src/src/main/java/org/apache/commons/lang3/SerializationUtils.java uses unchecked or unsafe operations.
[INFO] /home/perham/Study/LittleDarwin/Cases/commons-lang3-3.4-src/src/main/java/org/apache/commons/lang3/SerializationUtils.java: Recompile with -Xlint:unchecked for details.
[INFO] 
[INFO] --- maven-bundle-plugin:2.5.3:manifest (bundle-manifest) @ commons-lang3 ---
[INFO] 
[INFO] --- animal-sniffer-maven-plugin:1.13:check (checkAPIcompatibility) @ commons-lang3 ---
[INFO] Checking unresolved references to org.codehaus.mojo.signature:java16:1.0
[INFO] 
[INFO] --- maven-resources-plugin:2.7:testResources (default-testResources) @ commons-lang3 ---
[INFO] Using 'ISO-8859-1' encoding to copy filtered resources.
[INFO] Copying 2 resources
[INFO] Copying 2 resources to META-INF
[INFO] 
[INFO] --- maven-compiler-plugin:3.2:testCompile (default-testCompile) @ commons-lang3 ---
[INFO] Nothing to compile - all classes are up to date
[INFO] 
[INFO] --- maven-surefire-plugin:2.18:test (default-test) @ commons-lang3 ---
[INFO] Surefire report directory: /home/perham/Study/LittleDarwin/Cases/commons-lang3-3.4-src/target/surefire-reports

-------------------------------------------------------
 T E S T S
-------------------------------------------------------
Running org.apache.commons.lang3.ValidateTest
Tests run: 63, Failures: 0, Errors: 0, Skipped: 0, Time elapsed: 0.043 sec - in org.apache.commons.lang3.ValidateTest
Running org.apache.commons.lang3.LocaleUtilsTest
Tests run: 15, Failures: 0, Errors: 0, Skipped: 0, Time elapsed: 0.022 sec - in org.apache.commons.lang3.LocaleUtilsTest
Running org.apache.commons.lang3.tuple.MutableTripleTest
Tests run: 8, Failures: 0, Errors: 0, Skipped: 0, Time elapsed: 0.029 sec - in org.apache.commons.lang3.tuple.MutableTripleTest
Running org.apache.commons.lang3.tuple.TripleTest
Tests run: 10, Failures: 0, Errors: 0, Skipped: 0, Time elapsed: 0.006 sec - in org.apache.commons.lang3.tuple.TripleTest
Running org.apache.commons.lang3.tuple.ImmutablePairTest
Tests run: 6, Failures: 0, Errors: 0, Skipped: 0, Time elapsed: 0 sec - in org.apache.commons.lang3.tuple.ImmutablePairTest
Running org.apache.commons.lang3.tuple.MutablePairTest
Tests run: 8, Failures: 0, Errors: 0, Skipped: 0, Time elapsed: 0 sec - in org.apache.commons.lang3.tuple.MutablePairTest
Running org.apache.commons.lang3.tuple.ImmutableTripleTest
Tests run: 6, Failures: 0, Errors: 0, Skipped: 0, Time elapsed: 0.001 sec - in org.apache.commons.lang3.tuple.ImmutableTripleTest
Running org.apache.commons.lang3.tuple.PairTest
Tests run: 9, Failures: 0, Errors: 0, Skipped: 0, Time elapsed: 0.001 sec - in org.apache.commons.lang3.tuple.PairTest
Running org.apache.commons.lang3.StringUtilsIsTest
Tests run: 8, Failures: 0, Errors: 0, Skipped: 0, Time elapsed: 0.016 sec - in org.apache.commons.lang3.StringUtilsIsTest
Running org.apache.commons.lang3.JavaVersionTest
Tests run: 3, Failures: 0, Errors: 0, Skipped: 0, Time elapsed: 0.001 sec - in org.apache.commons.lang3.JavaVersionTest
Running org.apache.commons.lang3.builder.NoFieldNamesToStringStyleTest
Tests run: 8, Failures: 0, Errors: 0, Skipped: 0, Time elapsed: 0.012 sec - in org.apache.commons.lang3.builder.NoFieldNamesToStringStyleTest
Running org.apache.commons.lang3.builder.ShortPrefixToStringStyleTest
Tests run: 8, Failures: 0, Errors: 0, Skipped: 0, Time elapsed: 0.007 sec - in org.apache.commons.lang3.builder.ShortPrefixToStringStyleTest
Running org.apache.commons.lang3.builder.DiffResultTest
Tests run: 9, Failures: 0, Errors: 0, Skipped: 0, Time elapsed: 0.012 sec - in org.apache.commons.lang3.builder.DiffResultTest
Running org.apache.commons.lang3.builder.CompareToBuilderTest
Tests run: 48, Failures: 0, Errors: 0, Skipped: 0, Time elapsed: 0.025 sec - in org.apache.commons.lang3.builder.CompareToBuilderTest
Running org.apache.commons.lang3.builder.MultilineRecursiveToStringStyleTest
Tests run: 10, Failures: 0, Errors: 0, Skipped: 0, Time elapsed: 0.004 sec - in org.apache.commons.lang3.builder.MultilineRecursiveToStringStyleTest
Running org.apache.commons.lang3.builder.RecursiveToStringStyleTest
Tests run: 8, Failures: 0, Errors: 0, Skipped: 0, Time elapsed: 0 sec - in org.apache.commons.lang3.builder.RecursiveToStringStyleTest
Running org.apache.commons.lang3.builder.DefaultToStringStyleTest
Tests run: 8, Failures: 0, Errors: 0, Skipped: 0, Time elapsed: 0.001 sec - in org.apache.commons.lang3.builder.DefaultToStringStyleTest
Running org.apache.commons.lang3.builder.ReflectionToStringBuilderExcludeTest
Tests run: 11, Failures: 0, Errors: 0, Skipped: 0, Time elapsed: 0.001 sec - in org.apache.commons.lang3.builder.ReflectionToStringBuilderExcludeTest
Running org.apache.commons.lang3.builder.StandardToStringStyleTest
Tests run: 8, Failures: 0, Errors: 0, Skipped: 0, Time elapsed: 0 sec - in org.apache.commons.lang3.builder.StandardToStringStyleTest
Running org.apache.commons.lang3.builder.ToStringStyleTest
Tests run: 12, Failures: 0, Errors: 0, Skipped: 0, Time elapsed: 0.001 sec - in org.apache.commons.lang3.builder.ToStringStyleTest
Running org.apache.commons.lang3.builder.DiffTest
Tests run: 4, Failures: 0, Errors: 0, Skipped: 0, Time elapsed: 0 sec - in org.apache.commons.lang3.builder.DiffTest
Running org.apache.commons.lang3.builder.SimpleToStringStyleTest
Tests run: 8, Failures: 0, Errors: 0, Skipped: 0, Time elapsed: 0 sec - in org.apache.commons.lang3.builder.SimpleToStringStyleTest
Running org.apache.commons.lang3.builder.MultiLineToStringStyleTest
Tests run: 8, Failures: 0, Errors: 0, Skipped: 0, Time elapsed: 0.009 sec - in org.apache.commons.lang3.builder.MultiLineToStringStyleTest
Running org.apache.commons.lang3.builder.ToStringStyleConcurrencyTest
Tests run: 3, Failures: 0, Errors: 0, Skipped: 0, Time elapsed: 5.495 sec - in org.apache.commons.lang3.builder.ToStringStyleConcurrencyTest
Running org.apache.commons.lang3.builder.ReflectionToStringBuilderMutateInspectConcurrencyTest
Tests run: 1, Failures: 0, Errors: 0, Skipped: 1, Time elapsed: 0.001 sec - in org.apache.commons.lang3.builder.ReflectionToStringBuilderMutateInspectConcurrencyTest
Running org.apache.commons.lang3.builder.ToStringBuilderTest
Tests run: 74, Failures: 0, Errors: 0, Skipped: 1, Time elapsed: 0.057 sec - in org.apache.commons.lang3.builder.ToStringBuilderTest
Running org.apache.commons.lang3.builder.EqualsBuilderTest
Tests run: 48, Failures: 0, Errors: 0, Skipped: 0, Time elapsed: 0.012 sec - in org.apache.commons.lang3.builder.EqualsBuilderTest
Running org.apache.commons.lang3.builder.HashCodeBuilderAndEqualsBuilderTest
Tests run: 4, Failures: 0, Errors: 0, Skipped: 0, Time elapsed: 0.007 sec - in org.apache.commons.lang3.builder.HashCodeBuilderAndEqualsBuilderTest
Running org.apache.commons.lang3.builder.ReflectionToStringBuilderConcurrencyTest
Tests run: 3, Failures: 0, Errors: 0, Skipped: 3, Time elapsed: 0 sec - in org.apache.commons.lang3.builder.ReflectionToStringBuilderConcurrencyTest
Running org.apache.commons.lang3.builder.JsonToStringStyleTest
Tests run: 9, Failures: 0, Errors: 0, Skipped: 0, Time elapsed: 0.003 sec - in org.apache.commons.lang3.builder.JsonToStringStyleTest
Running org.apache.commons.lang3.builder.NoClassNameToStringStyleTest
Tests run: 8, Failures: 0, Errors: 0, Skipped: 0, Time elapsed: 0.004 sec - in org.apache.commons.lang3.builder.NoClassNameToStringStyleTest
Running org.apache.commons.lang3.builder.DiffBuilderTest
Tests run: 30, Failures: 0, Errors: 0, Skipped: 0, Time elapsed: 0.037 sec - in org.apache.commons.lang3.builder.DiffBuilderTest
Running org.apache.commons.lang3.builder.HashCodeBuilderTest
Tests run: 44, Failures: 0, Errors: 0, Skipped: 0, Time elapsed: 0.018 sec - in org.apache.commons.lang3.builder.HashCodeBuilderTest
Running org.apache.commons.lang3.concurrent.AtomicInitializerTest
Tests run: 3, Failures: 0, Errors: 0, Skipped: 0, Time elapsed: 0.007 sec - in org.apache.commons.lang3.concurrent.AtomicInitializerTest
Running org.apache.commons.lang3.concurrent.CallableBackgroundInitializerTest
Tests run: 4, Failures: 0, Errors: 0, Skipped: 0, Time elapsed: 0.002 sec - in org.apache.commons.lang3.concurrent.CallableBackgroundInitializerTest
Running org.apache.commons.lang3.concurrent.BackgroundInitializerTest
Tests run: 15, Failures: 0, Errors: 0, Skipped: 0, Time elapsed: 0.016 sec - in org.apache.commons.lang3.concurrent.BackgroundInitializerTest
Running org.apache.commons.lang3.concurrent.LazyInitializerTest
Tests run: 3, Failures: 0, Errors: 0, Skipped: 0, Time elapsed: 0.009 sec - in org.apache.commons.lang3.concurrent.LazyInitializerTest
Running org.apache.commons.lang3.concurrent.BasicThreadFactoryTest
Tests run: 15, Failures: 0, Errors: 0, Skipped: 0, Time elapsed: 0.04 sec - in org.apache.commons.lang3.concurrent.BasicThreadFactoryTest
Running org.apache.commons.lang3.concurrent.ConstantInitializerTest
Tests run: 7, Failures: 0, Errors: 0, Skipped: 0, Time elapsed: 0.001 sec - in org.apache.commons.lang3.concurrent.ConstantInitializerTest
Running org.apache.commons.lang3.concurrent.MultiBackgroundInitializerTest
Tests run: 17, Failures: 0, Errors: 0, Skipped: 0, Time elapsed: 0.1 sec - in org.apache.commons.lang3.concurrent.MultiBackgroundInitializerTest
Running org.apache.commons.lang3.concurrent.AtomicSafeInitializerTest
Tests run: 4, Failures: 0, Errors: 0, Skipped: 0, Time elapsed: 0.008 sec - in org.apache.commons.lang3.concurrent.AtomicSafeInitializerTest
Running org.apache.commons.lang3.concurrent.ConcurrentUtilsTest
Tests run: 40, Failures: 0, Errors: 0, Skipped: 0, Time elapsed: 0.014 sec - in org.apache.commons.lang3.concurrent.ConcurrentUtilsTest
Running org.apache.commons.lang3.concurrent.TimedSemaphoreTest
Tests run: 15, Failures: 0, Errors: 0, Skipped: 0, Time elapsed: 1.172 sec - in org.apache.commons.lang3.concurrent.TimedSemaphoreTest
Running org.apache.commons.lang3.StringUtilsSubstringTest
Tests run: 14, Failures: 0, Errors: 0, Skipped: 0, Time elapsed: 0.004 sec - in org.apache.commons.lang3.StringUtilsSubstringTest
Running org.apache.commons.lang3.SystemUtilsTest
Tests run: 12, Failures: 0, Errors: 0, Skipped: 0, Time elapsed: 0.002 sec - in org.apache.commons.lang3.SystemUtilsTest
Running org.apache.commons.lang3.CharRangeTest
Tests run: 16, Failures: 0, Errors: 0, Skipped: 0, Time elapsed: 0.037 sec - in org.apache.commons.lang3.CharRangeTest
Running org.apache.commons.lang3.CharSetTest
Tests run: 14, Failures: 0, Errors: 0, Skipped: 0, Time elapsed: 0.012 sec - in org.apache.commons.lang3.CharSetTest
Running org.apache.commons.lang3.StringUtilsStartsEndsWithTest
Tests run: 6, Failures: 0, Errors: 0, Skipped: 0, Time elapsed: 0.004 sec - in org.apache.commons.lang3.StringUtilsStartsEndsWithTest
Running org.apache.commons.lang3.RandomStringUtilsTest
Tests run: 11, Failures: 0, Errors: 0, Skipped: 0, Time elapsed: 0.037 sec - in org.apache.commons.lang3.RandomStringUtilsTest
Running org.apache.commons.lang3.SerializationUtilsTest
Tests run: 26, Failures: 0, Errors: 0, Skipped: 0, Time elapsed: 0.055 sec - in org.apache.commons.lang3.SerializationUtilsTest
Running org.apache.commons.lang3.time.StopWatchTest
Tests run: 8, Failures: 0, Errors: 0, Skipped: 0, Time elapsed: 4.76 sec - in org.apache.commons.lang3.time.StopWatchTest
Running org.apache.commons.lang3.time.DateUtilsRoundingTest
Tests run: 22, Failures: 0, Errors: 0, Skipped: 0, Time elapsed: 0.177 sec - in org.apache.commons.lang3.time.DateUtilsRoundingTest
Running org.apache.commons.lang3.time.FastDateParserTest
Tests run: 33, Failures: 0, Errors: 0, Skipped: 0, Time elapsed: 2.48 sec - in org.apache.commons.lang3.time.FastDateParserTest
Running org.apache.commons.lang3.time.FastDateFormat_ParserTest
Tests run: 33, Failures: 0, Errors: 0, Skipped: 0, Time elapsed: 0.799 sec - in org.apache.commons.lang3.time.FastDateFormat_ParserTest
Running org.apache.commons.lang3.time.DurationFormatUtilsTest
Tests run: 25, Failures: 0, Errors: 0, Skipped: 0, Time elapsed: 1.031 sec - in org.apache.commons.lang3.time.DurationFormatUtilsTest
Running org.apache.commons.lang3.time.DateFormatUtilsTest
Tests run: 10, Failures: 0, Errors: 0, Skipped: 0, Time elapsed: 0.002 sec - in org.apache.commons.lang3.time.DateFormatUtilsTest
Running org.apache.commons.lang3.time.DateUtilsFragmentTest
Tests run: 57, Failures: 0, Errors: 0, Skipped: 0, Time elapsed: 0.013 sec - in org.apache.commons.lang3.time.DateUtilsFragmentTest
Running org.apache.commons.lang3.time.FastDatePrinterTimeZonesTest
Tests run: 617, Failures: 0, Errors: 0, Skipped: 0, Time elapsed: 0.264 sec - in org.apache.commons.lang3.time.FastDatePrinterTimeZonesTest
Running org.apache.commons.lang3.time.FastDateFormatTest
>>FastDateFormatTest: FastDateParser:20135  SimpleDateFormat:4245
Tests run: 14, Failures: 0, Errors: 0, Skipped: 0, Time elapsed: 2.663 sec - in org.apache.commons.lang3.time.FastDateFormatTest
Running org.apache.commons.lang3.time.FastDateFormat_PrinterTest
Tests run: 17, Failures: 0, Errors: 0, Skipped: 0, Time elapsed: 0.009 sec - in org.apache.commons.lang3.time.FastDateFormat_PrinterTest
Running org.apache.commons.lang3.time.FastDatePrinterTest
Tests run: 17, Failures: 0, Errors: 0, Skipped: 0, Time elapsed: 0.005 sec - in org.apache.commons.lang3.time.FastDatePrinterTest
Running org.apache.commons.lang3.time.FastDateParserSDFTest
Tests run: 276, Failures: 4, Errors: 0, Skipped: 92, Time elapsed: 0.089 sec <<< FAILURE! - in org.apache.commons.lang3.time.FastDateParserSDFTest
testUpperCasePP[0: z yyyy GMT 2010 en_GB](org.apache.commons.lang3.time.FastDateParserSDFTest)  Time elapsed: 0.004 sec  <<< FAILURE!
java.lang.AssertionError: Expected FDF to parse full string java.text.ParsePosition[index=0,errorIndex=-1] expected:<8> but was:<0>
	at org.junit.Assert.fail(Assert.java:88)
	at org.junit.Assert.failNotEquals(Assert.java:834)
	at org.junit.Assert.assertEquals(Assert.java:645)
	at org.apache.commons.lang3.time.FastDateParserSDFTest.checkParsePosition(FastDateParserSDFTest.java:221)
	at org.apache.commons.lang3.time.FastDateParserSDFTest.testUpperCasePP(FastDateParserSDFTest.java:137)

testUpperCase[0: z yyyy GMT 2010 en_GB](org.apache.commons.lang3.time.FastDateParserSDFTest)  Time elapsed: 0.006 sec  <<< FAILURE!
java.lang.AssertionError: Expected FDP parse to succeed, but got java.text.ParseException: Unparseable date: "GMT 2010" does not match (GMT[+-]\d{1,2}:\d{2}|[+-]\d{4}|\QACDT\E|\QAcre Time\E|\QADT\E|\QAEDT\E|\QAfghanistan Time\E|\QAKDT\E|\QAlaska Daylight Time\E|\QAlaska Standard Time\E|\QAlma-Ata Time\E|\QAmazon Summer Time\E|\QAmazon Time\E|\QAMST\E|\QAnadyr Time\E|\QAqtau Time\E|\QAqtobe Time\E|\QArabia Standard Time\E|\QArgentine Time\E|\QArmenia Time\E|\QAtlantic Daylight Time\E|\QAtlantic Standard Time\E|\QAustralian Central Daylight Time (South Australia)\E|\QAustralian Central Daylight Time (South Australia/New South Wales)\E|\QAustralian Central Standard Time (Northern Territory)\E|\QAustralian Central Standard Time (South Australia)\E|\QAustralian Central Standard Time (South Australia/New South Wales)\E|\QAustralian Central Western Standard Time\E|\QAustralian Eastern Daylight Time (New South Wales)\E|\QAustralian Eastern Daylight Time (Tasmania)\E|\QAustralian Eastern Daylight Time (Victoria)\E|\QAustralian Eastern Standard Time (New South Wales)\E|\QAustralian Eastern Standard Time (Queensland)\E|\QAustralian Eastern Standard Time (Tasmania)\E|\QAustralian Eastern Standard Time (Victoria)\E|\QAustralian Western Standard Time\E|\QAzerbaijan Summer Time\E|\QAzerbaijan Time\E|\QAzores Summer Time\E|\QAzores Time\E|\QAZOST\E|\QAZST\E|\QBangladesh Time\E|\QBhutan Time\E|\QBolivia Time\E|\QBougainville Standard Time\E|\QBrasilia Summer Time\E|\QBrasilia Time\E|\QBritish Summer Time\E|\QBRST\E|\QBrunei Time\E|\QBST\E|\QCape Verde Time\E|\QCDT\E|\QCentral African Time\E|\QCentral Daylight Time\E|\QCentral European Summer Time\E|\QCentral European Time\E|\QCentral Indonesia Time\E|\QCentral Standard Time\E|\QCEST\E|\QCHADT\E|\QChamorro Standard Time\E|\QChatham Daylight Time\E|\QChatham Standard Time\E|\QChile Time\E|\QChina Standard Time\E|\QChoibalsan Summer Time\E|\QChoibalsan Time\E|\QCHOST\E|\QChristmas Island Time\E|\QChuuk Time\E|\QCocos Islands Time\E|\QColombia Time\E|\QCook Is. Time\E|\QCoordinated Universal Time\E|\QCuba Daylight Time\E|\QCuba Standard Time\E|\QDavis Time\E|\QDumont-d'Urville Time\E|\QEast Indonesia Time\E|\QEaster Is. Time\E|\QEastern African Time\E|\QEastern Daylight Time\E|\QEastern European Summer Time\E|\QEastern European Time\E|\QEastern Greenland Summer Time\E|\QEastern Greenland Time\E|\QEastern Standard Time\E|\QEcuador Time\E|\QEDT\E|\QEEST\E|\QEGST\E|\QFalkland Is. Time\E|\QFernando de Noronha Time\E|\QFiji Summer Time\E|\QFiji Time\E|\QFJST\E|\QFrench Guiana Time\E|\QFrench Southern & Antarctic Lands Time\E|\QGalapagos Time\E|\QGambier Time\E|\QGeorgia Time\E|\QGhana Mean Time\E|\QGilbert Is. Time\E|\QGreenwich Mean Time\E|\QGulf Standard Time\E|\QGuyana Time\E|\QHawaii Daylight Time\E|\QHawaii Standard Time\E|\QHDT\E|\QHong Kong Time\E|\QHovd Summer Time\E|\QHovd Time\E|\QHOVST\E|\QIDT\E|\QIndia Standard Time\E|\QIndian Ocean Territory Time\E|\QIndochina Time\E|\QIran Daylight Time\E|\QIran Standard Time\E|\QIRDT\E|\QIrish Summer Time\E|\QIrkutsk Time\E|\QIsrael Daylight Time\E|\QIsrael Standard Time\E|\QIST\E|\QJapan Standard Time\E|\QKhandyga Time\E|\QKirgizstan Time\E|\QKorea Standard Time\E|\QKosrae Time\E|\QKrasnoyarsk Time\E|\QLHDT\E|\QLine Is. Time\E|\QLord Howe Daylight Time\E|\QLord Howe Standard Time\E|\QMacquarie Island Standard Time\E|\QMagadan Time\E|\QMalaysia Time\E|\QMaldives Time\E|\QMarquesas Time\E|\QMarshall Islands Time\E|\QMauritius Time\E|\QMawson Time\E|\QMDT\E|\QMEST\E|\QMiddle Europe Summer Time\E|\QMiddle Europe Time\E|\QMoscow Standard Time\E|\QMountain Daylight Time\E|\QMountain Standard Time\E|\QMyanmar Time\E|\QNauru Time\E|\QNDT\E|\QNepal Time\E|\QNew Caledonia Time\E|\QNew Zealand Daylight Time\E|\QNew Zealand Standard Time\E|\QNewfoundland Daylight Time\E|\QNewfoundland Standard Time\E|\QNiue Time\E|\QNorfolk Time\E|\QNovosibirsk Time\E|\QNZDT\E|\QOmsk Time\E|\QOral Time\E|\QPacific Daylight Time\E|\QPacific Standard Time\E|\QPakistan Time\E|\QPalau Time\E|\QPapua New Guinea Time\E|\QParaguay Summer Time\E|\QParaguay Time\E|\QPDT\E|\QPeru Time\E|\QPetropavlovsk-Kamchatski Time\E|\QPhilippines Time\E|\QPhoenix Is. Time\E|\QPierre & Miquelon Daylight Time\E|\QPierre & Miquelon Standard Time\E|\QPitcairn Standard Time\E|\QPMDT\E|\QPohnpei Time\E|\QPYST\E|\QQyzylorda Time\E|\QReunion Time\E|\QRothera Time\E|\QSakhalin Time\E|\QSamara Time\E|\QSamoa Standard Time\E|\QSeychelles Time\E|\QSingapore Time\E|\QSolomon Is. Time\E|\QSouth Africa Standard Time\E|\QSouth Georgia Standard Time\E|\QSrednekolymsk Time\E|\QSuriname Time\E|\QSyowa Time\E|\QTahiti Time\E|\QTajikistan Time\E|\QTimor-Leste Time\E|\QTokelau Time\E|\QTonga Time\E|\QTurkmenistan Time\E|\QTuvalu Time\E|\QUlaanbaatar Summer Time\E|\QUlaanbaatar Time\E|\QULAST\E|\QUruguay Summer Time\E|\QUruguay Time\E|\QUst-Nera Time\E|\QUYST\E|\QUzbekistan Time\E|\QVanuatu Time\E|\QVenezuela Time\E|\QVladivostok Time\E|\QVostok Time\E|\QWake Time\E|\QWallis & Futuna Time\E|\QWAST\E|\QWEST\E|\QWest Indonesia Time\E|\QWest Samoa Daylight Time\E|\QWest Samoa Standard Time\E|\QWestern African Summer Time\E|\QWestern African Time\E|\QWestern European Summer Time\E|\QWestern European Time\E|\QWestern Greenland Summer Time\E|\QWestern Greenland Time\E|\QWGST\E|\QWSDT\E|\QXinjiang Standard Time\E|\QYakutsk Time\E|\QYekaterinburg Time\E)\Q \E(\p{Nd}++)
	at org.junit.Assert.fail(Assert.java:88)
	at org.apache.commons.lang3.time.FastDateParserSDFTest.checkParse(FastDateParserSDFTest.java:182)
	at org.apache.commons.lang3.time.FastDateParserSDFTest.testUpperCase(FastDateParserSDFTest.java:132)

testOriginalPP[0: z yyyy GMT 2010 en_GB](org.apache.commons.lang3.time.FastDateParserSDFTest)  Time elapsed: 0 sec  <<< FAILURE!
java.lang.AssertionError: Expected FDF to parse full string java.text.ParsePosition[index=0,errorIndex=-1] expected:<8> but was:<0>
	at org.junit.Assert.fail(Assert.java:88)
	at org.junit.Assert.failNotEquals(Assert.java:834)
	at org.junit.Assert.assertEquals(Assert.java:645)
	at org.apache.commons.lang3.time.FastDateParserSDFTest.checkParsePosition(FastDateParserSDFTest.java:221)
	at org.apache.commons.lang3.time.FastDateParserSDFTest.testOriginalPP(FastDateParserSDFTest.java:127)

testOriginal[0: z yyyy GMT 2010 en_GB](org.apache.commons.lang3.time.FastDateParserSDFTest)  Time elapsed: 0.002 sec  <<< FAILURE!
java.lang.AssertionError: Expected FDP parse to succeed, but got java.text.ParseException: Unparseable date: "GMT 2010" does not match (GMT[+-]\d{1,2}:\d{2}|[+-]\d{4}|\QACDT\E|\QAcre Time\E|\QADT\E|\QAEDT\E|\QAfghanistan Time\E|\QAKDT\E|\QAlaska Daylight Time\E|\QAlaska Standard Time\E|\QAlma-Ata Time\E|\QAmazon Summer Time\E|\QAmazon Time\E|\QAMST\E|\QAnadyr Time\E|\QAqtau Time\E|\QAqtobe Time\E|\QArabia Standard Time\E|\QArgentine Time\E|\QArmenia Time\E|\QAtlantic Daylight Time\E|\QAtlantic Standard Time\E|\QAustralian Central Daylight Time (South Australia)\E|\QAustralian Central Daylight Time (South Australia/New South Wales)\E|\QAustralian Central Standard Time (Northern Territory)\E|\QAustralian Central Standard Time (South Australia)\E|\QAustralian Central Standard Time (South Australia/New South Wales)\E|\QAustralian Central Western Standard Time\E|\QAustralian Eastern Daylight Time (New South Wales)\E|\QAustralian Eastern Daylight Time (Tasmania)\E|\QAustralian Eastern Daylight Time (Victoria)\E|\QAustralian Eastern Standard Time (New South Wales)\E|\QAustralian Eastern Standard Time (Queensland)\E|\QAustralian Eastern Standard Time (Tasmania)\E|\QAustralian Eastern Standard Time (Victoria)\E|\QAustralian Western Standard Time\E|\QAzerbaijan Summer Time\E|\QAzerbaijan Time\E|\QAzores Summer Time\E|\QAzores Time\E|\QAZOST\E|\QAZST\E|\QBangladesh Time\E|\QBhutan Time\E|\QBolivia Time\E|\QBougainville Standard Time\E|\QBrasilia Summer Time\E|\QBrasilia Time\E|\QBritish Summer Time\E|\QBRST\E|\QBrunei Time\E|\QBST\E|\QCape Verde Time\E|\QCDT\E|\QCentral African Time\E|\QCentral Daylight Time\E|\QCentral European Summer Time\E|\QCentral European Time\E|\QCentral Indonesia Time\E|\QCentral Standard Time\E|\QCEST\E|\QCHADT\E|\QChamorro Standard Time\E|\QChatham Daylight Time\E|\QChatham Standard Time\E|\QChile Time\E|\QChina Standard Time\E|\QChoibalsan Summer Time\E|\QChoibalsan Time\E|\QCHOST\E|\QChristmas Island Time\E|\QChuuk Time\E|\QCocos Islands Time\E|\QColombia Time\E|\QCook Is. Time\E|\QCoordinated Universal Time\E|\QCuba Daylight Time\E|\QCuba Standard Time\E|\QDavis Time\E|\QDumont-d'Urville Time\E|\QEast Indonesia Time\E|\QEaster Is. Time\E|\QEastern African Time\E|\QEastern Daylight Time\E|\QEastern European Summer Time\E|\QEastern European Time\E|\QEastern Greenland Summer Time\E|\QEastern Greenland Time\E|\QEastern Standard Time\E|\QEcuador Time\E|\QEDT\E|\QEEST\E|\QEGST\E|\QFalkland Is. Time\E|\QFernando de Noronha Time\E|\QFiji Summer Time\E|\QFiji Time\E|\QFJST\E|\QFrench Guiana Time\E|\QFrench Southern & Antarctic Lands Time\E|\QGalapagos Time\E|\QGambier Time\E|\QGeorgia Time\E|\QGhana Mean Time\E|\QGilbert Is. Time\E|\QGreenwich Mean Time\E|\QGulf Standard Time\E|\QGuyana Time\E|\QHawaii Daylight Time\E|\QHawaii Standard Time\E|\QHDT\E|\QHong Kong Time\E|\QHovd Summer Time\E|\QHovd Time\E|\QHOVST\E|\QIDT\E|\QIndia Standard Time\E|\QIndian Ocean Territory Time\E|\QIndochina Time\E|\QIran Daylight Time\E|\QIran Standard Time\E|\QIRDT\E|\QIrish Summer Time\E|\QIrkutsk Time\E|\QIsrael Daylight Time\E|\QIsrael Standard Time\E|\QIST\E|\QJapan Standard Time\E|\QKhandyga Time\E|\QKirgizstan Time\E|\QKorea Standard Time\E|\QKosrae Time\E|\QKrasnoyarsk Time\E|\QLHDT\E|\QLine Is. Time\E|\QLord Howe Daylight Time\E|\QLord Howe Standard Time\E|\QMacquarie Island Standard Time\E|\QMagadan Time\E|\QMalaysia Time\E|\QMaldives Time\E|\QMarquesas Time\E|\QMarshall Islands Time\E|\QMauritius Time\E|\QMawson Time\E|\QMDT\E|\QMEST\E|\QMiddle Europe Summer Time\E|\QMiddle Europe Time\E|\QMoscow Standard Time\E|\QMountain Daylight Time\E|\QMountain Standard Time\E|\QMyanmar Time\E|\QNauru Time\E|\QNDT\E|\QNepal Time\E|\QNew Caledonia Time\E|\QNew Zealand Daylight Time\E|\QNew Zealand Standard Time\E|\QNewfoundland Daylight Time\E|\QNewfoundland Standard Time\E|\QNiue Time\E|\QNorfolk Time\E|\QNovosibirsk Time\E|\QNZDT\E|\QOmsk Time\E|\QOral Time\E|\QPacific Daylight Time\E|\QPacific Standard Time\E|\QPakistan Time\E|\QPalau Time\E|\QPapua New Guinea Time\E|\QParaguay Summer Time\E|\QParaguay Time\E|\QPDT\E|\QPeru Time\E|\QPetropavlovsk-Kamchatski Time\E|\QPhilippines Time\E|\QPhoenix Is. Time\E|\QPierre & Miquelon Daylight Time\E|\QPierre & Miquelon Standard Time\E|\QPitcairn Standard Time\E|\QPMDT\E|\QPohnpei Time\E|\QPYST\E|\QQyzylorda Time\E|\QReunion Time\E|\QRothera Time\E|\QSakhalin Time\E|\QSamara Time\E|\QSamoa Standard Time\E|\QSeychelles Time\E|\QSingapore Time\E|\QSolomon Is. Time\E|\QSouth Africa Standard Time\E|\QSouth Georgia Standard Time\E|\QSrednekolymsk Time\E|\QSuriname Time\E|\QSyowa Time\E|\QTahiti Time\E|\QTajikistan Time\E|\QTimor-Leste Time\E|\QTokelau Time\E|\QTonga Time\E|\QTurkmenistan Time\E|\QTuvalu Time\E|\QUlaanbaatar Summer Time\E|\QUlaanbaatar Time\E|\QULAST\E|\QUruguay Summer Time\E|\QUruguay Time\E|\QUst-Nera Time\E|\QUYST\E|\QUzbekistan Time\E|\QVanuatu Time\E|\QVenezuela Time\E|\QVladivostok Time\E|\QVostok Time\E|\QWake Time\E|\QWallis & Futuna Time\E|\QWAST\E|\QWEST\E|\QWest Indonesia Time\E|\QWest Samoa Daylight Time\E|\QWest Samoa Standard Time\E|\QWestern African Summer Time\E|\QWestern African Time\E|\QWestern European Summer Time\E|\QWestern European Time\E|\QWestern Greenland Summer Time\E|\QWestern Greenland Time\E|\QWGST\E|\QWSDT\E|\QXinjiang Standard Time\E|\QYakutsk Time\E|\QYekaterinburg Time\E)\Q \E(\p{Nd}++)
	at org.junit.Assert.fail(Assert.java:88)
	at org.apache.commons.lang3.time.FastDateParserSDFTest.checkParse(FastDateParserSDFTest.java:182)
	at org.apache.commons.lang3.time.FastDateParserSDFTest.testOriginal(FastDateParserSDFTest.java:122)

Running org.apache.commons.lang3.time.DateUtilsTest
DateUtilsTest: Default Locale=en_US
Tests run: 38, Failures: 0, Errors: 0, Skipped: 0, Time elapsed: 0.005 sec - in org.apache.commons.lang3.time.DateUtilsTest
Running org.apache.commons.lang3.reflect.InheritanceUtilsTest
Tests run: 9, Failures: 0, Errors: 0, Skipped: 0, Time elapsed: 0.003 sec - in org.apache.commons.lang3.reflect.InheritanceUtilsTest
Running org.apache.commons.lang3.reflect.MethodUtilsTest
Tests run: 23, Failures: 0, Errors: 0, Skipped: 0, Time elapsed: 0.04 sec - in org.apache.commons.lang3.reflect.MethodUtilsTest
Running org.apache.commons.lang3.reflect.ConstructorUtilsTest
Tests run: 7, Failures: 0, Errors: 0, Skipped: 0, Time elapsed: 0.01 sec - in org.apache.commons.lang3.reflect.ConstructorUtilsTest
Running org.apache.commons.lang3.reflect.FieldUtilsTest
Tests run: 64, Failures: 0, Errors: 0, Skipped: 0, Time elapsed: 0.035 sec - in org.apache.commons.lang3.reflect.FieldUtilsTest
Running org.apache.commons.lang3.reflect.TypeLiteralTest
Tests run: 4, Failures: 0, Errors: 0, Skipped: 0, Time elapsed: 0 sec - in org.apache.commons.lang3.reflect.TypeLiteralTest
Running org.apache.commons.lang3.reflect.TypeUtilsTest
Tests run: 19, Failures: 0, Errors: 0, Skipped: 0, Time elapsed: 0.043 sec - in org.apache.commons.lang3.reflect.TypeUtilsTest
Running org.apache.commons.lang3.mutable.MutableByteTest
Tests run: 17, Failures: 0, Errors: 0, Skipped: 0, Time elapsed: 0.003 sec - in org.apache.commons.lang3.mutable.MutableByteTest
Running org.apache.commons.lang3.mutable.MutableShortTest
Tests run: 14, Failures: 0, Errors: 0, Skipped: 0, Time elapsed: 0.002 sec - in org.apache.commons.lang3.mutable.MutableShortTest
Running org.apache.commons.lang3.mutable.MutableIntTest
Tests run: 17, Failures: 0, Errors: 0, Skipped: 0, Time elapsed: 0.004 sec - in org.apache.commons.lang3.mutable.MutableIntTest
Running org.apache.commons.lang3.mutable.MutableDoubleTest
Tests run: 18, Failures: 0, Errors: 0, Skipped: 0, Time elapsed: 0.004 sec - in org.apache.commons.lang3.mutable.MutableDoubleTest
Running org.apache.commons.lang3.mutable.MutableFloatTest
Tests run: 18, Failures: 0, Errors: 0, Skipped: 0, Time elapsed: 0.002 sec - in org.apache.commons.lang3.mutable.MutableFloatTest
Running org.apache.commons.lang3.mutable.MutableLongTest
Tests run: 17, Failures: 0, Errors: 0, Skipped: 0, Time elapsed: 0.001 sec - in org.apache.commons.lang3.mutable.MutableLongTest
Running org.apache.commons.lang3.mutable.MutableBooleanTest
Tests run: 9, Failures: 0, Errors: 0, Skipped: 0, Time elapsed: 0.001 sec - in org.apache.commons.lang3.mutable.MutableBooleanTest
Running org.apache.commons.lang3.mutable.MutableObjectTest
Tests run: 5, Failures: 0, Errors: 0, Skipped: 0, Time elapsed: 0.001 sec - in org.apache.commons.lang3.mutable.MutableObjectTest
Running org.apache.commons.lang3.text.translate.UnicodeEscaperTest
Tests run: 3, Failures: 0, Errors: 0, Skipped: 0, Time elapsed: 0 sec - in org.apache.commons.lang3.text.translate.UnicodeEscaperTest
Running org.apache.commons.lang3.text.translate.EntityArraysTest
Tests run: 3, Failures: 0, Errors: 0, Skipped: 0, Time elapsed: 0 sec - in org.apache.commons.lang3.text.translate.EntityArraysTest
Running org.apache.commons.lang3.text.translate.UnicodeUnpairedSurrogateRemoverTest
Tests run: 2, Failures: 0, Errors: 0, Skipped: 0, Time elapsed: 0 sec - in org.apache.commons.lang3.text.translate.UnicodeUnpairedSurrogateRemoverTest
Running org.apache.commons.lang3.text.translate.NumericEntityUnescaperTest
Tests run: 3, Failures: 0, Errors: 0, Skipped: 0, Time elapsed: 0 sec - in org.apache.commons.lang3.text.translate.NumericEntityUnescaperTest
Running org.apache.commons.lang3.text.translate.NumericEntityEscaperTest
Tests run: 4, Failures: 0, Errors: 0, Skipped: 0, Time elapsed: 0 sec - in org.apache.commons.lang3.text.translate.NumericEntityEscaperTest
Running org.apache.commons.lang3.text.translate.LookupTranslatorTest
Tests run: 2, Failures: 0, Errors: 0, Skipped: 0, Time elapsed: 0 sec - in org.apache.commons.lang3.text.translate.LookupTranslatorTest
Running org.apache.commons.lang3.text.translate.UnicodeUnescaperTest
Tests run: 3, Failures: 0, Errors: 0, Skipped: 0, Time elapsed: 0.001 sec - in org.apache.commons.lang3.text.translate.UnicodeUnescaperTest
Running org.apache.commons.lang3.text.translate.OctalUnescaperTest
Tests run: 1, Failures: 0, Errors: 0, Skipped: 0, Time elapsed: 0 sec - in org.apache.commons.lang3.text.translate.OctalUnescaperTest
Running org.apache.commons.lang3.text.StrMatcherTest
Tests run: 14, Failures: 0, Errors: 0, Skipped: 0, Time elapsed: 0.001 sec - in org.apache.commons.lang3.text.StrMatcherTest
Running org.apache.commons.lang3.text.StrTokenizerTest
Tests run: 55, Failures: 0, Errors: 0, Skipped: 0, Time elapsed: 0.005 sec - in org.apache.commons.lang3.text.StrTokenizerTest
Running org.apache.commons.lang3.text.FormattableUtilsTest
Tests run: 5, Failures: 0, Errors: 0, Skipped: 0, Time elapsed: 0 sec - in org.apache.commons.lang3.text.FormattableUtilsTest
Running org.apache.commons.lang3.text.CompositeFormatTest
Tests run: 2, Failures: 0, Errors: 0, Skipped: 0, Time elapsed: 0 sec - in org.apache.commons.lang3.text.CompositeFormatTest
Running org.apache.commons.lang3.text.WordUtilsTest
Tests run: 12, Failures: 0, Errors: 0, Skipped: 0, Time elapsed: 0.001 sec - in org.apache.commons.lang3.text.WordUtilsTest
Running org.apache.commons.lang3.text.StrLookupTest
Tests run: 5, Failures: 0, Errors: 0, Skipped: 0, Time elapsed: 0.001 sec - in org.apache.commons.lang3.text.StrLookupTest
Running org.apache.commons.lang3.text.StrBuilderAppendInsertTest
Tests run: 51, Failures: 0, Errors: 0, Skipped: 0, Time elapsed: 0.015 sec - in org.apache.commons.lang3.text.StrBuilderAppendInsertTest
Running org.apache.commons.lang3.text.ExtendedMessageFormatTest
Tests run: 10, Failures: 0, Errors: 0, Skipped: 0, Time elapsed: 0.806 sec - in org.apache.commons.lang3.text.ExtendedMessageFormatTest
Running org.apache.commons.lang3.text.StrSubstitutorTest
Tests run: 40, Failures: 0, Errors: 0, Skipped: 0, Time elapsed: 0.034 sec - in org.apache.commons.lang3.text.StrSubstitutorTest
Running org.apache.commons.lang3.text.StrBuilderTest
Tests run: 90, Failures: 0, Errors: 0, Skipped: 0, Time elapsed: 0.057 sec - in org.apache.commons.lang3.text.StrBuilderTest
Running org.apache.commons.lang3.StringEscapeUtilsTest
Tests run: 28, Failures: 0, Errors: 0, Skipped: 0, Time elapsed: 0.503 sec - in org.apache.commons.lang3.StringEscapeUtilsTest
Running org.apache.commons.lang3.AnnotationUtilsTest
Tests run: 10, Failures: 0, Errors: 0, Skipped: 0, Time elapsed: 0.017 sec - in org.apache.commons.lang3.AnnotationUtilsTest
Running org.apache.commons.lang3.ConversionTest
Tests run: 42, Failures: 0, Errors: 0, Skipped: 0, Time elapsed: 0.013 sec - in org.apache.commons.lang3.ConversionTest
Running org.apache.commons.lang3.StringUtilsTrimEmptyTest
Tests run: 15, Failures: 0, Errors: 0, Skipped: 0, Time elapsed: 0.007 sec - in org.apache.commons.lang3.StringUtilsTrimEmptyTest
Running org.apache.commons.lang3.EnumUtilsTest
Tests run: 34, Failures: 0, Errors: 0, Skipped: 0, Time elapsed: 0.011 sec - in org.apache.commons.lang3.EnumUtilsTest
Running org.apache.commons.lang3.exception.ExceptionUtilsTest
Tests run: 28, Failures: 0, Errors: 0, Skipped: 0, Time elapsed: 0.031 sec - in org.apache.commons.lang3.exception.ExceptionUtilsTest
Running org.apache.commons.lang3.exception.DefaultExceptionContextTest
Tests run: 8, Failures: 0, Errors: 0, Skipped: 0, Time elapsed: 0.005 sec - in org.apache.commons.lang3.exception.DefaultExceptionContextTest
Running org.apache.commons.lang3.exception.ContextedExceptionTest
Tests run: 14, Failures: 0, Errors: 0, Skipped: 0, Time elapsed: 0.017 sec - in org.apache.commons.lang3.exception.ContextedExceptionTest
Running org.apache.commons.lang3.exception.ContextedRuntimeExceptionTest
Tests run: 14, Failures: 0, Errors: 0, Skipped: 0, Time elapsed: 0.015 sec - in org.apache.commons.lang3.exception.ContextedRuntimeExceptionTest
Running org.apache.commons.lang3.BitFieldTest
Tests run: 15, Failures: 0, Errors: 0, Skipped: 0, Time elapsed: 0.003 sec - in org.apache.commons.lang3.BitFieldTest
Running org.apache.commons.lang3.ArrayUtilsRemoveMultipleTest
Tests run: 55, Failures: 0, Errors: 0, Skipped: 0, Time elapsed: 0.018 sec - in org.apache.commons.lang3.ArrayUtilsRemoveMultipleTest
Running org.apache.commons.lang3.HashSetvBitSetTest
Ratio=8% array=100 count=1 extract=20001257 bitset=1792450
Ratio=9% array=100 count=10 extract=18466006 bitset=1808660
Ratio=12% array=100 count=50 extract=11058525 bitset=1379990
Ratio=4% array=100 count=100 extract=12701489 bitset=565154
Ratio=83% array=1000 count=10 extract=7579081 bitset=6346445
Ratio=68% array=1000 count=100 extract=15504290 bitset=10605060
Ratio=6% array=1000 count=500 extract=45629260 bitset=3099195
Ratio=1% array=1000 count=1000 extract=75610263 bitset=780908
Ratio=600% count=0 hash=352928 bits=2121081
Ratio=22% count=5 hash=1379608 bits=303668
Ratio=17% count=10 hash=1756610 bits=305510
Ratio=23% count=200 hash=21223039 bits=4888723
Ratio=14% count=50 hash=9412676 bits=1385448
Ratio=23% count=100 hash=9869524 bits=2338065
Ratio=20% count=1000 hash=87198678 bits=17593309
Ratio=19% count=2000 hash=180009858 bits=34843685
Tests run: 2, Failures: 0, Errors: 0, Skipped: 0, Time elapsed: 0.725 sec - in org.apache.commons.lang3.HashSetvBitSetTest
Running org.apache.commons.lang3.StringUtilsTest
Tests run: 124, Failures: 0, Errors: 0, Skipped: 0, Time elapsed: 0.166 sec - in org.apache.commons.lang3.StringUtilsTest
Running org.apache.commons.lang3.ArrayUtilsRemoveTest
Tests run: 19, Failures: 0, Errors: 0, Skipped: 0, Time elapsed: 0.001 sec - in org.apache.commons.lang3.ArrayUtilsRemoveTest
Running org.apache.commons.lang3.ObjectUtilsTest
Tests run: 36, Failures: 0, Errors: 0, Skipped: 0, Time elapsed: 0.01 sec - in org.apache.commons.lang3.ObjectUtilsTest
Running org.apache.commons.lang3.ClassPathUtilsTest
Tests run: 13, Failures: 0, Errors: 0, Skipped: 0, Time elapsed: 0.007 sec - in org.apache.commons.lang3.ClassPathUtilsTest
Running org.apache.commons.lang3.math.NumberUtilsTest
Tests run: 91, Failures: 0, Errors: 0, Skipped: 0, Time elapsed: 0.048 sec - in org.apache.commons.lang3.math.NumberUtilsTest
Running org.apache.commons.lang3.math.IEEE754rUtilsTest
Tests run: 3, Failures: 0, Errors: 0, Skipped: 0, Time elapsed: 0.003 sec - in org.apache.commons.lang3.math.IEEE754rUtilsTest
Running org.apache.commons.lang3.math.FractionTest
Tests run: 25, Failures: 0, Errors: 0, Skipped: 0, Time elapsed: 0.374 sec - in org.apache.commons.lang3.math.FractionTest
Running org.apache.commons.lang3.BooleanUtilsTest
Tests run: 72, Failures: 0, Errors: 0, Skipped: 0, Time elapsed: 0.014 sec - in org.apache.commons.lang3.BooleanUtilsTest
Running org.apache.commons.lang3.CharSequenceUtilsTest
Tests run: 2, Failures: 0, Errors: 0, Skipped: 0, Time elapsed: 0 sec - in org.apache.commons.lang3.CharSequenceUtilsTest
Running org.apache.commons.lang3.CharSetUtilsTest
Tests run: 11, Failures: 0, Errors: 0, Skipped: 0, Time elapsed: 0 sec - in org.apache.commons.lang3.CharSetUtilsTest
Running org.apache.commons.lang3.ArrayUtilsAddTest
Tests run: 13, Failures: 0, Errors: 0, Skipped: 0, Time elapsed: 0.003 sec - in org.apache.commons.lang3.ArrayUtilsAddTest
Running org.apache.commons.lang3.CharEncodingTest
Tests run: 6, Failures: 0, Errors: 0, Skipped: 0, Time elapsed: 0.025 sec - in org.apache.commons.lang3.CharEncodingTest
Running org.apache.commons.lang3.ClassUtilsTest
Tests run: 57, Failures: 0, Errors: 0, Skipped: 0, Time elapsed: 0.025 sec - in org.apache.commons.lang3.ClassUtilsTest
Running org.apache.commons.lang3.RangeTest
Tests run: 24, Failures: 0, Errors: 0, Skipped: 0, Time elapsed: 0.019 sec - in org.apache.commons.lang3.RangeTest
Running org.apache.commons.lang3.event.EventUtilsTest
Tests run: 8, Failures: 0, Errors: 0, Skipped: 0, Time elapsed: 0.006 sec - in org.apache.commons.lang3.event.EventUtilsTest
Running org.apache.commons.lang3.event.EventListenerSupportTest
Tests run: 9, Failures: 0, Errors: 0, Skipped: 0, Time elapsed: 0.023 sec - in org.apache.commons.lang3.event.EventListenerSupportTest
Running org.apache.commons.lang3.ArrayUtilsTest
Tests run: 205, Failures: 0, Errors: 0, Skipped: 0, Time elapsed: 0.059 sec - in org.apache.commons.lang3.ArrayUtilsTest
Running org.apache.commons.lang3.CharUtilsTest
Tests run: 24, Failures: 0, Errors: 0, Skipped: 0, Time elapsed: 0.005 sec - in org.apache.commons.lang3.CharUtilsTest
Running org.apache.commons.lang3.NotImplementedExceptionTest
Tests run: 1, Failures: 0, Errors: 0, Skipped: 0, Time elapsed: 0.001 sec - in org.apache.commons.lang3.NotImplementedExceptionTest
Running org.apache.commons.lang3.StringUtilsEqualsIndexOfTest
Tests run: 50, Failures: 0, Errors: 0, Skipped: 0, Time elapsed: 0.03 sec - in org.apache.commons.lang3.StringUtilsEqualsIndexOfTest
Running org.apache.commons.lang3.RandomUtilsTest
Tests run: 23, Failures: 0, Errors: 0, Skipped: 0, Time elapsed: 0.013 sec - in org.apache.commons.lang3.RandomUtilsTest

Results :

Failed tests: 
  FastDateParserSDFTest.testOriginalPP:127->checkParsePosition:221 Expected FDF to parse full string java.text.ParsePosition[index=0,errorIndex=-1] expected:<8> but was:<0>
  FastDateParserSDFTest.testOriginal:122->checkParse:182 Expected FDP parse to succeed, but got java.text.ParseException: Unparseable date: "GMT 2010" does not match (GMT[+-]\d{1,2}:\d{2}|[+-]\d{4}|\QACDT\E|\QAcre Time\E|\QADT\E|\QAEDT\E|\QAfghanistan Time\E|\QAKDT\E|\QAlaska Daylight Time\E|\QAlaska Standard Time\E|\QAlma-Ata Time\E|\QAmazon Summer Time\E|\QAmazon Time\E|\QAMST\E|\QAnadyr Time\E|\QAqtau Time\E|\QAqtobe Time\E|\QArabia Standard Time\E|\QArgentine Time\E|\QArmenia Time\E|\QAtlantic Daylight Time\E|\QAtlantic Standard Time\E|\QAustralian Central Daylight Time (South Australia)\E|\QAustralian Central Daylight Time (South Australia/New South Wales)\E|\QAustralian Central Standard Time (Northern Territory)\E|\QAustralian Central Standard Time (South Australia)\E|\QAustralian Central Standard Time (South Australia/New South Wales)\E|\QAustralian Central Western Standard Time\E|\QAustralian Eastern Daylight Time (New South Wales)\E|\QAustralian Eastern Daylight Time (Tasmania)\E|\QAustralian Eastern Daylight Time (Victoria)\E|\QAustralian Eastern Standard Time (New South Wales)\E|\QAustralian Eastern Standard Time (Queensland)\E|\QAustralian Eastern Standard Time (Tasmania)\E|\QAustralian Eastern Standard Time (Victoria)\E|\QAustralian Western Standard Time\E|\QAzerbaijan Summer Time\E|\QAzerbaijan Time\E|\QAzores Summer Time\E|\QAzores Time\E|\QAZOST\E|\QAZST\E|\QBangladesh Time\E|\QBhutan Time\E|\QBolivia Time\E|\QBougainville Standard Time\E|\QBrasilia Summer Time\E|\QBrasilia Time\E|\QBritish Summer Time\E|\QBRST\E|\QBrunei Time\E|\QBST\E|\QCape Verde Time\E|\QCDT\E|\QCentral African Time\E|\QCentral Daylight Time\E|\QCentral European Summer Time\E|\QCentral European Time\E|\QCentral Indonesia Time\E|\QCentral Standard Time\E|\QCEST\E|\QCHADT\E|\QChamorro Standard Time\E|\QChatham Daylight Time\E|\QChatham Standard Time\E|\QChile Time\E|\QChina Standard Time\E|\QChoibalsan Summer Time\E|\QChoibalsan Time\E|\QCHOST\E|\QChristmas Island Time\E|\QChuuk Time\E|\QCocos Islands Time\E|\QColombia Time\E|\QCook Is. Time\E|\QCoordinated Universal Time\E|\QCuba Daylight Time\E|\QCuba Standard Time\E|\QDavis Time\E|\QDumont-d'Urville Time\E|\QEast Indonesia Time\E|\QEaster Is. Time\E|\QEastern African Time\E|\QEastern Daylight Time\E|\QEastern European Summer Time\E|\QEastern European Time\E|\QEastern Greenland Summer Time\E|\QEastern Greenland Time\E|\QEastern Standard Time\E|\QEcuador Time\E|\QEDT\E|\QEEST\E|\QEGST\E|\QFalkland Is. Time\E|\QFernando de Noronha Time\E|\QFiji Summer Time\E|\QFiji Time\E|\QFJST\E|\QFrench Guiana Time\E|\QFrench Southern & Antarctic Lands Time\E|\QGalapagos Time\E|\QGambier Time\E|\QGeorgia Time\E|\QGhana Mean Time\E|\QGilbert Is. Time\E|\QGreenwich Mean Time\E|\QGulf Standard Time\E|\QGuyana Time\E|\QHawaii Daylight Time\E|\QHawaii Standard Time\E|\QHDT\E|\QHong Kong Time\E|\QHovd Summer Time\E|\QHovd Time\E|\QHOVST\E|\QIDT\E|\QIndia Standard Time\E|\QIndian Ocean Territory Time\E|\QIndochina Time\E|\QIran Daylight Time\E|\QIran Standard Time\E|\QIRDT\E|\QIrish Summer Time\E|\QIrkutsk Time\E|\QIsrael Daylight Time\E|\QIsrael Standard Time\E|\QIST\E|\QJapan Standard Time\E|\QKhandyga Time\E|\QKirgizstan Time\E|\QKorea Standard Time\E|\QKosrae Time\E|\QKrasnoyarsk Time\E|\QLHDT\E|\QLine Is. Time\E|\QLord Howe Daylight Time\E|\QLord Howe Standard Time\E|\QMacquarie Island Standard Time\E|\QMagadan Time\E|\QMalaysia Time\E|\QMaldives Time\E|\QMarquesas Time\E|\QMarshall Islands Time\E|\QMauritius Time\E|\QMawson Time\E|\QMDT\E|\QMEST\E|\QMiddle Europe Summer Time\E|\QMiddle Europe Time\E|\QMoscow Standard Time\E|\QMountain Daylight Time\E|\QMountain Standard Time\E|\QMyanmar Time\E|\QNauru Time\E|\QNDT\E|\QNepal Time\E|\QNew Caledonia Time\E|\QNew Zealand Daylight Time\E|\QNew Zealand Standard Time\E|\QNewfoundland Daylight Time\E|\QNewfoundland Standard Time\E|\QNiue Time\E|\QNorfolk Time\E|\QNovosibirsk Time\E|\QNZDT\E|\QOmsk Time\E|\QOral Time\E|\QPacific Daylight Time\E|\QPacific Standard Time\E|\QPakistan Time\E|\QPalau Time\E|\QPapua New Guinea Time\E|\QParaguay Summer Time\E|\QParaguay Time\E|\QPDT\E|\QPeru Time\E|\QPetropavlovsk-Kamchatski Time\E|\QPhilippines Time\E|\QPhoenix Is. Time\E|\QPierre & Miquelon Daylight Time\E|\QPierre & Miquelon Standard Time\E|\QPitcairn Standard Time\E|\QPMDT\E|\QPohnpei Time\E|\QPYST\E|\QQyzylorda Time\E|\QReunion Time\E|\QRothera Time\E|\QSakhalin Time\E|\QSamara Time\E|\QSamoa Standard Time\E|\QSeychelles Time\E|\QSingapore Time\E|\QSolomon Is. Time\E|\QSouth Africa Standard Time\E|\QSouth Georgia Standard Time\E|\QSrednekolymsk Time\E|\QSuriname Time\E|\QSyowa Time\E|\QTahiti Time\E|\QTajikistan Time\E|\QTimor-Leste Time\E|\QTokelau Time\E|\QTonga Time\E|\QTurkmenistan Time\E|\QTuvalu Time\E|\QUlaanbaatar Summer Time\E|\QUlaanbaatar Time\E|\QULAST\E|\QUruguay Summer Time\E|\QUruguay Time\E|\QUst-Nera Time\E|\QUYST\E|\QUzbekistan Time\E|\QVanuatu Time\E|\QVenezuela Time\E|\QVladivostok Time\E|\QVostok Time\E|\QWake Time\E|\QWallis & Futuna Time\E|\QWAST\E|\QWEST\E|\QWest Indonesia Time\E|\QWest Samoa Daylight Time\E|\QWest Samoa Standard Time\E|\QWestern African Summer Time\E|\QWestern African Time\E|\QWestern European Summer Time\E|\QWestern European Time\E|\QWestern Greenland Summer Time\E|\QWestern Greenland Time\E|\QWGST\E|\QWSDT\E|\QXinjiang Standard Time\E|\QYakutsk Time\E|\QYekaterinburg Time\E)\Q \E(\p{Nd}++)
  FastDateParserSDFTest.testUpperCasePP:137->checkParsePosition:221 Expected FDF to parse full string java.text.ParsePosition[index=0,errorIndex=-1] expected:<8> but was:<0>
  FastDateParserSDFTest.testUpperCase:132->checkParse:182 Expected FDP parse to succeed, but got java.text.ParseException: Unparseable date: "GMT 2010" does not match (GMT[+-]\d{1,2}:\d{2}|[+-]\d{4}|\QACDT\E|\QAcre Time\E|\QADT\E|\QAEDT\E|\QAfghanistan Time\E|\QAKDT\E|\QAlaska Daylight Time\E|\QAlaska Standard Time\E|\QAlma-Ata Time\E|\QAmazon Summer Time\E|\QAmazon Time\E|\QAMST\E|\QAnadyr Time\E|\QAqtau Time\E|\QAqtobe Time\E|\QArabia Standard Time\E|\QArgentine Time\E|\QArmenia Time\E|\QAtlantic Daylight Time\E|\QAtlantic Standard Time\E|\QAustralian Central Daylight Time (South Australia)\E|\QAustralian Central Daylight Time (South Australia/New South Wales)\E|\QAustralian Central Standard Time (Northern Territory)\E|\QAustralian Central Standard Time (South Australia)\E|\QAustralian Central Standard Time (South Australia/New South Wales)\E|\QAustralian Central Western Standard Time\E|\QAustralian Eastern Daylight Time (New South Wales)\E|\QAustralian Eastern Daylight Time (Tasmania)\E|\QAustralian Eastern Daylight Time (Victoria)\E|\QAustralian Eastern Standard Time (New South Wales)\E|\QAustralian Eastern Standard Time (Queensland)\E|\QAustralian Eastern Standard Time (Tasmania)\E|\QAustralian Eastern Standard Time (Victoria)\E|\QAustralian Western Standard Time\E|\QAzerbaijan Summer Time\E|\QAzerbaijan Time\E|\QAzores Summer Time\E|\QAzores Time\E|\QAZOST\E|\QAZST\E|\QBangladesh Time\E|\QBhutan Time\E|\QBolivia Time\E|\QBougainville Standard Time\E|\QBrasilia Summer Time\E|\QBrasilia Time\E|\QBritish Summer Time\E|\QBRST\E|\QBrunei Time\E|\QBST\E|\QCape Verde Time\E|\QCDT\E|\QCentral African Time\E|\QCentral Daylight Time\E|\QCentral European Summer Time\E|\QCentral European Time\E|\QCentral Indonesia Time\E|\QCentral Standard Time\E|\QCEST\E|\QCHADT\E|\QChamorro Standard Time\E|\QChatham Daylight Time\E|\QChatham Standard Time\E|\QChile Time\E|\QChina Standard Time\E|\QChoibalsan Summer Time\E|\QChoibalsan Time\E|\QCHOST\E|\QChristmas Island Time\E|\QChuuk Time\E|\QCocos Islands Time\E|\QColombia Time\E|\QCook Is. Time\E|\QCoordinated Universal Time\E|\QCuba Daylight Time\E|\QCuba Standard Time\E|\QDavis Time\E|\QDumont-d'Urville Time\E|\QEast Indonesia Time\E|\QEaster Is. Time\E|\QEastern African Time\E|\QEastern Daylight Time\E|\QEastern European Summer Time\E|\QEastern European Time\E|\QEastern Greenland Summer Time\E|\QEastern Greenland Time\E|\QEastern Standard Time\E|\QEcuador Time\E|\QEDT\E|\QEEST\E|\QEGST\E|\QFalkland Is. Time\E|\QFernando de Noronha Time\E|\QFiji Summer Time\E|\QFiji Time\E|\QFJST\E|\QFrench Guiana Time\E|\QFrench Southern & Antarctic Lands Time\E|\QGalapagos Time\E|\QGambier Time\E|\QGeorgia Time\E|\QGhana Mean Time\E|\QGilbert Is. Time\E|\QGreenwich Mean Time\E|\QGulf Standard Time\E|\QGuyana Time\E|\QHawaii Daylight Time\E|\QHawaii Standard Time\E|\QHDT\E|\QHong Kong Time\E|\QHovd Summer Time\E|\QHovd Time\E|\QHOVST\E|\QIDT\E|\QIndia Standard Time\E|\QIndian Ocean Territory Time\E|\QIndochina Time\E|\QIran Daylight Time\E|\QIran Standard Time\E|\QIRDT\E|\QIrish Summer Time\E|\QIrkutsk Time\E|\QIsrael Daylight Time\E|\QIsrael Standard Time\E|\QIST\E|\QJapan Standard Time\E|\QKhandyga Time\E|\QKirgizstan Time\E|\QKorea Standard Time\E|\QKosrae Time\E|\QKrasnoyarsk Time\E|\QLHDT\E|\QLine Is. Time\E|\QLord Howe Daylight Time\E|\QLord Howe Standard Time\E|\QMacquarie Island Standard Time\E|\QMagadan Time\E|\QMalaysia Time\E|\QMaldives Time\E|\QMarquesas Time\E|\QMarshall Islands Time\E|\QMauritius Time\E|\QMawson Time\E|\QMDT\E|\QMEST\E|\QMiddle Europe Summer Time\E|\QMiddle Europe Time\E|\QMoscow Standard Time\E|\QMountain Daylight Time\E|\QMountain Standard Time\E|\QMyanmar Time\E|\QNauru Time\E|\QNDT\E|\QNepal Time\E|\QNew Caledonia Time\E|\QNew Zealand Daylight Time\E|\QNew Zealand Standard Time\E|\QNewfoundland Daylight Time\E|\QNewfoundland Standard Time\E|\QNiue Time\E|\QNorfolk Time\E|\QNovosibirsk Time\E|\QNZDT\E|\QOmsk Time\E|\QOral Time\E|\QPacific Daylight Time\E|\QPacific Standard Time\E|\QPakistan Time\E|\QPalau Time\E|\QPapua New Guinea Time\E|\QParaguay Summer Time\E|\QParaguay Time\E|\QPDT\E|\QPeru Time\E|\QPetropavlovsk-Kamchatski Time\E|\QPhilippines Time\E|\QPhoenix Is. Time\E|\QPierre & Miquelon Daylight Time\E|\QPierre & Miquelon Standard Time\E|\QPitcairn Standard Time\E|\QPMDT\E|\QPohnpei Time\E|\QPYST\E|\QQyzylorda Time\E|\QReunion Time\E|\QRothera Time\E|\QSakhalin Time\E|\QSamara Time\E|\QSamoa Standard Time\E|\QSeychelles Time\E|\QSingapore Time\E|\QSolomon Is. Time\E|\QSouth Africa Standard Time\E|\QSouth Georgia Standard Time\E|\QSrednekolymsk Time\E|\QSuriname Time\E|\QSyowa Time\E|\QTahiti Time\E|\QTajikistan Time\E|\QTimor-Leste Time\E|\QTokelau Time\E|\QTonga Time\E|\QTurkmenistan Time\E|\QTuvalu Time\E|\QUlaanbaatar Summer Time\E|\QUlaanbaatar Time\E|\QULAST\E|\QUruguay Summer Time\E|\QUruguay Time\E|\QUst-Nera Time\E|\QUYST\E|\QUzbekistan Time\E|\QVanuatu Time\E|\QVenezuela Time\E|\QVladivostok Time\E|\QVostok Time\E|\QWake Time\E|\QWallis & Futuna Time\E|\QWAST\E|\QWEST\E|\QWest Indonesia Time\E|\QWest Samoa Daylight Time\E|\QWest Samoa Standard Time\E|\QWestern African Summer Time\E|\QWestern African Time\E|\QWestern European Summer Time\E|\QWestern European Time\E|\QWestern Greenland Summer Time\E|\QWestern Greenland Time\E|\QWGST\E|\QWSDT\E|\QXinjiang Standard Time\E|\QYakutsk Time\E|\QYekaterinburg Time\E)\Q \E(\p{Nd}++)



Tests run: 3526, Failures: 4, Errors: 0, Skipped: 97

[INFO] ------------------------------------------------------------------------
[INFO] BUILD FAILURE
[INFO] ------------------------------------------------------------------------
[INFO] Total time: 38.208s
[INFO] Finished at: Wed Aug 05 09:42:16 BST 2015
[INFO] Final Memory: 25M/499M
[INFO] ------------------------------------------------------------------------
[ERROR] Failed to execute goal org.apache.maven.plugins:maven-surefire-plugin:2.18:test (default-test) on project commons-lang3: There are test failures.
[ERROR] 
[ERROR] Please refer to /home/perham/Study/LittleDarwin/Cases/commons-lang3-3.4-src/target/surefire-reports for the individual test results.
[ERROR] -> [Help 1]
[ERROR] 
[ERROR] To see the full stack trace of the errors, re-run Maven with the -e switch.
[ERROR] Re-run Maven using the -X switch to enable full debug logging.
[ERROR] 
[ERROR] For more information about the errors and possible solutions, please read the following articles:
[ERROR] [Help 1] http://cwiki.apache.org/confluence/display/MAVEN/MojoFailureException
