[INFO] Scanning for projects...
[INFO]                                                                         
[INFO] ------------------------------------------------------------------------
[INFO] Building Apache Commons Lang 3.4
[INFO] ------------------------------------------------------------------------
[INFO] 
[INFO] --- maven-enforcer-plugin:1.3.1:enforce (enforce-maven-3) @ commons-lang3 ---
[INFO] 
[INFO] --- build-helper-maven-plugin:1.8:parse-version (parse-version) @ commons-lang3 ---
[INFO] 
[INFO] --- maven-antrun-plugin:1.8:run (javadoc.resources) @ commons-lang3 ---
[INFO] Executing tasks

main:
[INFO] Executed tasks
[INFO] 
[INFO] --- maven-remote-resources-plugin:1.5:process (default) @ commons-lang3 ---
[INFO] 
[INFO] --- buildnumber-maven-plugin:1.3:create (default) @ commons-lang3 ---
[INFO] Executing: /bin/sh -c cd /home/perham/Study/LittleDarwin/Cases/commons-lang3-3.4-src && svn --non-interactive info
[INFO] Working directory: /home/perham/Study/LittleDarwin/Cases/commons-lang3-3.4-src
[INFO] Storing buildNumber: ?????? at timestamp: 1438764060938
[INFO] Executing: /bin/sh -c cd /home/perham/Study/LittleDarwin/Cases/commons-lang3-3.4-src && svn --non-interactive info
[INFO] Working directory: /home/perham/Study/LittleDarwin/Cases/commons-lang3-3.4-src
[INFO] Storing buildScmBranch: UNKNOWN_BRANCH
[INFO] 
[INFO] --- maven-resources-plugin:2.7:resources (default-resources) @ commons-lang3 ---
[INFO] Using 'ISO-8859-1' encoding to copy filtered resources.
[INFO] Copying 0 resource
[INFO] Copying 2 resources to META-INF
[INFO] 
[INFO] --- maven-compiler-plugin:3.2:compile (default-compile) @ commons-lang3 ---
[INFO] Changes detected - recompiling the module!
[INFO] Compiling 133 source files to /home/perham/Study/LittleDarwin/Cases/commons-lang3-3.4-src/target/classes
[INFO] /home/perham/Study/LittleDarwin/Cases/commons-lang3-3.4-src/src/main/java/org/apache/commons/lang3/SerializationUtils.java: /home/perham/Study/LittleDarwin/Cases/commons-lang3-3.4-src/src/main/java/org/apache/commons/lang3/SerializationUtils.java uses unchecked or unsafe operations.
[INFO] /home/perham/Study/LittleDarwin/Cases/commons-lang3-3.4-src/src/main/java/org/apache/commons/lang3/SerializationUtils.java: Recompile with -Xlint:unchecked for details.
[INFO] 
[INFO] --- maven-bundle-plugin:2.5.3:manifest (bundle-manifest) @ commons-lang3 ---
[INFO] 
[INFO] --- animal-sniffer-maven-plugin:1.13:check (checkAPIcompatibility) @ commons-lang3 ---
[INFO] Checking unresolved references to org.codehaus.mojo.signature:java16:1.0
[INFO] 
[INFO] --- maven-resources-plugin:2.7:testResources (default-testResources) @ commons-lang3 ---
[INFO] Using 'ISO-8859-1' encoding to copy filtered resources.
[INFO] Copying 2 resources
[INFO] Copying 2 resources to META-INF
[INFO] 
[INFO] --- maven-compiler-plugin:3.2:testCompile (default-testCompile) @ commons-lang3 ---
[INFO] Nothing to compile - all classes are up to date
[INFO] 
[INFO] --- maven-surefire-plugin:2.18:test (default-test) @ commons-lang3 ---
[INFO] Surefire report directory: /home/perham/Study/LittleDarwin/Cases/commons-lang3-3.4-src/target/surefire-reports

-------------------------------------------------------
 T E S T S
-------------------------------------------------------
Running org.apache.commons.lang3.ValidateTest
Tests run: 63, Failures: 0, Errors: 0, Skipped: 0, Time elapsed: 0.036 sec - in org.apache.commons.lang3.ValidateTest
Running org.apache.commons.lang3.LocaleUtilsTest
Tests run: 15, Failures: 0, Errors: 0, Skipped: 0, Time elapsed: 0.021 sec - in org.apache.commons.lang3.LocaleUtilsTest
Running org.apache.commons.lang3.tuple.MutableTripleTest
Tests run: 8, Failures: 0, Errors: 0, Skipped: 0, Time elapsed: 0 sec - in org.apache.commons.lang3.tuple.MutableTripleTest
Running org.apache.commons.lang3.tuple.TripleTest
Tests run: 10, Failures: 0, Errors: 0, Skipped: 0, Time elapsed: 0.003 sec - in org.apache.commons.lang3.tuple.TripleTest
Running org.apache.commons.lang3.tuple.ImmutablePairTest
Tests run: 6, Failures: 0, Errors: 0, Skipped: 0, Time elapsed: 0.001 sec - in org.apache.commons.lang3.tuple.ImmutablePairTest
Running org.apache.commons.lang3.tuple.MutablePairTest
Tests run: 8, Failures: 0, Errors: 0, Skipped: 0, Time elapsed: 0 sec - in org.apache.commons.lang3.tuple.MutablePairTest
Running org.apache.commons.lang3.tuple.ImmutableTripleTest
Tests run: 6, Failures: 0, Errors: 0, Skipped: 0, Time elapsed: 0.001 sec - in org.apache.commons.lang3.tuple.ImmutableTripleTest
Running org.apache.commons.lang3.tuple.PairTest
Tests run: 9, Failures: 0, Errors: 0, Skipped: 0, Time elapsed: 0.001 sec - in org.apache.commons.lang3.tuple.PairTest
Running org.apache.commons.lang3.StringUtilsIsTest
Tests run: 8, Failures: 0, Errors: 0, Skipped: 0, Time elapsed: 0.013 sec - in org.apache.commons.lang3.StringUtilsIsTest
Running org.apache.commons.lang3.JavaVersionTest
Tests run: 3, Failures: 0, Errors: 0, Skipped: 0, Time elapsed: 0 sec - in org.apache.commons.lang3.JavaVersionTest
Running org.apache.commons.lang3.builder.NoFieldNamesToStringStyleTest
Tests run: 8, Failures: 0, Errors: 0, Skipped: 0, Time elapsed: 0.009 sec - in org.apache.commons.lang3.builder.NoFieldNamesToStringStyleTest
Running org.apache.commons.lang3.builder.ShortPrefixToStringStyleTest
Tests run: 8, Failures: 0, Errors: 0, Skipped: 0, Time elapsed: 0.002 sec - in org.apache.commons.lang3.builder.ShortPrefixToStringStyleTest
Running org.apache.commons.lang3.builder.DiffResultTest
Tests run: 9, Failures: 0, Errors: 0, Skipped: 0, Time elapsed: 0.022 sec - in org.apache.commons.lang3.builder.DiffResultTest
Running org.apache.commons.lang3.builder.CompareToBuilderTest
Tests run: 48, Failures: 0, Errors: 0, Skipped: 0, Time elapsed: 0.049 sec - in org.apache.commons.lang3.builder.CompareToBuilderTest
Running org.apache.commons.lang3.builder.MultilineRecursiveToStringStyleTest
Tests run: 10, Failures: 0, Errors: 0, Skipped: 0, Time elapsed: 0.007 sec - in org.apache.commons.lang3.builder.MultilineRecursiveToStringStyleTest
Running org.apache.commons.lang3.builder.RecursiveToStringStyleTest
Tests run: 8, Failures: 0, Errors: 0, Skipped: 0, Time elapsed: 0.001 sec - in org.apache.commons.lang3.builder.RecursiveToStringStyleTest
Running org.apache.commons.lang3.builder.DefaultToStringStyleTest
Tests run: 8, Failures: 0, Errors: 0, Skipped: 0, Time elapsed: 0.001 sec - in org.apache.commons.lang3.builder.DefaultToStringStyleTest
Running org.apache.commons.lang3.builder.ReflectionToStringBuilderExcludeTest
Tests run: 11, Failures: 0, Errors: 0, Skipped: 0, Time elapsed: 0 sec - in org.apache.commons.lang3.builder.ReflectionToStringBuilderExcludeTest
Running org.apache.commons.lang3.builder.StandardToStringStyleTest
Tests run: 8, Failures: 0, Errors: 0, Skipped: 0, Time elapsed: 0.003 sec - in org.apache.commons.lang3.builder.StandardToStringStyleTest
Running org.apache.commons.lang3.builder.ToStringStyleTest
Tests run: 12, Failures: 0, Errors: 0, Skipped: 0, Time elapsed: 0.002 sec - in org.apache.commons.lang3.builder.ToStringStyleTest
Running org.apache.commons.lang3.builder.DiffTest
Tests run: 4, Failures: 0, Errors: 0, Skipped: 0, Time elapsed: 0 sec - in org.apache.commons.lang3.builder.DiffTest
Running org.apache.commons.lang3.builder.SimpleToStringStyleTest
Tests run: 8, Failures: 0, Errors: 0, Skipped: 0, Time elapsed: 0.001 sec - in org.apache.commons.lang3.builder.SimpleToStringStyleTest
Running org.apache.commons.lang3.builder.MultiLineToStringStyleTest
Tests run: 8, Failures: 0, Errors: 0, Skipped: 0, Time elapsed: 0.007 sec - in org.apache.commons.lang3.builder.MultiLineToStringStyleTest
Running org.apache.commons.lang3.builder.ToStringStyleConcurrencyTest
Tests run: 3, Failures: 0, Errors: 0, Skipped: 0, Time elapsed: 5.718 sec - in org.apache.commons.lang3.builder.ToStringStyleConcurrencyTest
Running org.apache.commons.lang3.builder.ReflectionToStringBuilderMutateInspectConcurrencyTest
Tests run: 1, Failures: 0, Errors: 0, Skipped: 1, Time elapsed: 0 sec - in org.apache.commons.lang3.builder.ReflectionToStringBuilderMutateInspectConcurrencyTest
Running org.apache.commons.lang3.builder.ToStringBuilderTest
Tests run: 74, Failures: 0, Errors: 0, Skipped: 1, Time elapsed: 0.053 sec - in org.apache.commons.lang3.builder.ToStringBuilderTest
Running org.apache.commons.lang3.builder.EqualsBuilderTest
Tests run: 48, Failures: 0, Errors: 0, Skipped: 0, Time elapsed: 0.035 sec - in org.apache.commons.lang3.builder.EqualsBuilderTest
Running org.apache.commons.lang3.builder.HashCodeBuilderAndEqualsBuilderTest
Tests run: 4, Failures: 0, Errors: 0, Skipped: 0, Time elapsed: 0.012 sec - in org.apache.commons.lang3.builder.HashCodeBuilderAndEqualsBuilderTest
Running org.apache.commons.lang3.builder.ReflectionToStringBuilderConcurrencyTest
Tests run: 3, Failures: 0, Errors: 0, Skipped: 3, Time elapsed: 0.002 sec - in org.apache.commons.lang3.builder.ReflectionToStringBuilderConcurrencyTest
Running org.apache.commons.lang3.builder.JsonToStringStyleTest
Tests run: 9, Failures: 0, Errors: 0, Skipped: 0, Time elapsed: 0.007 sec - in org.apache.commons.lang3.builder.JsonToStringStyleTest
Running org.apache.commons.lang3.builder.NoClassNameToStringStyleTest
Tests run: 8, Failures: 0, Errors: 0, Skipped: 0, Time elapsed: 0.006 sec - in org.apache.commons.lang3.builder.NoClassNameToStringStyleTest
Running org.apache.commons.lang3.builder.DiffBuilderTest
Tests run: 30, Failures: 0, Errors: 0, Skipped: 0, Time elapsed: 0.029 sec - in org.apache.commons.lang3.builder.DiffBuilderTest
Running org.apache.commons.lang3.builder.HashCodeBuilderTest
Tests run: 44, Failures: 0, Errors: 0, Skipped: 0, Time elapsed: 0.021 sec - in org.apache.commons.lang3.builder.HashCodeBuilderTest
Running org.apache.commons.lang3.concurrent.AtomicInitializerTest
Tests run: 3, Failures: 0, Errors: 0, Skipped: 0, Time elapsed: 0.013 sec - in org.apache.commons.lang3.concurrent.AtomicInitializerTest
Running org.apache.commons.lang3.concurrent.CallableBackgroundInitializerTest
Tests run: 4, Failures: 0, Errors: 0, Skipped: 0, Time elapsed: 0.002 sec - in org.apache.commons.lang3.concurrent.CallableBackgroundInitializerTest
Running org.apache.commons.lang3.concurrent.BackgroundInitializerTest
Tests run: 15, Failures: 0, Errors: 0, Skipped: 0, Time elapsed: 0.018 sec - in org.apache.commons.lang3.concurrent.BackgroundInitializerTest
Running org.apache.commons.lang3.concurrent.LazyInitializerTest
Tests run: 3, Failures: 0, Errors: 0, Skipped: 0, Time elapsed: 0.008 sec - in org.apache.commons.lang3.concurrent.LazyInitializerTest
Running org.apache.commons.lang3.concurrent.BasicThreadFactoryTest
Tests run: 15, Failures: 0, Errors: 0, Skipped: 0, Time elapsed: 0.034 sec - in org.apache.commons.lang3.concurrent.BasicThreadFactoryTest
Running org.apache.commons.lang3.concurrent.ConstantInitializerTest
Tests run: 7, Failures: 0, Errors: 0, Skipped: 0, Time elapsed: 0.005 sec - in org.apache.commons.lang3.concurrent.ConstantInitializerTest
Running org.apache.commons.lang3.concurrent.MultiBackgroundInitializerTest
Tests run: 17, Failures: 0, Errors: 0, Skipped: 0, Time elapsed: 0.065 sec - in org.apache.commons.lang3.concurrent.MultiBackgroundInitializerTest
Running org.apache.commons.lang3.concurrent.AtomicSafeInitializerTest
Tests run: 4, Failures: 0, Errors: 0, Skipped: 0, Time elapsed: 0.023 sec - in org.apache.commons.lang3.concurrent.AtomicSafeInitializerTest
Running org.apache.commons.lang3.concurrent.ConcurrentUtilsTest
Tests run: 40, Failures: 0, Errors: 0, Skipped: 0, Time elapsed: 0.016 sec - in org.apache.commons.lang3.concurrent.ConcurrentUtilsTest
Running org.apache.commons.lang3.concurrent.TimedSemaphoreTest
Tests run: 15, Failures: 0, Errors: 0, Skipped: 0, Time elapsed: 1.174 sec - in org.apache.commons.lang3.concurrent.TimedSemaphoreTest
Running org.apache.commons.lang3.StringUtilsSubstringTest
Tests run: 14, Failures: 0, Errors: 0, Skipped: 0, Time elapsed: 0.006 sec - in org.apache.commons.lang3.StringUtilsSubstringTest
Running org.apache.commons.lang3.SystemUtilsTest
Tests run: 12, Failures: 0, Errors: 0, Skipped: 0, Time elapsed: 0.003 sec - in org.apache.commons.lang3.SystemUtilsTest
Running org.apache.commons.lang3.CharRangeTest
Tests run: 16, Failures: 0, Errors: 0, Skipped: 0, Time elapsed: 0.038 sec - in org.apache.commons.lang3.CharRangeTest
Running org.apache.commons.lang3.CharSetTest
Tests run: 14, Failures: 0, Errors: 0, Skipped: 0, Time elapsed: 0.011 sec - in org.apache.commons.lang3.CharSetTest
Running org.apache.commons.lang3.StringUtilsStartsEndsWithTest
Tests run: 6, Failures: 0, Errors: 0, Skipped: 0, Time elapsed: 0.004 sec - in org.apache.commons.lang3.StringUtilsStartsEndsWithTest
Running org.apache.commons.lang3.RandomStringUtilsTest
Tests run: 11, Failures: 0, Errors: 0, Skipped: 0, Time elapsed: 0.038 sec - in org.apache.commons.lang3.RandomStringUtilsTest
Running org.apache.commons.lang3.SerializationUtilsTest
Tests run: 26, Failures: 0, Errors: 0, Skipped: 0, Time elapsed: 0.053 sec - in org.apache.commons.lang3.SerializationUtilsTest
Running org.apache.commons.lang3.time.StopWatchTest
Tests run: 8, Failures: 0, Errors: 0, Skipped: 0, Time elapsed: 4.757 sec - in org.apache.commons.lang3.time.StopWatchTest
Running org.apache.commons.lang3.time.DateUtilsRoundingTest
Tests run: 22, Failures: 0, Errors: 0, Skipped: 0, Time elapsed: 0.175 sec - in org.apache.commons.lang3.time.DateUtilsRoundingTest
Running org.apache.commons.lang3.time.FastDateParserTest
Tests run: 33, Failures: 0, Errors: 1, Skipped: 0, Time elapsed: 2.477 sec <<< FAILURE! - in org.apache.commons.lang3.time.FastDateParserTest
testParseZone(org.apache.commons.lang3.time.FastDateParserTest)  Time elapsed: 0.018 sec  <<< ERROR!
java.text.ParseException: Unparseable date: "2003-07-10T16:33:20.000 Eastern Daylight Time" does not match (\p{Nd}++)\Q-\E(\p{Nd}++)\Q-\E(\p{Nd}++)\QT\E(\p{Nd}++)\Q:\E(\p{Nd}++)\Q:\E(\p{Nd}++)\Q.\E(\p{Nd}++)\Q \E(GMT[+-]\d{1,2}:\d{2}|[+-]\d{4}|\QACDT\E|\QAcre Time\E|\QACST\E|\QACT\E|\QACWST\E|\QADT\E|\QAEDT\E|\QAEST\E|\QAfghanistan Time\E|\QAFT\E|\QAKDT\E|\QAKST\E|\QAlaska Standard Time\E|\QAlma-Ata Time\E|\QALMT\E|\QAmazon Time\E|\QAMST\E|\QAMT\E|\QAnadyr Time\E|\QANAT\E|\QAqtau Time\E|\QAqtobe Time\E|\QAQTT\E|\QArabia Standard Time\E|\QArgentine Time\E|\QArmenia Time\E|\QART\E|\QAST\E|\QAtlantic Standard Time\E|\QAustralian Central Standard Time (Northern Territory)\E|\QAustralian Central Standard Time (South Australia)\E|\QAustralian Central Standard Time (South Australia/New South Wales)\E|\QAustralian Central Western Standard Time\E|\QAustralian Eastern Standard Time (New South Wales)\E|\QAustralian Eastern Standard Time (Queensland)\E|\QAustralian Eastern Standard Time (Tasmania)\E|\QAustralian Eastern Standard Time (Victoria)\E|\QAustralian Western Standard Time\E|\QAWST\E|\QAzerbaijan Time\E|\QAzores Time\E|\QAZOST\E|\QAZOT\E|\QAZST\E|\QAZT\E|\QBangladesh Time\E|\QBDT\E|\QBhutan Time\E|\QBNT\E|\QBolivia Time\E|\QBOT\E|\QBougainville Standard Time\E|\QBrasilia Time\E|\QBRST\E|\QBRT\E|\QBrunei Time\E|\QBST\E|\QBTT\E|\QCape Verde Time\E|\QCAT\E|\QCCT\E|\QCDT\E|\QCentral African Time\E|\QCentral European Time\E|\QCentral Indonesia Time\E|\QCentral Standard Time\E|\QCEST\E|\QCET\E|\QCHADT\E|\QChamorro Standard Time\E|\QCHAST\E|\QChatham Standard Time\E|\QChile Time\E|\QChina Standard Time\E|\QChoibalsan Time\E|\QCHOST\E|\QCHOT\E|\QChristmas Island Time\E|\QChST\E|\QCHUT\E|\QChuuk Time\E|\QCKT\E|\QCLT\E|\QCocos Islands Time\E|\QColombia Time\E|\QCook Is. Time\E|\QCoordinated Universal Time\E|\QCOT\E|\QCST\E|\QCuba Standard Time\E|\QCVT\E|\QCXT\E|\QDavis Time\E|\QDAVT\E|\QDDUT\E|\QDumont-d'Urville Time\E|\QEAST\E|\QEast Indonesia Time\E|\QEaster Is. Time\E|\QEastern African Time\E|\QEastern European Time\E|\QEastern Greenland Time\E|\QEastern Standard Time\E|\QEAT\E|\QECT\E|\QEcuador Time\E|\QEDT\E|\QEEST\E|\QEET\E|\QEGST\E|\QEGT\E|\QEST\E|\QFalkland Is. Time\E|\QFernando de Noronha Time\E|\QFiji Time\E|\QFJST\E|\QFJT\E|\QFKT\E|\QFNT\E|\QFrench Guiana Time\E|\QFrench Southern & Antarctic Lands Time\E|\QGalapagos Time\E|\QGALT\E|\QGambier Time\E|\QGAMT\E|\QGeorgia Time\E|\QGET\E|\QGFT\E|\QGhana Mean Time\E|\QGilbert Is. Time\E|\QGILT\E|\QGMT\E|\QGreenwich Mean Time\E|\QGST\E|\QGulf Standard Time\E|\QGuyana Time\E|\QGYT\E|\QHawaii Standard Time\E|\QHDT\E|\QHKT\E|\QHong Kong Time\E|\QHovd Time\E|\QHOVST\E|\QHOVT\E|\QHST\E|\QICT\E|\QIDT\E|\QIndia Standard Time\E|\QIndian Ocean Territory Time\E|\QIndochina Time\E|\QIOT\E|\QIran Standard Time\E|\QIRDT\E|\QIRKT\E|\QIrkutsk Time\E|\QIRST\E|\QIsrael Standard Time\E|\QIST\E|\QJapan Standard Time\E|\QJST\E|\QKGT\E|\QKhandyga Time\E|\QKirgizstan Time\E|\QKorea Standard Time\E|\QKosrae Time\E|\QKOST\E|\QKrasnoyarsk Time\E|\QKRAT\E|\QKST\E|\QLHDT\E|\QLHST\E|\QLine Is. Time\E|\QLINT\E|\QLord Howe Standard Time\E|\QMacquarie Island Standard Time\E|\QMagadan Time\E|\QMAGT\E|\QMalaysia Time\E|\QMaldives Time\E|\QMarquesas Time\E|\QMarshall Islands Time\E|\QMART\E|\QMauritius Time\E|\QMawson Time\E|\QMAWT\E|\QMDT\E|\QMEST\E|\QMET\E|\QMHT\E|\QMiddle Europe Time\E|\QMIST\E|\QMMT\E|\QMoscow Standard Time\E|\QMountain Standard Time\E|\QMSK\E|\QMST\E|\QMUT\E|\QMVT\E|\QMyanmar Time\E|\QMYT\E|\QNauru Time\E|\QNCT\E|\QNDT\E|\QNepal Time\E|\QNew Caledonia Time\E|\QNew Zealand Standard Time\E|\QNewfoundland Standard Time\E|\QNFT\E|\QNiue Time\E|\QNorfolk Time\E|\QNovosibirsk Time\E|\QNOVT\E|\QNPT\E|\QNRT\E|\QNST\E|\QNUT\E|\QNZDT\E|\QNZST\E|\QOmsk Time\E|\QOMST\E|\QOral Time\E|\QORAT\E|\QPacific Standard Time\E|\QPakistan Time\E|\QPalau Time\E|\QPapua New Guinea Time\E|\QParaguay Time\E|\QPDT\E|\QPeru Time\E|\QPET\E|\QPetropavlovsk-Kamchatski Time\E|\QPETT\E|\QPGT\E|\QPhilippines Time\E|\QPhoenix Is. Time\E|\QPHOT\E|\QPHT\E|\QPierre & Miquelon Standard Time\E|\QPitcairn Standard Time\E|\QPKT\E|\QPMDT\E|\QPMST\E|\QPohnpei Time\E|\QPONT\E|\QPST\E|\QPWT\E|\QPYST\E|\QPYT\E|\QQYZT\E|\QQyzylorda Time\E|\QRET\E|\QReunion Time\E|\QRothera Time\E|\QROTT\E|\QSakhalin Time\E|\QSAKT\E|\QSamara Time\E|\QSamoa Standard Time\E|\QSAMT\E|\QSAST\E|\QSBT\E|\QSCT\E|\QSeychelles Time\E|\QSGT\E|\QSingapore Time\E|\QSolomon Is. Time\E|\QSouth Africa Standard Time\E|\QSouth Georgia Standard Time\E|\QSrednekolymsk Time\E|\QSRET\E|\QSRT\E|\QSST\E|\QSuriname Time\E|\QSYOT\E|\QSyowa Time\E|\QTahiti Time\E|\QTAHT\E|\QTajikistan Time\E|\QTFT\E|\QTimor-Leste Time\E|\QTJT\E|\QTKT\E|\QTLT\E|\QTMT\E|\QTokelau Time\E|\QTonga Time\E|\QTOT\E|\QTurkmenistan Time\E|\QTuvalu Time\E|\QTVT\E|\QUlaanbaatar Time\E|\QULAST\E|\QULAT\E|\QUruguay Time\E|\QUst-Nera Time\E|\QUTC\E|\QUYST\E|\QUYT\E|\QUzbekistan Time\E|\QUZT\E|\QVanuatu Time\E|\QVenezuela Time\E|\QVET\E|\QVladivostok Time\E|\QVLAT\E|\QVOST\E|\QVostok Time\E|\QVUT\E|\QWake Time\E|\QWAKT\E|\QWallis & Futuna Time\E|\QWAST\E|\QWAT\E|\QWEST\E|\QWest Indonesia Time\E|\QWest Samoa Standard Time\E|\QWestern African Time\E|\QWestern European Time\E|\QWestern Greenland Time\E|\QWET\E|\QWFT\E|\QWGST\E|\QWGT\E|\QWIB\E|\QWIT\E|\QWITA\E|\QWSDT\E|\QWSST\E|\QXinjiang Standard Time\E|\QXJT\E|\QYAKT\E|\QYakutsk Time\E|\QYekaterinburg Time\E|\QYEKT\E)
	at org.apache.commons.lang3.time.FastDateParser.parse(FastDateParser.java:90)
	at org.apache.commons.lang3.time.FastDateParserTest.testParseZone(FastDateParserTest.java:126)

Running org.apache.commons.lang3.time.FastDateFormat_ParserTest
Tests run: 33, Failures: 0, Errors: 1, Skipped: 0, Time elapsed: 0.785 sec <<< FAILURE! - in org.apache.commons.lang3.time.FastDateFormat_ParserTest
testParseZone(org.apache.commons.lang3.time.FastDateFormat_ParserTest)  Time elapsed: 0.005 sec  <<< ERROR!
java.text.ParseException: Unparseable date: "2003-07-10T16:33:20.000 Eastern Daylight Time" does not match (\p{Nd}++)\Q-\E(\p{Nd}++)\Q-\E(\p{Nd}++)\QT\E(\p{Nd}++)\Q:\E(\p{Nd}++)\Q:\E(\p{Nd}++)\Q.\E(\p{Nd}++)\Q \E(GMT[+-]\d{1,2}:\d{2}|[+-]\d{4}|\QACDT\E|\QAcre Time\E|\QACST\E|\QACT\E|\QACWST\E|\QADT\E|\QAEDT\E|\QAEST\E|\QAfghanistan Time\E|\QAFT\E|\QAKDT\E|\QAKST\E|\QAlaska Standard Time\E|\QAlma-Ata Time\E|\QALMT\E|\QAmazon Time\E|\QAMST\E|\QAMT\E|\QAnadyr Time\E|\QANAT\E|\QAqtau Time\E|\QAqtobe Time\E|\QAQTT\E|\QArabia Standard Time\E|\QArgentine Time\E|\QArmenia Time\E|\QART\E|\QAST\E|\QAtlantic Standard Time\E|\QAustralian Central Standard Time (Northern Territory)\E|\QAustralian Central Standard Time (South Australia)\E|\QAustralian Central Standard Time (South Australia/New South Wales)\E|\QAustralian Central Western Standard Time\E|\QAustralian Eastern Standard Time (New South Wales)\E|\QAustralian Eastern Standard Time (Queensland)\E|\QAustralian Eastern Standard Time (Tasmania)\E|\QAustralian Eastern Standard Time (Victoria)\E|\QAustralian Western Standard Time\E|\QAWST\E|\QAzerbaijan Time\E|\QAzores Time\E|\QAZOST\E|\QAZOT\E|\QAZST\E|\QAZT\E|\QBangladesh Time\E|\QBDT\E|\QBhutan Time\E|\QBNT\E|\QBolivia Time\E|\QBOT\E|\QBougainville Standard Time\E|\QBrasilia Time\E|\QBRST\E|\QBRT\E|\QBrunei Time\E|\QBST\E|\QBTT\E|\QCape Verde Time\E|\QCAT\E|\QCCT\E|\QCDT\E|\QCentral African Time\E|\QCentral European Time\E|\QCentral Indonesia Time\E|\QCentral Standard Time\E|\QCEST\E|\QCET\E|\QCHADT\E|\QChamorro Standard Time\E|\QCHAST\E|\QChatham Standard Time\E|\QChile Time\E|\QChina Standard Time\E|\QChoibalsan Time\E|\QCHOST\E|\QCHOT\E|\QChristmas Island Time\E|\QChST\E|\QCHUT\E|\QChuuk Time\E|\QCKT\E|\QCLT\E|\QCocos Islands Time\E|\QColombia Time\E|\QCook Is. Time\E|\QCoordinated Universal Time\E|\QCOT\E|\QCST\E|\QCuba Standard Time\E|\QCVT\E|\QCXT\E|\QDavis Time\E|\QDAVT\E|\QDDUT\E|\QDumont-d'Urville Time\E|\QEAST\E|\QEast Indonesia Time\E|\QEaster Is. Time\E|\QEastern African Time\E|\QEastern European Time\E|\QEastern Greenland Time\E|\QEastern Standard Time\E|\QEAT\E|\QECT\E|\QEcuador Time\E|\QEDT\E|\QEEST\E|\QEET\E|\QEGST\E|\QEGT\E|\QEST\E|\QFalkland Is. Time\E|\QFernando de Noronha Time\E|\QFiji Time\E|\QFJST\E|\QFJT\E|\QFKT\E|\QFNT\E|\QFrench Guiana Time\E|\QFrench Southern & Antarctic Lands Time\E|\QGalapagos Time\E|\QGALT\E|\QGambier Time\E|\QGAMT\E|\QGeorgia Time\E|\QGET\E|\QGFT\E|\QGhana Mean Time\E|\QGilbert Is. Time\E|\QGILT\E|\QGMT\E|\QGreenwich Mean Time\E|\QGST\E|\QGulf Standard Time\E|\QGuyana Time\E|\QGYT\E|\QHawaii Standard Time\E|\QHDT\E|\QHKT\E|\QHong Kong Time\E|\QHovd Time\E|\QHOVST\E|\QHOVT\E|\QHST\E|\QICT\E|\QIDT\E|\QIndia Standard Time\E|\QIndian Ocean Territory Time\E|\QIndochina Time\E|\QIOT\E|\QIran Standard Time\E|\QIRDT\E|\QIRKT\E|\QIrkutsk Time\E|\QIRST\E|\QIsrael Standard Time\E|\QIST\E|\QJapan Standard Time\E|\QJST\E|\QKGT\E|\QKhandyga Time\E|\QKirgizstan Time\E|\QKorea Standard Time\E|\QKosrae Time\E|\QKOST\E|\QKrasnoyarsk Time\E|\QKRAT\E|\QKST\E|\QLHDT\E|\QLHST\E|\QLine Is. Time\E|\QLINT\E|\QLord Howe Standard Time\E|\QMacquarie Island Standard Time\E|\QMagadan Time\E|\QMAGT\E|\QMalaysia Time\E|\QMaldives Time\E|\QMarquesas Time\E|\QMarshall Islands Time\E|\QMART\E|\QMauritius Time\E|\QMawson Time\E|\QMAWT\E|\QMDT\E|\QMEST\E|\QMET\E|\QMHT\E|\QMiddle Europe Time\E|\QMIST\E|\QMMT\E|\QMoscow Standard Time\E|\QMountain Standard Time\E|\QMSK\E|\QMST\E|\QMUT\E|\QMVT\E|\QMyanmar Time\E|\QMYT\E|\QNauru Time\E|\QNCT\E|\QNDT\E|\QNepal Time\E|\QNew Caledonia Time\E|\QNew Zealand Standard Time\E|\QNewfoundland Standard Time\E|\QNFT\E|\QNiue Time\E|\QNorfolk Time\E|\QNovosibirsk Time\E|\QNOVT\E|\QNPT\E|\QNRT\E|\QNST\E|\QNUT\E|\QNZDT\E|\QNZST\E|\QOmsk Time\E|\QOMST\E|\QOral Time\E|\QORAT\E|\QPacific Standard Time\E|\QPakistan Time\E|\QPalau Time\E|\QPapua New Guinea Time\E|\QParaguay Time\E|\QPDT\E|\QPeru Time\E|\QPET\E|\QPetropavlovsk-Kamchatski Time\E|\QPETT\E|\QPGT\E|\QPhilippines Time\E|\QPhoenix Is. Time\E|\QPHOT\E|\QPHT\E|\QPierre & Miquelon Standard Time\E|\QPitcairn Standard Time\E|\QPKT\E|\QPMDT\E|\QPMST\E|\QPohnpei Time\E|\QPONT\E|\QPST\E|\QPWT\E|\QPYST\E|\QPYT\E|\QQYZT\E|\QQyzylorda Time\E|\QRET\E|\QReunion Time\E|\QRothera Time\E|\QROTT\E|\QSakhalin Time\E|\QSAKT\E|\QSamara Time\E|\QSamoa Standard Time\E|\QSAMT\E|\QSAST\E|\QSBT\E|\QSCT\E|\QSeychelles Time\E|\QSGT\E|\QSingapore Time\E|\QSolomon Is. Time\E|\QSouth Africa Standard Time\E|\QSouth Georgia Standard Time\E|\QSrednekolymsk Time\E|\QSRET\E|\QSRT\E|\QSST\E|\QSuriname Time\E|\QSYOT\E|\QSyowa Time\E|\QTahiti Time\E|\QTAHT\E|\QTajikistan Time\E|\QTFT\E|\QTimor-Leste Time\E|\QTJT\E|\QTKT\E|\QTLT\E|\QTMT\E|\QTokelau Time\E|\QTonga Time\E|\QTOT\E|\QTurkmenistan Time\E|\QTuvalu Time\E|\QTVT\E|\QUlaanbaatar Time\E|\QULAST\E|\QULAT\E|\QUruguay Time\E|\QUst-Nera Time\E|\QUTC\E|\QUYST\E|\QUYT\E|\QUzbekistan Time\E|\QUZT\E|\QVanuatu Time\E|\QVenezuela Time\E|\QVET\E|\QVladivostok Time\E|\QVLAT\E|\QVOST\E|\QVostok Time\E|\QVUT\E|\QWake Time\E|\QWAKT\E|\QWallis & Futuna Time\E|\QWAST\E|\QWAT\E|\QWEST\E|\QWest Indonesia Time\E|\QWest Samoa Standard Time\E|\QWestern African Time\E|\QWestern European Time\E|\QWestern Greenland Time\E|\QWET\E|\QWFT\E|\QWGST\E|\QWGT\E|\QWIB\E|\QWIT\E|\QWITA\E|\QWSDT\E|\QWSST\E|\QXinjiang Standard Time\E|\QXJT\E|\QYAKT\E|\QYakutsk Time\E|\QYekaterinburg Time\E|\QYEKT\E)
	at org.apache.commons.lang3.time.FastDateParser.parse(FastDateParser.java:90)
	at org.apache.commons.lang3.time.FastDateFormat.parse(FastDateFormat.java:497)
	at org.apache.commons.lang3.time.FastDateParserTest.testParseZone(FastDateParserTest.java:126)
	at sun.reflect.NativeMethodAccessorImpl.invoke0(Native Method)
	at sun.reflect.NativeMethodAccessorImpl.invoke(NativeMethodAccessorImpl.java:57)
	at sun.reflect.DelegatingMethodAccessorImpl.invoke(DelegatingMethodAccessorImpl.java:43)
	at java.lang.reflect.Method.invoke(Method.java:606)
	at org.junit.runners.model.FrameworkMethod$1.runReflectiveCall(FrameworkMethod.java:50)
	at org.junit.internal.runners.model.ReflectiveCallable.run(ReflectiveCallable.java:12)
	at org.junit.runners.model.FrameworkMethod.invokeExplosively(FrameworkMethod.java:47)
	at org.junit.internal.runners.statements.InvokeMethod.evaluate(InvokeMethod.java:17)
	at org.junit.runners.ParentRunner.runLeaf(ParentRunner.java:325)
	at org.junit.runners.BlockJUnit4ClassRunner.runChild(BlockJUnit4ClassRunner.java:78)
	at org.junit.runners.BlockJUnit4ClassRunner.runChild(BlockJUnit4ClassRunner.java:57)
	at org.junit.runners.ParentRunner$3.run(ParentRunner.java:290)
	at org.junit.runners.ParentRunner$1.schedule(ParentRunner.java:71)
	at org.junit.runners.ParentRunner.runChildren(ParentRunner.java:288)
	at org.junit.runners.ParentRunner.access$000(ParentRunner.java:58)
	at org.junit.runners.ParentRunner$2.evaluate(ParentRunner.java:268)
	at org.junit.runners.ParentRunner.run(ParentRunner.java:363)
	at org.apache.maven.surefire.junit4.JUnit4Provider.execute(JUnit4Provider.java:283)
	at org.apache.maven.surefire.junit4.JUnit4Provider.executeWithRerun(JUnit4Provider.java:173)
	at org.apache.maven.surefire.junit4.JUnit4Provider.executeTestSet(JUnit4Provider.java:153)
	at org.apache.maven.surefire.junit4.JUnit4Provider.invoke(JUnit4Provider.java:128)
	at org.apache.maven.surefire.booter.ForkedBooter.invokeProviderInSameClassLoader(ForkedBooter.java:203)
	at org.apache.maven.surefire.booter.ForkedBooter.runSuitesInProcess(ForkedBooter.java:155)
	at org.apache.maven.surefire.booter.ForkedBooter.main(ForkedBooter.java:103)

Running org.apache.commons.lang3.time.DurationFormatUtilsTest
Tests run: 25, Failures: 0, Errors: 0, Skipped: 0, Time elapsed: 1.031 sec - in org.apache.commons.lang3.time.DurationFormatUtilsTest
Running org.apache.commons.lang3.time.DateFormatUtilsTest
Tests run: 10, Failures: 0, Errors: 0, Skipped: 0, Time elapsed: 0.001 sec - in org.apache.commons.lang3.time.DateFormatUtilsTest
Running org.apache.commons.lang3.time.DateUtilsFragmentTest
Tests run: 57, Failures: 0, Errors: 0, Skipped: 0, Time elapsed: 0.01 sec - in org.apache.commons.lang3.time.DateUtilsFragmentTest
Running org.apache.commons.lang3.time.FastDatePrinterTimeZonesTest
Tests run: 617, Failures: 0, Errors: 0, Skipped: 0, Time elapsed: 0.221 sec - in org.apache.commons.lang3.time.FastDatePrinterTimeZonesTest
Running org.apache.commons.lang3.time.FastDateFormatTest
>>FastDateFormatTest: FastDateParser:19567  SimpleDateFormat:4137
Tests run: 14, Failures: 0, Errors: 0, Skipped: 0, Time elapsed: 2.652 sec - in org.apache.commons.lang3.time.FastDateFormatTest
Running org.apache.commons.lang3.time.FastDateFormat_PrinterTest
Tests run: 17, Failures: 0, Errors: 0, Skipped: 0, Time elapsed: 0.01 sec - in org.apache.commons.lang3.time.FastDateFormat_PrinterTest
Running org.apache.commons.lang3.time.FastDatePrinterTest
Tests run: 17, Failures: 0, Errors: 0, Skipped: 0, Time elapsed: 0.006 sec - in org.apache.commons.lang3.time.FastDatePrinterTest
Running org.apache.commons.lang3.time.FastDateParserSDFTest
Tests run: 276, Failures: 0, Errors: 0, Skipped: 92, Time elapsed: 0.079 sec - in org.apache.commons.lang3.time.FastDateParserSDFTest
Running org.apache.commons.lang3.time.DateUtilsTest
DateUtilsTest: Default Locale=en_US
Tests run: 38, Failures: 0, Errors: 0, Skipped: 0, Time elapsed: 0.027 sec - in org.apache.commons.lang3.time.DateUtilsTest
Running org.apache.commons.lang3.reflect.InheritanceUtilsTest
Tests run: 9, Failures: 0, Errors: 0, Skipped: 0, Time elapsed: 0.003 sec - in org.apache.commons.lang3.reflect.InheritanceUtilsTest
Running org.apache.commons.lang3.reflect.MethodUtilsTest
Tests run: 23, Failures: 0, Errors: 0, Skipped: 0, Time elapsed: 0.058 sec - in org.apache.commons.lang3.reflect.MethodUtilsTest
Running org.apache.commons.lang3.reflect.ConstructorUtilsTest
Tests run: 7, Failures: 0, Errors: 0, Skipped: 0, Time elapsed: 0.006 sec - in org.apache.commons.lang3.reflect.ConstructorUtilsTest
Running org.apache.commons.lang3.reflect.FieldUtilsTest
Tests run: 64, Failures: 0, Errors: 0, Skipped: 0, Time elapsed: 0.036 sec - in org.apache.commons.lang3.reflect.FieldUtilsTest
Running org.apache.commons.lang3.reflect.TypeLiteralTest
Tests run: 4, Failures: 0, Errors: 0, Skipped: 0, Time elapsed: 0.005 sec - in org.apache.commons.lang3.reflect.TypeLiteralTest
Running org.apache.commons.lang3.reflect.TypeUtilsTest
Tests run: 19, Failures: 0, Errors: 0, Skipped: 0, Time elapsed: 0.039 sec - in org.apache.commons.lang3.reflect.TypeUtilsTest
Running org.apache.commons.lang3.mutable.MutableByteTest
Tests run: 17, Failures: 0, Errors: 0, Skipped: 0, Time elapsed: 0.004 sec - in org.apache.commons.lang3.mutable.MutableByteTest
Running org.apache.commons.lang3.mutable.MutableShortTest
Tests run: 14, Failures: 0, Errors: 0, Skipped: 0, Time elapsed: 0.006 sec - in org.apache.commons.lang3.mutable.MutableShortTest
Running org.apache.commons.lang3.mutable.MutableIntTest
Tests run: 17, Failures: 0, Errors: 0, Skipped: 0, Time elapsed: 0.008 sec - in org.apache.commons.lang3.mutable.MutableIntTest
Running org.apache.commons.lang3.mutable.MutableDoubleTest
Tests run: 18, Failures: 0, Errors: 0, Skipped: 0, Time elapsed: 0.009 sec - in org.apache.commons.lang3.mutable.MutableDoubleTest
Running org.apache.commons.lang3.mutable.MutableFloatTest
Tests run: 18, Failures: 0, Errors: 0, Skipped: 0, Time elapsed: 0.009 sec - in org.apache.commons.lang3.mutable.MutableFloatTest
Running org.apache.commons.lang3.mutable.MutableLongTest
Tests run: 17, Failures: 0, Errors: 0, Skipped: 0, Time elapsed: 0.009 sec - in org.apache.commons.lang3.mutable.MutableLongTest
Running org.apache.commons.lang3.mutable.MutableBooleanTest
Tests run: 9, Failures: 0, Errors: 0, Skipped: 0, Time elapsed: 0.005 sec - in org.apache.commons.lang3.mutable.MutableBooleanTest
Running org.apache.commons.lang3.mutable.MutableObjectTest
Tests run: 5, Failures: 0, Errors: 0, Skipped: 0, Time elapsed: 0.003 sec - in org.apache.commons.lang3.mutable.MutableObjectTest
Running org.apache.commons.lang3.text.translate.UnicodeEscaperTest
Tests run: 3, Failures: 0, Errors: 0, Skipped: 0, Time elapsed: 0.002 sec - in org.apache.commons.lang3.text.translate.UnicodeEscaperTest
Running org.apache.commons.lang3.text.translate.EntityArraysTest
Tests run: 3, Failures: 0, Errors: 0, Skipped: 0, Time elapsed: 0.002 sec - in org.apache.commons.lang3.text.translate.EntityArraysTest
Running org.apache.commons.lang3.text.translate.UnicodeUnpairedSurrogateRemoverTest
Tests run: 2, Failures: 0, Errors: 0, Skipped: 0, Time elapsed: 0.002 sec - in org.apache.commons.lang3.text.translate.UnicodeUnpairedSurrogateRemoverTest
Running org.apache.commons.lang3.text.translate.NumericEntityUnescaperTest
Tests run: 3, Failures: 0, Errors: 0, Skipped: 0, Time elapsed: 0.002 sec - in org.apache.commons.lang3.text.translate.NumericEntityUnescaperTest
Running org.apache.commons.lang3.text.translate.NumericEntityEscaperTest
Tests run: 4, Failures: 0, Errors: 0, Skipped: 0, Time elapsed: 0.002 sec - in org.apache.commons.lang3.text.translate.NumericEntityEscaperTest
Running org.apache.commons.lang3.text.translate.LookupTranslatorTest
Tests run: 2, Failures: 0, Errors: 0, Skipped: 0, Time elapsed: 0.002 sec - in org.apache.commons.lang3.text.translate.LookupTranslatorTest
Running org.apache.commons.lang3.text.translate.UnicodeUnescaperTest
Tests run: 3, Failures: 0, Errors: 0, Skipped: 0, Time elapsed: 0.001 sec - in org.apache.commons.lang3.text.translate.UnicodeUnescaperTest
Running org.apache.commons.lang3.text.translate.OctalUnescaperTest
Tests run: 1, Failures: 0, Errors: 0, Skipped: 0, Time elapsed: 0.001 sec - in org.apache.commons.lang3.text.translate.OctalUnescaperTest
Running org.apache.commons.lang3.text.StrMatcherTest
Tests run: 14, Failures: 0, Errors: 0, Skipped: 0, Time elapsed: 0.004 sec - in org.apache.commons.lang3.text.StrMatcherTest
Running org.apache.commons.lang3.text.StrTokenizerTest
Tests run: 55, Failures: 0, Errors: 0, Skipped: 0, Time elapsed: 0.013 sec - in org.apache.commons.lang3.text.StrTokenizerTest
Running org.apache.commons.lang3.text.FormattableUtilsTest
Tests run: 5, Failures: 0, Errors: 0, Skipped: 0, Time elapsed: 0.001 sec - in org.apache.commons.lang3.text.FormattableUtilsTest
Running org.apache.commons.lang3.text.CompositeFormatTest
Tests run: 2, Failures: 0, Errors: 0, Skipped: 0, Time elapsed: 0 sec - in org.apache.commons.lang3.text.CompositeFormatTest
Running org.apache.commons.lang3.text.WordUtilsTest
Tests run: 12, Failures: 0, Errors: 0, Skipped: 0, Time elapsed: 0.001 sec - in org.apache.commons.lang3.text.WordUtilsTest
Running org.apache.commons.lang3.text.StrLookupTest
Tests run: 5, Failures: 0, Errors: 0, Skipped: 0, Time elapsed: 0.002 sec - in org.apache.commons.lang3.text.StrLookupTest
Running org.apache.commons.lang3.text.StrBuilderAppendInsertTest
Tests run: 51, Failures: 0, Errors: 0, Skipped: 0, Time elapsed: 0.02 sec - in org.apache.commons.lang3.text.StrBuilderAppendInsertTest
Running org.apache.commons.lang3.text.ExtendedMessageFormatTest
Tests run: 10, Failures: 0, Errors: 0, Skipped: 0, Time elapsed: 0.893 sec - in org.apache.commons.lang3.text.ExtendedMessageFormatTest
Running org.apache.commons.lang3.text.StrSubstitutorTest
Tests run: 40, Failures: 0, Errors: 0, Skipped: 0, Time elapsed: 0.037 sec - in org.apache.commons.lang3.text.StrSubstitutorTest
Running org.apache.commons.lang3.text.StrBuilderTest
Tests run: 90, Failures: 0, Errors: 0, Skipped: 0, Time elapsed: 0.059 sec - in org.apache.commons.lang3.text.StrBuilderTest
Running org.apache.commons.lang3.StringEscapeUtilsTest
Tests run: 28, Failures: 0, Errors: 0, Skipped: 0, Time elapsed: 0.387 sec - in org.apache.commons.lang3.StringEscapeUtilsTest
Running org.apache.commons.lang3.AnnotationUtilsTest
Tests run: 10, Failures: 0, Errors: 0, Skipped: 0, Time elapsed: 0.019 sec - in org.apache.commons.lang3.AnnotationUtilsTest
Running org.apache.commons.lang3.ConversionTest
Tests run: 42, Failures: 0, Errors: 0, Skipped: 0, Time elapsed: 0.01 sec - in org.apache.commons.lang3.ConversionTest
Running org.apache.commons.lang3.StringUtilsTrimEmptyTest
Tests run: 15, Failures: 0, Errors: 0, Skipped: 0, Time elapsed: 0.006 sec - in org.apache.commons.lang3.StringUtilsTrimEmptyTest
Running org.apache.commons.lang3.EnumUtilsTest
Tests run: 34, Failures: 0, Errors: 0, Skipped: 0, Time elapsed: 0.015 sec - in org.apache.commons.lang3.EnumUtilsTest
Running org.apache.commons.lang3.exception.ExceptionUtilsTest
Tests run: 28, Failures: 0, Errors: 0, Skipped: 0, Time elapsed: 0.026 sec - in org.apache.commons.lang3.exception.ExceptionUtilsTest
Running org.apache.commons.lang3.exception.DefaultExceptionContextTest
Tests run: 8, Failures: 0, Errors: 0, Skipped: 0, Time elapsed: 0.004 sec - in org.apache.commons.lang3.exception.DefaultExceptionContextTest
Running org.apache.commons.lang3.exception.ContextedExceptionTest
Tests run: 14, Failures: 0, Errors: 0, Skipped: 0, Time elapsed: 0.011 sec - in org.apache.commons.lang3.exception.ContextedExceptionTest
Running org.apache.commons.lang3.exception.ContextedRuntimeExceptionTest
Tests run: 14, Failures: 0, Errors: 0, Skipped: 0, Time elapsed: 0.011 sec - in org.apache.commons.lang3.exception.ContextedRuntimeExceptionTest
Running org.apache.commons.lang3.BitFieldTest
Tests run: 15, Failures: 0, Errors: 0, Skipped: 0, Time elapsed: 0.002 sec - in org.apache.commons.lang3.BitFieldTest
Running org.apache.commons.lang3.ArrayUtilsRemoveMultipleTest
Tests run: 55, Failures: 0, Errors: 0, Skipped: 0, Time elapsed: 0.013 sec - in org.apache.commons.lang3.ArrayUtilsRemoveMultipleTest
Running org.apache.commons.lang3.HashSetvBitSetTest
Ratio=1332% array=100 count=1 extract=4044164 bitset=53894113
Ratio=951% array=100 count=10 extract=2822822 bitset=26859602
Ratio=7% array=100 count=50 extract=10447854 bitset=734047
Ratio=4% array=100 count=100 extract=11469431 bitset=567111
Ratio=40% array=1000 count=10 extract=13535423 bitset=5533188
Ratio=30% array=1000 count=100 extract=15799183 bitset=4868559
Ratio=7% array=1000 count=500 extract=44938370 bitset=3372359
Ratio=1% array=1000 count=1000 extract=75066259 bitset=781695
Ratio=139% count=0 hash=2156905 bits=3002034
Ratio=29% count=5 hash=689449 bits=204746
Ratio=31% count=10 hash=968184 bits=300213
Ratio=23% count=200 hash=19438969 bits=4541870
Ratio=16% count=50 hash=8534715 bits=1421756
Ratio=25% count=100 hash=9151505 bits=2332979
Ratio=22% count=1000 hash=77625001 bits=17252586
Ratio=21% count=2000 hash=159540087 bits=34231257
Tests run: 2, Failures: 0, Errors: 0, Skipped: 0, Time elapsed: 0.714 sec - in org.apache.commons.lang3.HashSetvBitSetTest
Running org.apache.commons.lang3.StringUtilsTest
Tests run: 124, Failures: 0, Errors: 0, Skipped: 0, Time elapsed: 0.201 sec - in org.apache.commons.lang3.StringUtilsTest
Running org.apache.commons.lang3.ArrayUtilsRemoveTest
Tests run: 19, Failures: 0, Errors: 0, Skipped: 0, Time elapsed: 0.001 sec - in org.apache.commons.lang3.ArrayUtilsRemoveTest
Running org.apache.commons.lang3.ObjectUtilsTest
Tests run: 36, Failures: 0, Errors: 0, Skipped: 0, Time elapsed: 0.014 sec - in org.apache.commons.lang3.ObjectUtilsTest
Running org.apache.commons.lang3.ClassPathUtilsTest
Tests run: 13, Failures: 0, Errors: 0, Skipped: 0, Time elapsed: 0.008 sec - in org.apache.commons.lang3.ClassPathUtilsTest
Running org.apache.commons.lang3.math.NumberUtilsTest
Tests run: 91, Failures: 0, Errors: 0, Skipped: 0, Time elapsed: 0.047 sec - in org.apache.commons.lang3.math.NumberUtilsTest
Running org.apache.commons.lang3.math.IEEE754rUtilsTest
Tests run: 3, Failures: 0, Errors: 0, Skipped: 0, Time elapsed: 0.002 sec - in org.apache.commons.lang3.math.IEEE754rUtilsTest
Running org.apache.commons.lang3.math.FractionTest
Tests run: 25, Failures: 0, Errors: 0, Skipped: 0, Time elapsed: 0.133 sec - in org.apache.commons.lang3.math.FractionTest
Running org.apache.commons.lang3.BooleanUtilsTest
Tests run: 72, Failures: 0, Errors: 0, Skipped: 0, Time elapsed: 0.028 sec - in org.apache.commons.lang3.BooleanUtilsTest
Running org.apache.commons.lang3.CharSequenceUtilsTest
Tests run: 2, Failures: 0, Errors: 0, Skipped: 0, Time elapsed: 0.002 sec - in org.apache.commons.lang3.CharSequenceUtilsTest
Running org.apache.commons.lang3.CharSetUtilsTest
Tests run: 11, Failures: 0, Errors: 0, Skipped: 0, Time elapsed: 0.008 sec - in org.apache.commons.lang3.CharSetUtilsTest
Running org.apache.commons.lang3.ArrayUtilsAddTest
Tests run: 13, Failures: 0, Errors: 0, Skipped: 0, Time elapsed: 0.007 sec - in org.apache.commons.lang3.ArrayUtilsAddTest
Running org.apache.commons.lang3.CharEncodingTest
Tests run: 6, Failures: 0, Errors: 0, Skipped: 0, Time elapsed: 0.049 sec - in org.apache.commons.lang3.CharEncodingTest
Running org.apache.commons.lang3.ClassUtilsTest
Tests run: 57, Failures: 0, Errors: 0, Skipped: 0, Time elapsed: 0.031 sec - in org.apache.commons.lang3.ClassUtilsTest
Running org.apache.commons.lang3.RangeTest
Tests run: 24, Failures: 0, Errors: 0, Skipped: 0, Time elapsed: 0.014 sec - in org.apache.commons.lang3.RangeTest
Running org.apache.commons.lang3.event.EventUtilsTest
Tests run: 8, Failures: 0, Errors: 0, Skipped: 0, Time elapsed: 0.021 sec - in org.apache.commons.lang3.event.EventUtilsTest
Running org.apache.commons.lang3.event.EventListenerSupportTest
Tests run: 9, Failures: 0, Errors: 0, Skipped: 0, Time elapsed: 0.024 sec - in org.apache.commons.lang3.event.EventListenerSupportTest
Running org.apache.commons.lang3.ArrayUtilsTest
Tests run: 205, Failures: 0, Errors: 0, Skipped: 0, Time elapsed: 0.111 sec - in org.apache.commons.lang3.ArrayUtilsTest
Running org.apache.commons.lang3.CharUtilsTest
Tests run: 24, Failures: 0, Errors: 0, Skipped: 0, Time elapsed: 0.011 sec - in org.apache.commons.lang3.CharUtilsTest
Running org.apache.commons.lang3.NotImplementedExceptionTest
Tests run: 1, Failures: 0, Errors: 0, Skipped: 0, Time elapsed: 0.002 sec - in org.apache.commons.lang3.NotImplementedExceptionTest
Running org.apache.commons.lang3.StringUtilsEqualsIndexOfTest
Tests run: 50, Failures: 0, Errors: 0, Skipped: 0, Time elapsed: 0.03 sec - in org.apache.commons.lang3.StringUtilsEqualsIndexOfTest
Running org.apache.commons.lang3.RandomUtilsTest
Tests run: 23, Failures: 0, Errors: 0, Skipped: 0, Time elapsed: 0.01 sec - in org.apache.commons.lang3.RandomUtilsTest

Results :


Tests in error: 
  FastDateFormat_ParserTest>FastDateParserTest.testParseZone:126 » Parse Unparse...
  FastDateParserTest.testParseZone:126 » Parse Unparseable date: "2003-07-10T16:...


Tests run: 3526, Failures: 0, Errors: 2, Skipped: 97

[INFO] ------------------------------------------------------------------------
[INFO] BUILD FAILURE
[INFO] ------------------------------------------------------------------------
[INFO] Total time: 38.245s
[INFO] Finished at: Wed Aug 05 09:41:36 BST 2015
[INFO] Final Memory: 24M/415M
[INFO] ------------------------------------------------------------------------
[ERROR] Failed to execute goal org.apache.maven.plugins:maven-surefire-plugin:2.18:test (default-test) on project commons-lang3: There are test failures.
[ERROR] 
[ERROR] Please refer to /home/perham/Study/LittleDarwin/Cases/commons-lang3-3.4-src/target/surefire-reports for the individual test results.
[ERROR] -> [Help 1]
[ERROR] 
[ERROR] To see the full stack trace of the errors, re-run Maven with the -e switch.
[ERROR] Re-run Maven using the -X switch to enable full debug logging.
[ERROR] 
[ERROR] For more information about the errors and possible solutions, please read the following articles:
[ERROR] [Help 1] http://cwiki.apache.org/confluence/display/MAVEN/MojoFailureException
