[INFO] Scanning for projects...
[INFO]                                                                         
[INFO] ------------------------------------------------------------------------
[INFO] Building Apache Commons Lang 3.4
[INFO] ------------------------------------------------------------------------
[INFO] 
[INFO] --- maven-enforcer-plugin:1.3.1:enforce (enforce-maven-3) @ commons-lang3 ---
[INFO] 
[INFO] --- build-helper-maven-plugin:1.8:parse-version (parse-version) @ commons-lang3 ---
[INFO] 
[INFO] --- maven-antrun-plugin:1.8:run (javadoc.resources) @ commons-lang3 ---
[INFO] Executing tasks

main:
[INFO] Executed tasks
[INFO] 
[INFO] --- maven-remote-resources-plugin:1.5:process (default) @ commons-lang3 ---
[INFO] 
[INFO] --- buildnumber-maven-plugin:1.3:create (default) @ commons-lang3 ---
[INFO] Executing: /bin/sh -c cd /home/perham/Study/LittleDarwin/Cases/commons-lang3-3.4-src && svn --non-interactive info
[INFO] Working directory: /home/perham/Study/LittleDarwin/Cases/commons-lang3-3.4-src
[INFO] Storing buildNumber: ?????? at timestamp: 1438762126215
[INFO] Executing: /bin/sh -c cd /home/perham/Study/LittleDarwin/Cases/commons-lang3-3.4-src && svn --non-interactive info
[INFO] Working directory: /home/perham/Study/LittleDarwin/Cases/commons-lang3-3.4-src
[INFO] Storing buildScmBranch: UNKNOWN_BRANCH
[INFO] 
[INFO] --- maven-resources-plugin:2.7:resources (default-resources) @ commons-lang3 ---
[INFO] Using 'ISO-8859-1' encoding to copy filtered resources.
[INFO] Copying 0 resource
[INFO] Copying 2 resources to META-INF
[INFO] 
[INFO] --- maven-compiler-plugin:3.2:compile (default-compile) @ commons-lang3 ---
[INFO] Changes detected - recompiling the module!
[INFO] Compiling 133 source files to /home/perham/Study/LittleDarwin/Cases/commons-lang3-3.4-src/target/classes
[INFO] /home/perham/Study/LittleDarwin/Cases/commons-lang3-3.4-src/src/main/java/org/apache/commons/lang3/SerializationUtils.java: /home/perham/Study/LittleDarwin/Cases/commons-lang3-3.4-src/src/main/java/org/apache/commons/lang3/SerializationUtils.java uses unchecked or unsafe operations.
[INFO] /home/perham/Study/LittleDarwin/Cases/commons-lang3-3.4-src/src/main/java/org/apache/commons/lang3/SerializationUtils.java: Recompile with -Xlint:unchecked for details.
[INFO] 
[INFO] --- maven-bundle-plugin:2.5.3:manifest (bundle-manifest) @ commons-lang3 ---
[INFO] 
[INFO] --- animal-sniffer-maven-plugin:1.13:check (checkAPIcompatibility) @ commons-lang3 ---
[INFO] Checking unresolved references to org.codehaus.mojo.signature:java16:1.0
[INFO] 
[INFO] --- maven-resources-plugin:2.7:testResources (default-testResources) @ commons-lang3 ---
[INFO] Using 'ISO-8859-1' encoding to copy filtered resources.
[INFO] Copying 2 resources
[INFO] Copying 2 resources to META-INF
[INFO] 
[INFO] --- maven-compiler-plugin:3.2:testCompile (default-testCompile) @ commons-lang3 ---
[INFO] Nothing to compile - all classes are up to date
[INFO] 
[INFO] --- maven-surefire-plugin:2.18:test (default-test) @ commons-lang3 ---
[INFO] Surefire report directory: /home/perham/Study/LittleDarwin/Cases/commons-lang3-3.4-src/target/surefire-reports

-------------------------------------------------------
 T E S T S
-------------------------------------------------------
Running org.apache.commons.lang3.ValidateTest
Tests run: 63, Failures: 0, Errors: 0, Skipped: 0, Time elapsed: 0.048 sec - in org.apache.commons.lang3.ValidateTest
Running org.apache.commons.lang3.LocaleUtilsTest
Tests run: 15, Failures: 0, Errors: 0, Skipped: 0, Time elapsed: 0.037 sec - in org.apache.commons.lang3.LocaleUtilsTest
Running org.apache.commons.lang3.tuple.MutableTripleTest
Tests run: 8, Failures: 0, Errors: 0, Skipped: 0, Time elapsed: 0.018 sec - in org.apache.commons.lang3.tuple.MutableTripleTest
Running org.apache.commons.lang3.tuple.TripleTest
Tests run: 10, Failures: 0, Errors: 0, Skipped: 0, Time elapsed: 0.015 sec - in org.apache.commons.lang3.tuple.TripleTest
Running org.apache.commons.lang3.tuple.ImmutablePairTest
Tests run: 6, Failures: 0, Errors: 0, Skipped: 0, Time elapsed: 0.007 sec - in org.apache.commons.lang3.tuple.ImmutablePairTest
Running org.apache.commons.lang3.tuple.MutablePairTest
Tests run: 8, Failures: 0, Errors: 0, Skipped: 0, Time elapsed: 0.008 sec - in org.apache.commons.lang3.tuple.MutablePairTest
Running org.apache.commons.lang3.tuple.ImmutableTripleTest
Tests run: 6, Failures: 0, Errors: 0, Skipped: 0, Time elapsed: 0.006 sec - in org.apache.commons.lang3.tuple.ImmutableTripleTest
Running org.apache.commons.lang3.tuple.PairTest
Tests run: 9, Failures: 0, Errors: 0, Skipped: 0, Time elapsed: 0.007 sec - in org.apache.commons.lang3.tuple.PairTest
Running org.apache.commons.lang3.StringUtilsIsTest
Tests run: 8, Failures: 0, Errors: 0, Skipped: 0, Time elapsed: 0.036 sec - in org.apache.commons.lang3.StringUtilsIsTest
Running org.apache.commons.lang3.JavaVersionTest
Tests run: 3, Failures: 0, Errors: 0, Skipped: 0, Time elapsed: 0.004 sec - in org.apache.commons.lang3.JavaVersionTest
Running org.apache.commons.lang3.builder.NoFieldNamesToStringStyleTest
Tests run: 8, Failures: 0, Errors: 0, Skipped: 0, Time elapsed: 0.021 sec - in org.apache.commons.lang3.builder.NoFieldNamesToStringStyleTest
Running org.apache.commons.lang3.builder.ShortPrefixToStringStyleTest
Tests run: 8, Failures: 0, Errors: 0, Skipped: 0, Time elapsed: 0.008 sec - in org.apache.commons.lang3.builder.ShortPrefixToStringStyleTest
Running org.apache.commons.lang3.builder.DiffResultTest
Tests run: 9, Failures: 0, Errors: 0, Skipped: 0, Time elapsed: 0.017 sec - in org.apache.commons.lang3.builder.DiffResultTest
Running org.apache.commons.lang3.builder.CompareToBuilderTest
Tests run: 48, Failures: 0, Errors: 0, Skipped: 0, Time elapsed: 0.06 sec - in org.apache.commons.lang3.builder.CompareToBuilderTest
Running org.apache.commons.lang3.builder.MultilineRecursiveToStringStyleTest
Tests run: 10, Failures: 0, Errors: 0, Skipped: 0, Time elapsed: 0.013 sec - in org.apache.commons.lang3.builder.MultilineRecursiveToStringStyleTest
Running org.apache.commons.lang3.builder.RecursiveToStringStyleTest
Tests run: 8, Failures: 0, Errors: 0, Skipped: 0, Time elapsed: 0.011 sec - in org.apache.commons.lang3.builder.RecursiveToStringStyleTest
Running org.apache.commons.lang3.builder.DefaultToStringStyleTest
Tests run: 8, Failures: 0, Errors: 0, Skipped: 0, Time elapsed: 0.01 sec - in org.apache.commons.lang3.builder.DefaultToStringStyleTest
Running org.apache.commons.lang3.builder.ReflectionToStringBuilderExcludeTest
Tests run: 11, Failures: 0, Errors: 0, Skipped: 0, Time elapsed: 0.011 sec - in org.apache.commons.lang3.builder.ReflectionToStringBuilderExcludeTest
Running org.apache.commons.lang3.builder.StandardToStringStyleTest
Tests run: 8, Failures: 0, Errors: 0, Skipped: 0, Time elapsed: 0.008 sec - in org.apache.commons.lang3.builder.StandardToStringStyleTest
Running org.apache.commons.lang3.builder.ToStringStyleTest
Tests run: 12, Failures: 0, Errors: 0, Skipped: 0, Time elapsed: 0.008 sec - in org.apache.commons.lang3.builder.ToStringStyleTest
Running org.apache.commons.lang3.builder.DiffTest
Tests run: 4, Failures: 0, Errors: 0, Skipped: 0, Time elapsed: 0.004 sec - in org.apache.commons.lang3.builder.DiffTest
Running org.apache.commons.lang3.builder.SimpleToStringStyleTest
Tests run: 8, Failures: 0, Errors: 0, Skipped: 0, Time elapsed: 0.007 sec - in org.apache.commons.lang3.builder.SimpleToStringStyleTest
Running org.apache.commons.lang3.builder.MultiLineToStringStyleTest
Tests run: 8, Failures: 0, Errors: 0, Skipped: 0, Time elapsed: 0.019 sec - in org.apache.commons.lang3.builder.MultiLineToStringStyleTest
Running org.apache.commons.lang3.builder.ToStringStyleConcurrencyTest
Tests run: 3, Failures: 0, Errors: 0, Skipped: 0, Time elapsed: 5.086 sec - in org.apache.commons.lang3.builder.ToStringStyleConcurrencyTest
Running org.apache.commons.lang3.builder.ReflectionToStringBuilderMutateInspectConcurrencyTest
Tests run: 1, Failures: 0, Errors: 0, Skipped: 1, Time elapsed: 0 sec - in org.apache.commons.lang3.builder.ReflectionToStringBuilderMutateInspectConcurrencyTest
Running org.apache.commons.lang3.builder.ToStringBuilderTest
Tests run: 74, Failures: 0, Errors: 0, Skipped: 1, Time elapsed: 0.059 sec - in org.apache.commons.lang3.builder.ToStringBuilderTest
Running org.apache.commons.lang3.builder.EqualsBuilderTest
Tests run: 48, Failures: 0, Errors: 0, Skipped: 0, Time elapsed: 0.013 sec - in org.apache.commons.lang3.builder.EqualsBuilderTest
Running org.apache.commons.lang3.builder.HashCodeBuilderAndEqualsBuilderTest
Tests run: 4, Failures: 0, Errors: 0, Skipped: 0, Time elapsed: 0.012 sec - in org.apache.commons.lang3.builder.HashCodeBuilderAndEqualsBuilderTest
Running org.apache.commons.lang3.builder.ReflectionToStringBuilderConcurrencyTest
Tests run: 3, Failures: 0, Errors: 0, Skipped: 3, Time elapsed: 0.002 sec - in org.apache.commons.lang3.builder.ReflectionToStringBuilderConcurrencyTest
Running org.apache.commons.lang3.builder.JsonToStringStyleTest
Tests run: 9, Failures: 0, Errors: 0, Skipped: 0, Time elapsed: 0.004 sec - in org.apache.commons.lang3.builder.JsonToStringStyleTest
Running org.apache.commons.lang3.builder.NoClassNameToStringStyleTest
Tests run: 8, Failures: 0, Errors: 0, Skipped: 0, Time elapsed: 0.004 sec - in org.apache.commons.lang3.builder.NoClassNameToStringStyleTest
Running org.apache.commons.lang3.builder.DiffBuilderTest
Tests run: 30, Failures: 0, Errors: 0, Skipped: 0, Time elapsed: 0.031 sec - in org.apache.commons.lang3.builder.DiffBuilderTest
Running org.apache.commons.lang3.builder.HashCodeBuilderTest
Tests run: 44, Failures: 0, Errors: 0, Skipped: 0, Time elapsed: 0.021 sec - in org.apache.commons.lang3.builder.HashCodeBuilderTest
Running org.apache.commons.lang3.concurrent.AtomicInitializerTest
Tests run: 3, Failures: 0, Errors: 0, Skipped: 0, Time elapsed: 0.008 sec - in org.apache.commons.lang3.concurrent.AtomicInitializerTest
Running org.apache.commons.lang3.concurrent.CallableBackgroundInitializerTest
Tests run: 4, Failures: 0, Errors: 0, Skipped: 0, Time elapsed: 0.002 sec - in org.apache.commons.lang3.concurrent.CallableBackgroundInitializerTest
Running org.apache.commons.lang3.concurrent.BackgroundInitializerTest
Tests run: 15, Failures: 0, Errors: 0, Skipped: 0, Time elapsed: 0.031 sec - in org.apache.commons.lang3.concurrent.BackgroundInitializerTest
Running org.apache.commons.lang3.concurrent.LazyInitializerTest
Tests run: 3, Failures: 0, Errors: 0, Skipped: 0, Time elapsed: 0.003 sec - in org.apache.commons.lang3.concurrent.LazyInitializerTest
Running org.apache.commons.lang3.concurrent.BasicThreadFactoryTest
Tests run: 15, Failures: 0, Errors: 0, Skipped: 0, Time elapsed: 0.038 sec - in org.apache.commons.lang3.concurrent.BasicThreadFactoryTest
Running org.apache.commons.lang3.concurrent.ConstantInitializerTest
Tests run: 7, Failures: 0, Errors: 0, Skipped: 0, Time elapsed: 0.001 sec - in org.apache.commons.lang3.concurrent.ConstantInitializerTest
Running org.apache.commons.lang3.concurrent.MultiBackgroundInitializerTest
Tests run: 17, Failures: 0, Errors: 0, Skipped: 0, Time elapsed: 0.078 sec - in org.apache.commons.lang3.concurrent.MultiBackgroundInitializerTest
Running org.apache.commons.lang3.concurrent.AtomicSafeInitializerTest
Tests run: 4, Failures: 0, Errors: 0, Skipped: 0, Time elapsed: 0.004 sec - in org.apache.commons.lang3.concurrent.AtomicSafeInitializerTest
Running org.apache.commons.lang3.concurrent.ConcurrentUtilsTest
Tests run: 40, Failures: 0, Errors: 0, Skipped: 0, Time elapsed: 0.014 sec - in org.apache.commons.lang3.concurrent.ConcurrentUtilsTest
Running org.apache.commons.lang3.concurrent.TimedSemaphoreTest
Tests run: 15, Failures: 0, Errors: 0, Skipped: 0, Time elapsed: 1.183 sec - in org.apache.commons.lang3.concurrent.TimedSemaphoreTest
Running org.apache.commons.lang3.StringUtilsSubstringTest
Tests run: 14, Failures: 0, Errors: 0, Skipped: 0, Time elapsed: 0.001 sec - in org.apache.commons.lang3.StringUtilsSubstringTest
Running org.apache.commons.lang3.SystemUtilsTest
Tests run: 12, Failures: 0, Errors: 0, Skipped: 0, Time elapsed: 0.001 sec - in org.apache.commons.lang3.SystemUtilsTest
Running org.apache.commons.lang3.CharRangeTest
Tests run: 16, Failures: 0, Errors: 0, Skipped: 0, Time elapsed: 0.044 sec - in org.apache.commons.lang3.CharRangeTest
Running org.apache.commons.lang3.CharSetTest
Tests run: 14, Failures: 0, Errors: 0, Skipped: 0, Time elapsed: 0.012 sec - in org.apache.commons.lang3.CharSetTest
Running org.apache.commons.lang3.StringUtilsStartsEndsWithTest
Tests run: 6, Failures: 0, Errors: 0, Skipped: 0, Time elapsed: 0.003 sec - in org.apache.commons.lang3.StringUtilsStartsEndsWithTest
Running org.apache.commons.lang3.RandomStringUtilsTest
Tests run: 11, Failures: 0, Errors: 0, Skipped: 0, Time elapsed: 0.038 sec - in org.apache.commons.lang3.RandomStringUtilsTest
Running org.apache.commons.lang3.SerializationUtilsTest
Tests run: 26, Failures: 0, Errors: 0, Skipped: 0, Time elapsed: 0.05 sec - in org.apache.commons.lang3.SerializationUtilsTest
Running org.apache.commons.lang3.time.StopWatchTest
Tests run: 8, Failures: 0, Errors: 0, Skipped: 0, Time elapsed: 4.758 sec - in org.apache.commons.lang3.time.StopWatchTest
Running org.apache.commons.lang3.time.DateUtilsRoundingTest
Tests run: 22, Failures: 0, Errors: 22, Skipped: 0, Time elapsed: 0.032 sec <<< FAILURE! - in org.apache.commons.lang3.time.DateUtilsRoundingTest
testRoundMilliSecond(org.apache.commons.lang3.time.DateUtilsRoundingTest)  Time elapsed: 0.007 sec  <<< ERROR!
java.lang.ExceptionInInitializerError: null
	at java.lang.String.substring(String.java:1907)
	at org.apache.commons.lang3.time.FastDateParser.getStrategy(FastDateParser.java:129)
	at org.apache.commons.lang3.time.FastDateParser.init(FastDateParser.java:66)
	at org.apache.commons.lang3.time.FastDateParser.<init>(FastDateParser.java:53)
	at org.apache.commons.lang3.time.FastDateFormat.<init>(FastDateFormat.java:395)
	at org.apache.commons.lang3.time.FastDateFormat.<init>(FastDateFormat.java:379)
	at org.apache.commons.lang3.time.FastDateFormat$1.createInstance(FastDateFormat.java:101)
	at org.apache.commons.lang3.time.FastDateFormat$1.createInstance(FastDateFormat.java:98)
	at org.apache.commons.lang3.time.FormatCache.getInstance(FormatCache.java:82)
	at org.apache.commons.lang3.time.FastDateFormat.getInstance(FastDateFormat.java:129)
	at org.apache.commons.lang3.time.DateFormatUtils.<clinit>(DateFormatUtils.java:47)
	at org.apache.commons.lang3.time.DateUtilsRoundingTest.<init>(DateUtilsRoundingTest.java:55)

testRoundDayOfMonth(org.apache.commons.lang3.time.DateUtilsRoundingTest)  Time elapsed: 0 sec  <<< ERROR!
java.lang.NoClassDefFoundError: Could not initialize class org.apache.commons.lang3.time.DateFormatUtils
	at org.apache.commons.lang3.time.DateUtilsRoundingTest.<init>(DateUtilsRoundingTest.java:55)

testRoundMinute(org.apache.commons.lang3.time.DateUtilsRoundingTest)  Time elapsed: 0.001 sec  <<< ERROR!
java.lang.NoClassDefFoundError: Could not initialize class org.apache.commons.lang3.time.DateFormatUtils
	at org.apache.commons.lang3.time.DateUtilsRoundingTest.<init>(DateUtilsRoundingTest.java:55)

testRoundSecond(org.apache.commons.lang3.time.DateUtilsRoundingTest)  Time elapsed: 0 sec  <<< ERROR!
java.lang.NoClassDefFoundError: Could not initialize class org.apache.commons.lang3.time.DateFormatUtils
	at org.apache.commons.lang3.time.DateUtilsRoundingTest.<init>(DateUtilsRoundingTest.java:55)

testRoundMonth(org.apache.commons.lang3.time.DateUtilsRoundingTest)  Time elapsed: 0 sec  <<< ERROR!
java.lang.NoClassDefFoundError: Could not initialize class org.apache.commons.lang3.time.DateFormatUtils
	at org.apache.commons.lang3.time.DateUtilsRoundingTest.<init>(DateUtilsRoundingTest.java:55)

testTruncateSemiMonth(org.apache.commons.lang3.time.DateUtilsRoundingTest)  Time elapsed: 0 sec  <<< ERROR!
java.lang.NoClassDefFoundError: Could not initialize class org.apache.commons.lang3.time.DateFormatUtils
	at org.apache.commons.lang3.time.DateUtilsRoundingTest.<init>(DateUtilsRoundingTest.java:55)

testTruncateMinute(org.apache.commons.lang3.time.DateUtilsRoundingTest)  Time elapsed: 0.001 sec  <<< ERROR!
java.lang.NoClassDefFoundError: Could not initialize class org.apache.commons.lang3.time.DateFormatUtils
	at org.apache.commons.lang3.time.DateUtilsRoundingTest.<init>(DateUtilsRoundingTest.java:55)

testRoundSemiMonth(org.apache.commons.lang3.time.DateUtilsRoundingTest)  Time elapsed: 0.001 sec  <<< ERROR!
java.lang.NoClassDefFoundError: Could not initialize class org.apache.commons.lang3.time.DateFormatUtils
	at org.apache.commons.lang3.time.DateUtilsRoundingTest.<init>(DateUtilsRoundingTest.java:55)

testTruncateSecond(org.apache.commons.lang3.time.DateUtilsRoundingTest)  Time elapsed: 0 sec  <<< ERROR!
java.lang.NoClassDefFoundError: Could not initialize class org.apache.commons.lang3.time.DateFormatUtils
	at org.apache.commons.lang3.time.DateUtilsRoundingTest.<init>(DateUtilsRoundingTest.java:55)

testRoundAmPm(org.apache.commons.lang3.time.DateUtilsRoundingTest)  Time elapsed: 0 sec  <<< ERROR!
java.lang.NoClassDefFoundError: Could not initialize class org.apache.commons.lang3.time.DateFormatUtils
	at org.apache.commons.lang3.time.DateUtilsRoundingTest.<init>(DateUtilsRoundingTest.java:55)

testRoundDate(org.apache.commons.lang3.time.DateUtilsRoundingTest)  Time elapsed: 0.001 sec  <<< ERROR!
java.lang.NoClassDefFoundError: Could not initialize class org.apache.commons.lang3.time.DateFormatUtils
	at org.apache.commons.lang3.time.DateUtilsRoundingTest.<init>(DateUtilsRoundingTest.java:55)

testRoundHour(org.apache.commons.lang3.time.DateUtilsRoundingTest)  Time elapsed: 0.001 sec  <<< ERROR!
java.lang.NoClassDefFoundError: Could not initialize class org.apache.commons.lang3.time.DateFormatUtils
	at org.apache.commons.lang3.time.DateUtilsRoundingTest.<init>(DateUtilsRoundingTest.java:55)

testRoundYear(org.apache.commons.lang3.time.DateUtilsRoundingTest)  Time elapsed: 0.001 sec  <<< ERROR!
java.lang.NoClassDefFoundError: Could not initialize class org.apache.commons.lang3.time.DateFormatUtils
	at org.apache.commons.lang3.time.DateUtilsRoundingTest.<init>(DateUtilsRoundingTest.java:55)

testTruncateMilliSecond(org.apache.commons.lang3.time.DateUtilsRoundingTest)  Time elapsed: 0 sec  <<< ERROR!
java.lang.NoClassDefFoundError: Could not initialize class org.apache.commons.lang3.time.DateFormatUtils
	at org.apache.commons.lang3.time.DateUtilsRoundingTest.<init>(DateUtilsRoundingTest.java:55)

testTruncateHourOfDay(org.apache.commons.lang3.time.DateUtilsRoundingTest)  Time elapsed: 0 sec  <<< ERROR!
java.lang.NoClassDefFoundError: Could not initialize class org.apache.commons.lang3.time.DateFormatUtils
	at org.apache.commons.lang3.time.DateUtilsRoundingTest.<init>(DateUtilsRoundingTest.java:55)

testTruncateMonth(org.apache.commons.lang3.time.DateUtilsRoundingTest)  Time elapsed: 0 sec  <<< ERROR!
java.lang.NoClassDefFoundError: Could not initialize class org.apache.commons.lang3.time.DateFormatUtils
	at org.apache.commons.lang3.time.DateUtilsRoundingTest.<init>(DateUtilsRoundingTest.java:55)

testRoundHourOfDay(org.apache.commons.lang3.time.DateUtilsRoundingTest)  Time elapsed: 0.001 sec  <<< ERROR!
java.lang.NoClassDefFoundError: Could not initialize class org.apache.commons.lang3.time.DateFormatUtils
	at org.apache.commons.lang3.time.DateUtilsRoundingTest.<init>(DateUtilsRoundingTest.java:55)

testTruncateAmPm(org.apache.commons.lang3.time.DateUtilsRoundingTest)  Time elapsed: 0 sec  <<< ERROR!
java.lang.NoClassDefFoundError: Could not initialize class org.apache.commons.lang3.time.DateFormatUtils
	at org.apache.commons.lang3.time.DateUtilsRoundingTest.<init>(DateUtilsRoundingTest.java:55)

testTruncateDate(org.apache.commons.lang3.time.DateUtilsRoundingTest)  Time elapsed: 0 sec  <<< ERROR!
java.lang.NoClassDefFoundError: Could not initialize class org.apache.commons.lang3.time.DateFormatUtils
	at org.apache.commons.lang3.time.DateUtilsRoundingTest.<init>(DateUtilsRoundingTest.java:55)

testTruncateHour(org.apache.commons.lang3.time.DateUtilsRoundingTest)  Time elapsed: 0 sec  <<< ERROR!
java.lang.NoClassDefFoundError: Could not initialize class org.apache.commons.lang3.time.DateFormatUtils
	at org.apache.commons.lang3.time.DateUtilsRoundingTest.<init>(DateUtilsRoundingTest.java:55)

testTruncateYear(org.apache.commons.lang3.time.DateUtilsRoundingTest)  Time elapsed: 0 sec  <<< ERROR!
java.lang.NoClassDefFoundError: Could not initialize class org.apache.commons.lang3.time.DateFormatUtils
	at org.apache.commons.lang3.time.DateUtilsRoundingTest.<init>(DateUtilsRoundingTest.java:55)

testTruncateDayOfMonth(org.apache.commons.lang3.time.DateUtilsRoundingTest)  Time elapsed: 0 sec  <<< ERROR!
java.lang.NoClassDefFoundError: Could not initialize class org.apache.commons.lang3.time.DateFormatUtils
	at org.apache.commons.lang3.time.DateUtilsRoundingTest.<init>(DateUtilsRoundingTest.java:55)

Running org.apache.commons.lang3.time.FastDateParserTest
Tests run: 33, Failures: 0, Errors: 10, Skipped: 0, Time elapsed: 2.492 sec <<< FAILURE! - in org.apache.commons.lang3.time.FastDateParserTest
testSpecialCharacters(org.apache.commons.lang3.time.FastDateParserTest)  Time elapsed: 0.005 sec  <<< ERROR!
java.lang.StringIndexOutOfBoundsException: String index out of range: 7
	at java.lang.String.substring(String.java:1907)
	at org.apache.commons.lang3.time.FastDateParser.getStrategy(FastDateParser.java:129)
	at org.apache.commons.lang3.time.FastDateParser.init(FastDateParser.java:66)
	at org.apache.commons.lang3.time.FastDateParser.<init>(FastDateParser.java:53)
	at org.apache.commons.lang3.time.FastDateParserTest.getInstance(FastDateParserTest.java:89)
	at org.apache.commons.lang3.time.FastDateParserTest.testSdfAndFdp(FastDateParserTest.java:442)
	at org.apache.commons.lang3.time.FastDateParserTest.testSpecialCharacters(FastDateParserTest.java:397)

testLocaleMatches(org.apache.commons.lang3.time.FastDateParserTest)  Time elapsed: 0.001 sec  <<< ERROR!
java.lang.StringIndexOutOfBoundsException: String index out of range: 4
	at java.lang.String.substring(String.java:1907)
	at org.apache.commons.lang3.time.FastDateParser.getStrategy(FastDateParser.java:129)
	at org.apache.commons.lang3.time.FastDateParser.init(FastDateParser.java:66)
	at org.apache.commons.lang3.time.FastDateParser.<init>(FastDateParser.java:53)
	at org.apache.commons.lang3.time.FastDateParserTest.getInstance(FastDateParserTest.java:89)
	at org.apache.commons.lang3.time.FastDateParserTest.getInstance(FastDateParserTest.java:72)
	at org.apache.commons.lang3.time.FastDateParserTest.testLocaleMatches(FastDateParserTest.java:563)

testParseZone(org.apache.commons.lang3.time.FastDateParserTest)  Time elapsed: 0 sec  <<< ERROR!
java.lang.StringIndexOutOfBoundsException: String index out of range: 4
	at java.lang.String.substring(String.java:1907)
	at org.apache.commons.lang3.time.FastDateParser.getStrategy(FastDateParser.java:129)
	at org.apache.commons.lang3.time.FastDateParser.init(FastDateParser.java:66)
	at org.apache.commons.lang3.time.FastDateParser.<init>(FastDateParser.java:53)
	at org.apache.commons.lang3.time.FastDateParserTest.getInstance(FastDateParserTest.java:89)
	at org.apache.commons.lang3.time.FastDateParserTest.testParseZone(FastDateParserTest.java:122)

test1806(org.apache.commons.lang3.time.FastDateParserTest)  Time elapsed: 0.005 sec  <<< ERROR!
java.lang.StringIndexOutOfBoundsException: String index out of range: 4
	at java.lang.String.substring(String.java:1907)
	at org.apache.commons.lang3.time.FastDateParser.getStrategy(FastDateParser.java:129)
	at org.apache.commons.lang3.time.FastDateParser.init(FastDateParser.java:66)
	at org.apache.commons.lang3.time.FastDateParser.<init>(FastDateParser.java:53)
	at org.apache.commons.lang3.time.FastDateParserTest.getInstance(FastDateParserTest.java:89)
	at org.apache.commons.lang3.time.FastDateParserTest.getInstance(FastDateParserTest.java:76)
	at org.apache.commons.lang3.time.FastDateParserTest.test1806(FastDateParserTest.java:632)

testLang538(org.apache.commons.lang3.time.FastDateParserTest)  Time elapsed: 0 sec  <<< ERROR!
java.lang.StringIndexOutOfBoundsException: String index out of range: 4
	at java.lang.String.substring(String.java:1907)
	at org.apache.commons.lang3.time.FastDateParser.getStrategy(FastDateParser.java:129)
	at org.apache.commons.lang3.time.FastDateParser.init(FastDateParser.java:66)
	at org.apache.commons.lang3.time.FastDateParser.<init>(FastDateParser.java:53)
	at org.apache.commons.lang3.time.FastDateParserTest.getInstance(FastDateParserTest.java:89)
	at org.apache.commons.lang3.time.FastDateParserTest.getInstance(FastDateParserTest.java:76)
	at org.apache.commons.lang3.time.FastDateParserTest.testLang538(FastDateParserTest.java:529)

testLANG_832(org.apache.commons.lang3.time.FastDateParserTest)  Time elapsed: 0.001 sec  <<< ERROR!
java.lang.StringIndexOutOfBoundsException: String index out of range: 4
	at java.lang.String.substring(String.java:1907)
	at org.apache.commons.lang3.time.FastDateParser.getStrategy(FastDateParser.java:129)
	at org.apache.commons.lang3.time.FastDateParser.init(FastDateParser.java:59)
	at org.apache.commons.lang3.time.FastDateParser.<init>(FastDateParser.java:53)
	at org.apache.commons.lang3.time.FastDateParserTest.getInstance(FastDateParserTest.java:89)
	at org.apache.commons.lang3.time.FastDateParserTest.testSdfAndFdp(FastDateParserTest.java:442)
	at org.apache.commons.lang3.time.FastDateParserTest.testLANG_832(FastDateParserTest.java:411)

test_Equality_Hash(org.apache.commons.lang3.time.FastDateParserTest)  Time elapsed: 0.001 sec  <<< ERROR!
java.lang.StringIndexOutOfBoundsException: String index out of range: 4
	at java.lang.String.substring(String.java:1907)
	at org.apache.commons.lang3.time.FastDateParser.getStrategy(FastDateParser.java:129)
	at org.apache.commons.lang3.time.FastDateParser.init(FastDateParser.java:66)
	at org.apache.commons.lang3.time.FastDateParser.<init>(FastDateParser.java:53)
	at org.apache.commons.lang3.time.FastDateParserTest.getInstance(FastDateParserTest.java:89)
	at org.apache.commons.lang3.time.FastDateParserTest.test_Equality_Hash(FastDateParserTest.java:94)

testQuotes(org.apache.commons.lang3.time.FastDateParserTest)  Time elapsed: 0.001 sec  <<< ERROR!
java.lang.StringIndexOutOfBoundsException: String index out of range: 7
	at java.lang.String.substring(String.java:1907)
	at org.apache.commons.lang3.time.FastDateParser.getStrategy(FastDateParser.java:129)
	at org.apache.commons.lang3.time.FastDateParser.init(FastDateParser.java:66)
	at org.apache.commons.lang3.time.FastDateParser.<init>(FastDateParser.java:53)
	at org.apache.commons.lang3.time.FastDateParserTest.getInstance(FastDateParserTest.java:89)
	at org.apache.commons.lang3.time.FastDateParserTest.testQuotes(FastDateParserTest.java:387)

testTimeZoneMatches(org.apache.commons.lang3.time.FastDateParserTest)  Time elapsed: 0 sec  <<< ERROR!
java.lang.StringIndexOutOfBoundsException: String index out of range: 4
	at java.lang.String.substring(String.java:1907)
	at org.apache.commons.lang3.time.FastDateParser.getStrategy(FastDateParser.java:129)
	at org.apache.commons.lang3.time.FastDateParser.init(FastDateParser.java:66)
	at org.apache.commons.lang3.time.FastDateParser.<init>(FastDateParser.java:53)
	at org.apache.commons.lang3.time.FastDateParserTest.getInstance(FastDateParserTest.java:89)
	at org.apache.commons.lang3.time.FastDateParserTest.getInstance(FastDateParserTest.java:76)
	at org.apache.commons.lang3.time.FastDateParserTest.testTimeZoneMatches(FastDateParserTest.java:569)

testPatternMatches(org.apache.commons.lang3.time.FastDateParserTest)  Time elapsed: 0 sec  <<< ERROR!
java.lang.StringIndexOutOfBoundsException: String index out of range: 4
	at java.lang.String.substring(String.java:1907)
	at org.apache.commons.lang3.time.FastDateParser.getStrategy(FastDateParser.java:129)
	at org.apache.commons.lang3.time.FastDateParser.init(FastDateParser.java:66)
	at org.apache.commons.lang3.time.FastDateParser.<init>(FastDateParser.java:53)
	at org.apache.commons.lang3.time.FastDateParserTest.getInstance(FastDateParserTest.java:89)
	at org.apache.commons.lang3.time.FastDateParserTest.getInstance(FastDateParserTest.java:64)
	at org.apache.commons.lang3.time.FastDateParserTest.testPatternMatches(FastDateParserTest.java:557)

Running org.apache.commons.lang3.time.FastDateFormat_ParserTest
Tests run: 33, Failures: 0, Errors: 10, Skipped: 0, Time elapsed: 0.833 sec <<< FAILURE! - in org.apache.commons.lang3.time.FastDateFormat_ParserTest
testSpecialCharacters(org.apache.commons.lang3.time.FastDateFormat_ParserTest)  Time elapsed: 0.001 sec  <<< ERROR!
java.lang.StringIndexOutOfBoundsException: String index out of range: 7
	at java.lang.String.substring(String.java:1907)
	at org.apache.commons.lang3.time.FastDateParser.getStrategy(FastDateParser.java:129)
	at org.apache.commons.lang3.time.FastDateParser.init(FastDateParser.java:66)
	at org.apache.commons.lang3.time.FastDateParser.<init>(FastDateParser.java:53)
	at org.apache.commons.lang3.time.FastDateFormat.<init>(FastDateFormat.java:395)
	at org.apache.commons.lang3.time.FastDateFormat.<init>(FastDateFormat.java:379)
	at org.apache.commons.lang3.time.FastDateFormat$1.createInstance(FastDateFormat.java:101)
	at org.apache.commons.lang3.time.FastDateFormat$1.createInstance(FastDateFormat.java:98)
	at org.apache.commons.lang3.time.FormatCache.getInstance(FormatCache.java:82)
	at org.apache.commons.lang3.time.FastDateFormat.getInstance(FastDateFormat.java:175)
	at org.apache.commons.lang3.time.FastDateFormat_ParserTest.getInstance(FastDateFormat_ParserTest.java:31)

testLocaleMatches(org.apache.commons.lang3.time.FastDateFormat_ParserTest)  Time elapsed: 0.002 sec  <<< ERROR!
java.lang.StringIndexOutOfBoundsException: String index out of range: 4
	at java.lang.String.substring(String.java:1907)
	at org.apache.commons.lang3.time.FastDateParser.getStrategy(FastDateParser.java:129)
	at org.apache.commons.lang3.time.FastDateParser.init(FastDateParser.java:66)
	at org.apache.commons.lang3.time.FastDateParser.<init>(FastDateParser.java:53)
	at org.apache.commons.lang3.time.FastDateFormat.<init>(FastDateFormat.java:395)
	at org.apache.commons.lang3.time.FastDateFormat.<init>(FastDateFormat.java:379)
	at org.apache.commons.lang3.time.FastDateFormat$1.createInstance(FastDateFormat.java:101)
	at org.apache.commons.lang3.time.FastDateFormat$1.createInstance(FastDateFormat.java:98)
	at org.apache.commons.lang3.time.FormatCache.getInstance(FormatCache.java:82)
	at org.apache.commons.lang3.time.FastDateFormat.getInstance(FastDateFormat.java:175)
	at org.apache.commons.lang3.time.FastDateFormat_ParserTest.getInstance(FastDateFormat_ParserTest.java:31)

testParseZone(org.apache.commons.lang3.time.FastDateFormat_ParserTest)  Time elapsed: 0.001 sec  <<< ERROR!
java.lang.StringIndexOutOfBoundsException: String index out of range: 4
	at java.lang.String.substring(String.java:1907)
	at org.apache.commons.lang3.time.FastDateParser.getStrategy(FastDateParser.java:129)
	at org.apache.commons.lang3.time.FastDateParser.init(FastDateParser.java:66)
	at org.apache.commons.lang3.time.FastDateParser.<init>(FastDateParser.java:53)
	at org.apache.commons.lang3.time.FastDateFormat.<init>(FastDateFormat.java:395)
	at org.apache.commons.lang3.time.FastDateFormat.<init>(FastDateFormat.java:379)
	at org.apache.commons.lang3.time.FastDateFormat$1.createInstance(FastDateFormat.java:101)
	at org.apache.commons.lang3.time.FastDateFormat$1.createInstance(FastDateFormat.java:98)
	at org.apache.commons.lang3.time.FormatCache.getInstance(FormatCache.java:82)
	at org.apache.commons.lang3.time.FastDateFormat.getInstance(FastDateFormat.java:175)
	at org.apache.commons.lang3.time.FastDateFormat_ParserTest.getInstance(FastDateFormat_ParserTest.java:31)

test1806(org.apache.commons.lang3.time.FastDateFormat_ParserTest)  Time elapsed: 0.001 sec  <<< ERROR!
java.lang.StringIndexOutOfBoundsException: String index out of range: 4
	at java.lang.String.substring(String.java:1907)
	at org.apache.commons.lang3.time.FastDateParser.getStrategy(FastDateParser.java:129)
	at org.apache.commons.lang3.time.FastDateParser.init(FastDateParser.java:66)
	at org.apache.commons.lang3.time.FastDateParser.<init>(FastDateParser.java:53)
	at org.apache.commons.lang3.time.FastDateFormat.<init>(FastDateFormat.java:395)
	at org.apache.commons.lang3.time.FastDateFormat.<init>(FastDateFormat.java:379)
	at org.apache.commons.lang3.time.FastDateFormat$1.createInstance(FastDateFormat.java:101)
	at org.apache.commons.lang3.time.FastDateFormat$1.createInstance(FastDateFormat.java:98)
	at org.apache.commons.lang3.time.FormatCache.getInstance(FormatCache.java:82)
	at org.apache.commons.lang3.time.FastDateFormat.getInstance(FastDateFormat.java:175)
	at org.apache.commons.lang3.time.FastDateFormat_ParserTest.getInstance(FastDateFormat_ParserTest.java:31)

testLang538(org.apache.commons.lang3.time.FastDateFormat_ParserTest)  Time elapsed: 0.001 sec  <<< ERROR!
java.lang.StringIndexOutOfBoundsException: String index out of range: 4
	at java.lang.String.substring(String.java:1907)
	at org.apache.commons.lang3.time.FastDateParser.getStrategy(FastDateParser.java:129)
	at org.apache.commons.lang3.time.FastDateParser.init(FastDateParser.java:66)
	at org.apache.commons.lang3.time.FastDateParser.<init>(FastDateParser.java:53)
	at org.apache.commons.lang3.time.FastDateFormat.<init>(FastDateFormat.java:395)
	at org.apache.commons.lang3.time.FastDateFormat.<init>(FastDateFormat.java:379)
	at org.apache.commons.lang3.time.FastDateFormat$1.createInstance(FastDateFormat.java:101)
	at org.apache.commons.lang3.time.FastDateFormat$1.createInstance(FastDateFormat.java:98)
	at org.apache.commons.lang3.time.FormatCache.getInstance(FormatCache.java:82)
	at org.apache.commons.lang3.time.FastDateFormat.getInstance(FastDateFormat.java:175)
	at org.apache.commons.lang3.time.FastDateFormat_ParserTest.getInstance(FastDateFormat_ParserTest.java:31)

testLANG_832(org.apache.commons.lang3.time.FastDateFormat_ParserTest)  Time elapsed: 0.001 sec  <<< ERROR!
java.lang.StringIndexOutOfBoundsException: String index out of range: 4
	at java.lang.String.substring(String.java:1907)
	at org.apache.commons.lang3.time.FastDateParser.getStrategy(FastDateParser.java:129)
	at org.apache.commons.lang3.time.FastDateParser.init(FastDateParser.java:59)
	at org.apache.commons.lang3.time.FastDateParser.<init>(FastDateParser.java:53)
	at org.apache.commons.lang3.time.FastDateFormat.<init>(FastDateFormat.java:395)
	at org.apache.commons.lang3.time.FastDateFormat.<init>(FastDateFormat.java:379)
	at org.apache.commons.lang3.time.FastDateFormat$1.createInstance(FastDateFormat.java:101)
	at org.apache.commons.lang3.time.FastDateFormat$1.createInstance(FastDateFormat.java:98)
	at org.apache.commons.lang3.time.FormatCache.getInstance(FormatCache.java:82)
	at org.apache.commons.lang3.time.FastDateFormat.getInstance(FastDateFormat.java:175)
	at org.apache.commons.lang3.time.FastDateFormat_ParserTest.getInstance(FastDateFormat_ParserTest.java:31)

test_Equality_Hash(org.apache.commons.lang3.time.FastDateFormat_ParserTest)  Time elapsed: 0 sec  <<< ERROR!
java.lang.StringIndexOutOfBoundsException: String index out of range: 4
	at java.lang.String.substring(String.java:1907)
	at org.apache.commons.lang3.time.FastDateParser.getStrategy(FastDateParser.java:129)
	at org.apache.commons.lang3.time.FastDateParser.init(FastDateParser.java:66)
	at org.apache.commons.lang3.time.FastDateParser.<init>(FastDateParser.java:53)
	at org.apache.commons.lang3.time.FastDateFormat.<init>(FastDateFormat.java:395)
	at org.apache.commons.lang3.time.FastDateFormat.<init>(FastDateFormat.java:379)
	at org.apache.commons.lang3.time.FastDateFormat$1.createInstance(FastDateFormat.java:101)
	at org.apache.commons.lang3.time.FastDateFormat$1.createInstance(FastDateFormat.java:98)
	at org.apache.commons.lang3.time.FormatCache.getInstance(FormatCache.java:82)
	at org.apache.commons.lang3.time.FastDateFormat.getInstance(FastDateFormat.java:175)
	at org.apache.commons.lang3.time.FastDateFormat_ParserTest.getInstance(FastDateFormat_ParserTest.java:31)

testQuotes(org.apache.commons.lang3.time.FastDateFormat_ParserTest)  Time elapsed: 0.001 sec  <<< ERROR!
java.lang.StringIndexOutOfBoundsException: String index out of range: 7
	at java.lang.String.substring(String.java:1907)
	at org.apache.commons.lang3.time.FastDateParser.getStrategy(FastDateParser.java:129)
	at org.apache.commons.lang3.time.FastDateParser.init(FastDateParser.java:66)
	at org.apache.commons.lang3.time.FastDateParser.<init>(FastDateParser.java:53)
	at org.apache.commons.lang3.time.FastDateFormat.<init>(FastDateFormat.java:395)
	at org.apache.commons.lang3.time.FastDateFormat.<init>(FastDateFormat.java:379)
	at org.apache.commons.lang3.time.FastDateFormat$1.createInstance(FastDateFormat.java:101)
	at org.apache.commons.lang3.time.FastDateFormat$1.createInstance(FastDateFormat.java:98)
	at org.apache.commons.lang3.time.FormatCache.getInstance(FormatCache.java:82)
	at org.apache.commons.lang3.time.FastDateFormat.getInstance(FastDateFormat.java:175)
	at org.apache.commons.lang3.time.FastDateFormat_ParserTest.getInstance(FastDateFormat_ParserTest.java:31)

testTimeZoneMatches(org.apache.commons.lang3.time.FastDateFormat_ParserTest)  Time elapsed: 0 sec  <<< ERROR!
java.lang.StringIndexOutOfBoundsException: String index out of range: 4
	at java.lang.String.substring(String.java:1907)
	at org.apache.commons.lang3.time.FastDateParser.getStrategy(FastDateParser.java:129)
	at org.apache.commons.lang3.time.FastDateParser.init(FastDateParser.java:66)
	at org.apache.commons.lang3.time.FastDateParser.<init>(FastDateParser.java:53)
	at org.apache.commons.lang3.time.FastDateFormat.<init>(FastDateFormat.java:395)
	at org.apache.commons.lang3.time.FastDateFormat.<init>(FastDateFormat.java:379)
	at org.apache.commons.lang3.time.FastDateFormat$1.createInstance(FastDateFormat.java:101)
	at org.apache.commons.lang3.time.FastDateFormat$1.createInstance(FastDateFormat.java:98)
	at org.apache.commons.lang3.time.FormatCache.getInstance(FormatCache.java:82)
	at org.apache.commons.lang3.time.FastDateFormat.getInstance(FastDateFormat.java:175)
	at org.apache.commons.lang3.time.FastDateFormat_ParserTest.getInstance(FastDateFormat_ParserTest.java:31)

testPatternMatches(org.apache.commons.lang3.time.FastDateFormat_ParserTest)  Time elapsed: 0 sec  <<< ERROR!
java.lang.StringIndexOutOfBoundsException: String index out of range: 4
	at java.lang.String.substring(String.java:1907)
	at org.apache.commons.lang3.time.FastDateParser.getStrategy(FastDateParser.java:129)
	at org.apache.commons.lang3.time.FastDateParser.init(FastDateParser.java:66)
	at org.apache.commons.lang3.time.FastDateParser.<init>(FastDateParser.java:53)
	at org.apache.commons.lang3.time.FastDateFormat.<init>(FastDateFormat.java:395)
	at org.apache.commons.lang3.time.FastDateFormat.<init>(FastDateFormat.java:379)
	at org.apache.commons.lang3.time.FastDateFormat$1.createInstance(FastDateFormat.java:101)
	at org.apache.commons.lang3.time.FastDateFormat$1.createInstance(FastDateFormat.java:98)
	at org.apache.commons.lang3.time.FormatCache.getInstance(FormatCache.java:82)
	at org.apache.commons.lang3.time.FastDateFormat.getInstance(FastDateFormat.java:175)
	at org.apache.commons.lang3.time.FastDateFormat_ParserTest.getInstance(FastDateFormat_ParserTest.java:31)

Running org.apache.commons.lang3.time.DurationFormatUtilsTest
Tests run: 25, Failures: 0, Errors: 1, Skipped: 0, Time elapsed: 0.559 sec <<< FAILURE! - in org.apache.commons.lang3.time.DurationFormatUtilsTest
testFormatPeriodISO(org.apache.commons.lang3.time.DurationFormatUtilsTest)  Time elapsed: 0 sec  <<< ERROR!
java.lang.NoClassDefFoundError: Could not initialize class org.apache.commons.lang3.time.DateFormatUtils
	at org.apache.commons.lang3.time.DurationFormatUtilsTest.testFormatPeriodISO(DurationFormatUtilsTest.java:269)

Running org.apache.commons.lang3.time.DateFormatUtilsTest
Tests run: 10, Failures: 0, Errors: 10, Skipped: 0, Time elapsed: 0.004 sec <<< FAILURE! - in org.apache.commons.lang3.time.DateFormatUtilsTest
testFormatUTC(org.apache.commons.lang3.time.DateFormatUtilsTest)  Time elapsed: 0 sec  <<< ERROR!
java.lang.NoClassDefFoundError: Could not initialize class org.apache.commons.lang3.time.DateFormatUtils
	at org.apache.commons.lang3.time.DateFormatUtilsTest.testFormatUTC(DateFormatUtilsTest.java:99)

testTimeISO(org.apache.commons.lang3.time.DateFormatUtilsTest)  Time elapsed: 0 sec  <<< ERROR!
java.lang.NoClassDefFoundError: Could not initialize class org.apache.commons.lang3.time.DateFormatUtils
	at org.apache.commons.lang3.time.DateFormatUtilsTest.testTimeISO(DateFormatUtilsTest.java:169)

testFormatCalendar(org.apache.commons.lang3.time.DateFormatUtilsTest)  Time elapsed: 0 sec  <<< ERROR!
java.lang.NoClassDefFoundError: Could not initialize class org.apache.commons.lang3.time.DateFormatUtils
	at org.apache.commons.lang3.time.DateFormatUtilsTest.testFormatCalendar(DateFormatUtilsTest.java:86)

testSMTP(org.apache.commons.lang3.time.DateFormatUtilsTest)  Time elapsed: 0 sec  <<< ERROR!
java.lang.NoClassDefFoundError: Could not initialize class org.apache.commons.lang3.time.DateFormatUtils
	at org.apache.commons.lang3.time.DateFormatUtilsTest.testSMTP(DateFormatUtilsTest.java:217)

testDateTimeISO(org.apache.commons.lang3.time.DateFormatUtilsTest)  Time elapsed: 0 sec  <<< ERROR!
java.lang.NoClassDefFoundError: Could not initialize class org.apache.commons.lang3.time.DateFormatUtils
	at org.apache.commons.lang3.time.DateFormatUtilsTest.testDateTimeISO(DateFormatUtilsTest.java:113)

testLANG1000(org.apache.commons.lang3.time.DateFormatUtilsTest)  Time elapsed: 0 sec  <<< ERROR!
java.lang.NoClassDefFoundError: Could not initialize class org.apache.commons.lang3.time.DateFormatUtils
	at org.apache.commons.lang3.time.DateFormatUtilsTest.testLANG1000(DateFormatUtilsTest.java:266)

testTimeNoTISO(org.apache.commons.lang3.time.DateFormatUtilsTest)  Time elapsed: 0 sec  <<< ERROR!
java.lang.NoClassDefFoundError: Could not initialize class org.apache.commons.lang3.time.DateFormatUtils
	at org.apache.commons.lang3.time.DateFormatUtilsTest.testTimeNoTISO(DateFormatUtilsTest.java:193)

testDateISO(org.apache.commons.lang3.time.DateFormatUtilsTest)  Time elapsed: 0 sec  <<< ERROR!
java.lang.NoClassDefFoundError: Could not initialize class org.apache.commons.lang3.time.DateFormatUtils
	at org.apache.commons.lang3.time.DateFormatUtilsTest.testDateISO(DateFormatUtilsTest.java:145)

testFormat(org.apache.commons.lang3.time.DateFormatUtilsTest)  Time elapsed: 0 sec  <<< ERROR!
java.lang.NoClassDefFoundError: Could not initialize class org.apache.commons.lang3.time.DateFormatUtils
	at org.apache.commons.lang3.time.DateFormatUtilsTest.testFormat(DateFormatUtilsTest.java:62)

testConstructor(org.apache.commons.lang3.time.DateFormatUtilsTest)  Time elapsed: 0.001 sec  <<< ERROR!
java.lang.NoClassDefFoundError: Could not initialize class org.apache.commons.lang3.time.DateFormatUtils
	at org.apache.commons.lang3.time.DateFormatUtilsTest.testConstructor(DateFormatUtilsTest.java:39)

Running org.apache.commons.lang3.time.DateUtilsFragmentTest
Tests run: 57, Failures: 0, Errors: 0, Skipped: 0, Time elapsed: 0.014 sec - in org.apache.commons.lang3.time.DateUtilsFragmentTest
Running org.apache.commons.lang3.time.FastDatePrinterTimeZonesTest
Tests run: 617, Failures: 0, Errors: 0, Skipped: 0, Time elapsed: 0.262 sec - in org.apache.commons.lang3.time.FastDatePrinterTimeZonesTest
Running org.apache.commons.lang3.time.FastDateFormatTest
Tests run: 14, Failures: 0, Errors: 3, Skipped: 0, Time elapsed: 0.001 sec <<< FAILURE! - in org.apache.commons.lang3.time.FastDateFormatTest
testParseSync(org.apache.commons.lang3.time.FastDateFormatTest)  Time elapsed: 0 sec  <<< ERROR!
java.lang.StringIndexOutOfBoundsException: String index out of range: 4
	at java.lang.String.substring(String.java:1907)
	at org.apache.commons.lang3.time.FastDateParser.getStrategy(FastDateParser.java:129)
	at org.apache.commons.lang3.time.FastDateParser.init(FastDateParser.java:66)
	at org.apache.commons.lang3.time.FastDateParser.<init>(FastDateParser.java:53)
	at org.apache.commons.lang3.time.FastDateFormat.<init>(FastDateFormat.java:395)
	at org.apache.commons.lang3.time.FastDateFormat.<init>(FastDateFormat.java:379)
	at org.apache.commons.lang3.time.FastDateFormat$1.createInstance(FastDateFormat.java:101)
	at org.apache.commons.lang3.time.FastDateFormat$1.createInstance(FastDateFormat.java:98)
	at org.apache.commons.lang3.time.FormatCache.getInstance(FormatCache.java:82)
	at org.apache.commons.lang3.time.FastDateFormat.getInstance(FastDateFormat.java:129)
	at org.apache.commons.lang3.time.FastDateFormatTest.testParseSync(FastDateFormatTest.java:265)

testLang954(org.apache.commons.lang3.time.FastDateFormatTest)  Time elapsed: 0 sec  <<< ERROR!
java.lang.StringIndexOutOfBoundsException: String index out of range: 4
	at java.lang.String.substring(String.java:1907)
	at org.apache.commons.lang3.time.FastDateParser.getStrategy(FastDateParser.java:129)
	at org.apache.commons.lang3.time.FastDateParser.init(FastDateParser.java:66)
	at org.apache.commons.lang3.time.FastDateParser.<init>(FastDateParser.java:53)
	at org.apache.commons.lang3.time.FastDateFormat.<init>(FastDateFormat.java:395)
	at org.apache.commons.lang3.time.FastDateFormat.<init>(FastDateFormat.java:379)
	at org.apache.commons.lang3.time.FastDateFormat$1.createInstance(FastDateFormat.java:101)
	at org.apache.commons.lang3.time.FastDateFormat$1.createInstance(FastDateFormat.java:98)
	at org.apache.commons.lang3.time.FormatCache.getInstance(FormatCache.java:82)
	at org.apache.commons.lang3.time.FastDateFormat.getInstance(FastDateFormat.java:129)
	at org.apache.commons.lang3.time.FastDateFormatTest.testLang954(FastDateFormatTest.java:259)

test_changeDefault_Locale_DateTimeInstance(org.apache.commons.lang3.time.FastDateFormatTest)  Time elapsed: 0 sec  <<< ERROR!
java.lang.StringIndexOutOfBoundsException: String index out of range: 8
	at java.lang.String.substring(String.java:1907)
	at org.apache.commons.lang3.time.FastDateParser.getStrategy(FastDateParser.java:129)
	at org.apache.commons.lang3.time.FastDateParser.init(FastDateParser.java:66)
	at org.apache.commons.lang3.time.FastDateParser.<init>(FastDateParser.java:53)
	at org.apache.commons.lang3.time.FastDateFormat.<init>(FastDateFormat.java:395)
	at org.apache.commons.lang3.time.FastDateFormat.<init>(FastDateFormat.java:379)
	at org.apache.commons.lang3.time.FastDateFormat$1.createInstance(FastDateFormat.java:101)
	at org.apache.commons.lang3.time.FastDateFormat$1.createInstance(FastDateFormat.java:98)
	at org.apache.commons.lang3.time.FormatCache.getInstance(FormatCache.java:82)
	at org.apache.commons.lang3.time.FormatCache.getDateTimeInstance(FormatCache.java:125)
	at org.apache.commons.lang3.time.FormatCache.getDateTimeInstance(FormatCache.java:143)
	at org.apache.commons.lang3.time.FastDateFormat.getDateTimeInstance(FastDateFormat.java:331)
	at org.apache.commons.lang3.time.FastDateFormatTest.test_changeDefault_Locale_DateTimeInstance(FastDateFormatTest.java:145)

Running org.apache.commons.lang3.time.FastDateFormat_PrinterTest
Tests run: 17, Failures: 0, Errors: 3, Skipped: 0, Time elapsed: 0.001 sec <<< FAILURE! - in org.apache.commons.lang3.time.FastDateFormat_PrinterTest
testLang538(org.apache.commons.lang3.time.FastDateFormat_PrinterTest)  Time elapsed: 0 sec  <<< ERROR!
java.lang.StringIndexOutOfBoundsException: String index out of range: 4
	at java.lang.String.substring(String.java:1907)
	at org.apache.commons.lang3.time.FastDateParser.getStrategy(FastDateParser.java:129)
	at org.apache.commons.lang3.time.FastDateParser.init(FastDateParser.java:66)
	at org.apache.commons.lang3.time.FastDateParser.<init>(FastDateParser.java:53)
	at org.apache.commons.lang3.time.FastDateFormat.<init>(FastDateFormat.java:395)
	at org.apache.commons.lang3.time.FastDateFormat.<init>(FastDateFormat.java:379)
	at org.apache.commons.lang3.time.FastDateFormat$1.createInstance(FastDateFormat.java:101)
	at org.apache.commons.lang3.time.FastDateFormat$1.createInstance(FastDateFormat.java:98)
	at org.apache.commons.lang3.time.FormatCache.getInstance(FormatCache.java:82)
	at org.apache.commons.lang3.time.FastDateFormat.getInstance(FastDateFormat.java:175)
	at org.apache.commons.lang3.time.FastDateFormat_PrinterTest.getInstance(FastDateFormat_PrinterTest.java:31)

testLang645(org.apache.commons.lang3.time.FastDateFormat_PrinterTest)  Time elapsed: 0 sec  <<< ERROR!
java.lang.StringIndexOutOfBoundsException: String index out of range: 10
	at java.lang.String.substring(String.java:1907)
	at org.apache.commons.lang3.time.FastDateParser.getStrategy(FastDateParser.java:129)
	at org.apache.commons.lang3.time.FastDateParser.init(FastDateParser.java:66)
	at org.apache.commons.lang3.time.FastDateParser.<init>(FastDateParser.java:53)
	at org.apache.commons.lang3.time.FastDateFormat.<init>(FastDateFormat.java:395)
	at org.apache.commons.lang3.time.FastDateFormat.<init>(FastDateFormat.java:379)
	at org.apache.commons.lang3.time.FastDateFormat$1.createInstance(FastDateFormat.java:101)
	at org.apache.commons.lang3.time.FastDateFormat$1.createInstance(FastDateFormat.java:98)
	at org.apache.commons.lang3.time.FormatCache.getInstance(FormatCache.java:82)
	at org.apache.commons.lang3.time.FastDateFormat.getInstance(FastDateFormat.java:175)
	at org.apache.commons.lang3.time.FastDateFormat_PrinterTest.getInstance(FastDateFormat_PrinterTest.java:31)

testFormat(org.apache.commons.lang3.time.FastDateFormat_PrinterTest)  Time elapsed: 0 sec  <<< ERROR!
java.lang.StringIndexOutOfBoundsException: String index out of range: 4
	at java.lang.String.substring(String.java:1907)
	at org.apache.commons.lang3.time.FastDateParser.getStrategy(FastDateParser.java:129)
	at org.apache.commons.lang3.time.FastDateParser.init(FastDateParser.java:66)
	at org.apache.commons.lang3.time.FastDateParser.<init>(FastDateParser.java:53)
	at org.apache.commons.lang3.time.FastDateFormat.<init>(FastDateFormat.java:395)
	at org.apache.commons.lang3.time.FastDateFormat.<init>(FastDateFormat.java:379)
	at org.apache.commons.lang3.time.FastDateFormat$1.createInstance(FastDateFormat.java:101)
	at org.apache.commons.lang3.time.FastDateFormat$1.createInstance(FastDateFormat.java:98)
	at org.apache.commons.lang3.time.FormatCache.getInstance(FormatCache.java:82)
	at org.apache.commons.lang3.time.FastDateFormat.getInstance(FastDateFormat.java:175)
	at org.apache.commons.lang3.time.FastDateFormat_PrinterTest.getInstance(FastDateFormat_PrinterTest.java:31)

Running org.apache.commons.lang3.time.FastDatePrinterTest
Tests run: 17, Failures: 0, Errors: 0, Skipped: 0, Time elapsed: 0.001 sec - in org.apache.commons.lang3.time.FastDatePrinterTest
Running org.apache.commons.lang3.time.FastDateParserSDFTest
Tests run: 276, Failures: 0, Errors: 0, Skipped: 92, Time elapsed: 0.068 sec - in org.apache.commons.lang3.time.FastDateParserSDFTest
Running org.apache.commons.lang3.time.DateUtilsTest
DateUtilsTest: Default Locale=en_US
Tests run: 38, Failures: 0, Errors: 1, Skipped: 0, Time elapsed: 0.02 sec <<< FAILURE! - in org.apache.commons.lang3.time.DateUtilsTest
testLang530(org.apache.commons.lang3.time.DateUtilsTest)  Time elapsed: 0 sec  <<< ERROR!
java.lang.NoClassDefFoundError: Could not initialize class org.apache.commons.lang3.time.DateFormatUtils
	at org.apache.commons.lang3.time.DateUtilsTest.testLang530(DateUtilsTest.java:1222)

Running org.apache.commons.lang3.reflect.InheritanceUtilsTest
Tests run: 9, Failures: 0, Errors: 0, Skipped: 0, Time elapsed: 0.004 sec - in org.apache.commons.lang3.reflect.InheritanceUtilsTest
Running org.apache.commons.lang3.reflect.MethodUtilsTest
Tests run: 23, Failures: 0, Errors: 0, Skipped: 0, Time elapsed: 0.027 sec - in org.apache.commons.lang3.reflect.MethodUtilsTest
Running org.apache.commons.lang3.reflect.ConstructorUtilsTest
Tests run: 7, Failures: 0, Errors: 0, Skipped: 0, Time elapsed: 0.004 sec - in org.apache.commons.lang3.reflect.ConstructorUtilsTest
Running org.apache.commons.lang3.reflect.FieldUtilsTest
Tests run: 64, Failures: 0, Errors: 0, Skipped: 0, Time elapsed: 0.029 sec - in org.apache.commons.lang3.reflect.FieldUtilsTest
Running org.apache.commons.lang3.reflect.TypeLiteralTest
Tests run: 4, Failures: 0, Errors: 0, Skipped: 0, Time elapsed: 0.004 sec - in org.apache.commons.lang3.reflect.TypeLiteralTest
Running org.apache.commons.lang3.reflect.TypeUtilsTest
Tests run: 19, Failures: 0, Errors: 0, Skipped: 0, Time elapsed: 0.048 sec - in org.apache.commons.lang3.reflect.TypeUtilsTest
Running org.apache.commons.lang3.mutable.MutableByteTest
Tests run: 17, Failures: 0, Errors: 0, Skipped: 0, Time elapsed: 0.009 sec - in org.apache.commons.lang3.mutable.MutableByteTest
Running org.apache.commons.lang3.mutable.MutableShortTest
Tests run: 14, Failures: 0, Errors: 0, Skipped: 0, Time elapsed: 0.007 sec - in org.apache.commons.lang3.mutable.MutableShortTest
Running org.apache.commons.lang3.mutable.MutableIntTest
Tests run: 17, Failures: 0, Errors: 0, Skipped: 0, Time elapsed: 0.009 sec - in org.apache.commons.lang3.mutable.MutableIntTest
Running org.apache.commons.lang3.mutable.MutableDoubleTest
Tests run: 18, Failures: 0, Errors: 0, Skipped: 0, Time elapsed: 0.009 sec - in org.apache.commons.lang3.mutable.MutableDoubleTest
Running org.apache.commons.lang3.mutable.MutableFloatTest
Tests run: 18, Failures: 0, Errors: 0, Skipped: 0, Time elapsed: 0.007 sec - in org.apache.commons.lang3.mutable.MutableFloatTest
Running org.apache.commons.lang3.mutable.MutableLongTest
Tests run: 17, Failures: 0, Errors: 0, Skipped: 0, Time elapsed: 0.007 sec - in org.apache.commons.lang3.mutable.MutableLongTest
Running org.apache.commons.lang3.mutable.MutableBooleanTest
Tests run: 9, Failures: 0, Errors: 0, Skipped: 0, Time elapsed: 0.003 sec - in org.apache.commons.lang3.mutable.MutableBooleanTest
Running org.apache.commons.lang3.mutable.MutableObjectTest
Tests run: 5, Failures: 0, Errors: 0, Skipped: 0, Time elapsed: 0.002 sec - in org.apache.commons.lang3.mutable.MutableObjectTest
Running org.apache.commons.lang3.text.translate.UnicodeEscaperTest
Tests run: 3, Failures: 0, Errors: 0, Skipped: 0, Time elapsed: 0.001 sec - in org.apache.commons.lang3.text.translate.UnicodeEscaperTest
Running org.apache.commons.lang3.text.translate.EntityArraysTest
Tests run: 3, Failures: 0, Errors: 0, Skipped: 0, Time elapsed: 0.002 sec - in org.apache.commons.lang3.text.translate.EntityArraysTest
Running org.apache.commons.lang3.text.translate.UnicodeUnpairedSurrogateRemoverTest
Tests run: 2, Failures: 0, Errors: 0, Skipped: 0, Time elapsed: 0.001 sec - in org.apache.commons.lang3.text.translate.UnicodeUnpairedSurrogateRemoverTest
Running org.apache.commons.lang3.text.translate.NumericEntityUnescaperTest
Tests run: 3, Failures: 0, Errors: 0, Skipped: 0, Time elapsed: 0.002 sec - in org.apache.commons.lang3.text.translate.NumericEntityUnescaperTest
Running org.apache.commons.lang3.text.translate.NumericEntityEscaperTest
Tests run: 4, Failures: 0, Errors: 0, Skipped: 0, Time elapsed: 0.001 sec - in org.apache.commons.lang3.text.translate.NumericEntityEscaperTest
Running org.apache.commons.lang3.text.translate.LookupTranslatorTest
Tests run: 2, Failures: 0, Errors: 0, Skipped: 0, Time elapsed: 0.001 sec - in org.apache.commons.lang3.text.translate.LookupTranslatorTest
Running org.apache.commons.lang3.text.translate.UnicodeUnescaperTest
Tests run: 3, Failures: 0, Errors: 0, Skipped: 0, Time elapsed: 0.002 sec - in org.apache.commons.lang3.text.translate.UnicodeUnescaperTest
Running org.apache.commons.lang3.text.translate.OctalUnescaperTest
Tests run: 1, Failures: 0, Errors: 0, Skipped: 0, Time elapsed: 0.001 sec - in org.apache.commons.lang3.text.translate.OctalUnescaperTest
Running org.apache.commons.lang3.text.StrMatcherTest
Tests run: 14, Failures: 0, Errors: 0, Skipped: 0, Time elapsed: 0.005 sec - in org.apache.commons.lang3.text.StrMatcherTest
Running org.apache.commons.lang3.text.StrTokenizerTest
Tests run: 55, Failures: 0, Errors: 0, Skipped: 0, Time elapsed: 0.018 sec - in org.apache.commons.lang3.text.StrTokenizerTest
Running org.apache.commons.lang3.text.FormattableUtilsTest
Tests run: 5, Failures: 0, Errors: 0, Skipped: 0, Time elapsed: 0.005 sec - in org.apache.commons.lang3.text.FormattableUtilsTest
Running org.apache.commons.lang3.text.CompositeFormatTest
Tests run: 2, Failures: 0, Errors: 0, Skipped: 0, Time elapsed: 0.001 sec - in org.apache.commons.lang3.text.CompositeFormatTest
Running org.apache.commons.lang3.text.WordUtilsTest
Tests run: 12, Failures: 0, Errors: 0, Skipped: 0, Time elapsed: 0.005 sec - in org.apache.commons.lang3.text.WordUtilsTest
Running org.apache.commons.lang3.text.StrLookupTest
Tests run: 5, Failures: 0, Errors: 0, Skipped: 0, Time elapsed: 0.003 sec - in org.apache.commons.lang3.text.StrLookupTest
Running org.apache.commons.lang3.text.StrBuilderAppendInsertTest
Tests run: 51, Failures: 0, Errors: 0, Skipped: 0, Time elapsed: 0.016 sec - in org.apache.commons.lang3.text.StrBuilderAppendInsertTest
Running org.apache.commons.lang3.text.ExtendedMessageFormatTest
Tests run: 10, Failures: 0, Errors: 0, Skipped: 0, Time elapsed: 0.794 sec - in org.apache.commons.lang3.text.ExtendedMessageFormatTest
Running org.apache.commons.lang3.text.StrSubstitutorTest
Tests run: 40, Failures: 0, Errors: 0, Skipped: 0, Time elapsed: 0.033 sec - in org.apache.commons.lang3.text.StrSubstitutorTest
Running org.apache.commons.lang3.text.StrBuilderTest
Tests run: 90, Failures: 0, Errors: 0, Skipped: 0, Time elapsed: 0.044 sec - in org.apache.commons.lang3.text.StrBuilderTest
Running org.apache.commons.lang3.StringEscapeUtilsTest
Tests run: 28, Failures: 0, Errors: 0, Skipped: 0, Time elapsed: 0.463 sec - in org.apache.commons.lang3.StringEscapeUtilsTest
Running org.apache.commons.lang3.AnnotationUtilsTest
Tests run: 10, Failures: 0, Errors: 0, Skipped: 0, Time elapsed: 0.022 sec - in org.apache.commons.lang3.AnnotationUtilsTest
Running org.apache.commons.lang3.ConversionTest
Tests run: 42, Failures: 0, Errors: 0, Skipped: 0, Time elapsed: 0.01 sec - in org.apache.commons.lang3.ConversionTest
Running org.apache.commons.lang3.StringUtilsTrimEmptyTest
Tests run: 15, Failures: 0, Errors: 0, Skipped: 0, Time elapsed: 0.004 sec - in org.apache.commons.lang3.StringUtilsTrimEmptyTest
Running org.apache.commons.lang3.EnumUtilsTest
Tests run: 34, Failures: 0, Errors: 0, Skipped: 0, Time elapsed: 0.009 sec - in org.apache.commons.lang3.EnumUtilsTest
Running org.apache.commons.lang3.exception.ExceptionUtilsTest
Tests run: 28, Failures: 0, Errors: 0, Skipped: 0, Time elapsed: 0.03 sec - in org.apache.commons.lang3.exception.ExceptionUtilsTest
Running org.apache.commons.lang3.exception.DefaultExceptionContextTest
Tests run: 8, Failures: 0, Errors: 0, Skipped: 0, Time elapsed: 0.005 sec - in org.apache.commons.lang3.exception.DefaultExceptionContextTest
Running org.apache.commons.lang3.exception.ContextedExceptionTest
Tests run: 14, Failures: 0, Errors: 0, Skipped: 0, Time elapsed: 0.011 sec - in org.apache.commons.lang3.exception.ContextedExceptionTest
Running org.apache.commons.lang3.exception.ContextedRuntimeExceptionTest
Tests run: 14, Failures: 0, Errors: 0, Skipped: 0, Time elapsed: 0.012 sec - in org.apache.commons.lang3.exception.ContextedRuntimeExceptionTest
Running org.apache.commons.lang3.BitFieldTest
Tests run: 15, Failures: 0, Errors: 0, Skipped: 0, Time elapsed: 0.002 sec - in org.apache.commons.lang3.BitFieldTest
Running org.apache.commons.lang3.ArrayUtilsRemoveMultipleTest
Tests run: 55, Failures: 0, Errors: 0, Skipped: 0, Time elapsed: 0.015 sec - in org.apache.commons.lang3.ArrayUtilsRemoveMultipleTest
Running org.apache.commons.lang3.HashSetvBitSetTest
Ratio=7% array=100 count=1 extract=25031966 bitset=1969580
Ratio=7% array=100 count=10 extract=24197878 bitset=1887084
Ratio=18% array=100 count=50 extract=9220938 bitset=1682365
Ratio=4% array=100 count=100 extract=10559170 bitset=470636
Ratio=88% array=1000 count=10 extract=6276939 bitset=5560059
Ratio=33% array=1000 count=100 extract=16184037 bitset=5465792
Ratio=8% array=1000 count=500 extract=45708341 bitset=3672541
Ratio=1% array=1000 count=1000 extract=76032666 bitset=790489
Ratio=41% count=0 hash=8694979 bits=3641121
Ratio=401% count=5 hash=600719 bits=2414675
Ratio=30% count=10 hash=937764 bits=289623
Ratio=22% count=200 hash=20056466 bits=4519836
Ratio=11% count=50 hash=9836019 bits=1089779
Ratio=27% count=100 hash=8304389 bits=2291214
Ratio=35% count=1000 hash=77501813 bits=27246343
Ratio=21% count=2000 hash=155721438 bits=34189276
Tests run: 2, Failures: 0, Errors: 0, Skipped: 0, Time elapsed: 0.703 sec - in org.apache.commons.lang3.HashSetvBitSetTest
Running org.apache.commons.lang3.StringUtilsTest
Tests run: 124, Failures: 0, Errors: 0, Skipped: 0, Time elapsed: 0.176 sec - in org.apache.commons.lang3.StringUtilsTest
Running org.apache.commons.lang3.ArrayUtilsRemoveTest
Tests run: 19, Failures: 0, Errors: 0, Skipped: 0, Time elapsed: 0.01 sec - in org.apache.commons.lang3.ArrayUtilsRemoveTest
Running org.apache.commons.lang3.ObjectUtilsTest
Tests run: 36, Failures: 0, Errors: 0, Skipped: 0, Time elapsed: 0.028 sec - in org.apache.commons.lang3.ObjectUtilsTest
Running org.apache.commons.lang3.ClassPathUtilsTest
Tests run: 13, Failures: 0, Errors: 0, Skipped: 0, Time elapsed: 0.008 sec - in org.apache.commons.lang3.ClassPathUtilsTest
Running org.apache.commons.lang3.math.NumberUtilsTest
Tests run: 91, Failures: 0, Errors: 0, Skipped: 0, Time elapsed: 0.046 sec - in org.apache.commons.lang3.math.NumberUtilsTest
Running org.apache.commons.lang3.math.IEEE754rUtilsTest
Tests run: 3, Failures: 0, Errors: 0, Skipped: 0, Time elapsed: 0.003 sec - in org.apache.commons.lang3.math.IEEE754rUtilsTest
Running org.apache.commons.lang3.math.FractionTest
Tests run: 25, Failures: 0, Errors: 0, Skipped: 0, Time elapsed: 0.291 sec - in org.apache.commons.lang3.math.FractionTest
Running org.apache.commons.lang3.BooleanUtilsTest
Tests run: 72, Failures: 0, Errors: 0, Skipped: 0, Time elapsed: 0.013 sec - in org.apache.commons.lang3.BooleanUtilsTest
Running org.apache.commons.lang3.CharSequenceUtilsTest
Tests run: 2, Failures: 0, Errors: 0, Skipped: 0, Time elapsed: 0 sec - in org.apache.commons.lang3.CharSequenceUtilsTest
Running org.apache.commons.lang3.CharSetUtilsTest
Tests run: 11, Failures: 0, Errors: 0, Skipped: 0, Time elapsed: 0.002 sec - in org.apache.commons.lang3.CharSetUtilsTest
Running org.apache.commons.lang3.ArrayUtilsAddTest
Tests run: 13, Failures: 0, Errors: 0, Skipped: 0, Time elapsed: 0.005 sec - in org.apache.commons.lang3.ArrayUtilsAddTest
Running org.apache.commons.lang3.CharEncodingTest
Tests run: 6, Failures: 0, Errors: 0, Skipped: 0, Time elapsed: 0.031 sec - in org.apache.commons.lang3.CharEncodingTest
Running org.apache.commons.lang3.ClassUtilsTest
Tests run: 57, Failures: 0, Errors: 0, Skipped: 0, Time elapsed: 0.045 sec - in org.apache.commons.lang3.ClassUtilsTest
Running org.apache.commons.lang3.RangeTest
Tests run: 24, Failures: 0, Errors: 0, Skipped: 0, Time elapsed: 0.031 sec - in org.apache.commons.lang3.RangeTest
Running org.apache.commons.lang3.event.EventUtilsTest
Tests run: 8, Failures: 0, Errors: 0, Skipped: 0, Time elapsed: 0.021 sec - in org.apache.commons.lang3.event.EventUtilsTest
Running org.apache.commons.lang3.event.EventListenerSupportTest
Tests run: 9, Failures: 0, Errors: 0, Skipped: 0, Time elapsed: 0.025 sec - in org.apache.commons.lang3.event.EventListenerSupportTest
Running org.apache.commons.lang3.ArrayUtilsTest
Tests run: 205, Failures: 0, Errors: 0, Skipped: 0, Time elapsed: 0.081 sec - in org.apache.commons.lang3.ArrayUtilsTest
Running org.apache.commons.lang3.CharUtilsTest
Tests run: 24, Failures: 0, Errors: 0, Skipped: 0, Time elapsed: 0.03 sec - in org.apache.commons.lang3.CharUtilsTest
Running org.apache.commons.lang3.NotImplementedExceptionTest
Tests run: 1, Failures: 0, Errors: 0, Skipped: 0, Time elapsed: 0.004 sec - in org.apache.commons.lang3.NotImplementedExceptionTest
Running org.apache.commons.lang3.StringUtilsEqualsIndexOfTest
Tests run: 50, Failures: 0, Errors: 0, Skipped: 0, Time elapsed: 0.034 sec - in org.apache.commons.lang3.StringUtilsEqualsIndexOfTest
Running org.apache.commons.lang3.RandomUtilsTest
Tests run: 23, Failures: 0, Errors: 0, Skipped: 0, Time elapsed: 0.016 sec - in org.apache.commons.lang3.RandomUtilsTest

Results :


Tests in error: 
  DateFormatUtilsTest.testConstructor:39 NoClassDefFound Could not initialize cl...
  DateFormatUtilsTest.testDateISO:145 NoClassDefFound Could not initialize class...
  DateFormatUtilsTest.testDateTimeISO:113 NoClassDefFound Could not initialize c...
  DateFormatUtilsTest.testFormat:62 NoClassDefFound Could not initialize class o...
  DateFormatUtilsTest.testFormatCalendar:86 NoClassDefFound Could not initialize...
  DateFormatUtilsTest.testFormatUTC:99 NoClassDefFound Could not initialize clas...
  DateFormatUtilsTest.testLANG1000:266 NoClassDefFound Could not initialize clas...
  DateFormatUtilsTest.testSMTP:217 NoClassDefFound Could not initialize class or...
  DateFormatUtilsTest.testTimeISO:169 NoClassDefFound Could not initialize class...
  DateFormatUtilsTest.testTimeNoTISO:193 NoClassDefFound Could not initialize cl...
  DateUtilsRoundingTest.<init>:55 NoClassDefFound Could not initialize class org...
  DateUtilsRoundingTest.<init>:55 NoClassDefFound Could not initialize class org...
  DateUtilsRoundingTest.<init>:55 NoClassDefFound Could not initialize class org...
  DateUtilsRoundingTest.<init>:55 NoClassDefFound Could not initialize class org...
  DateUtilsRoundingTest.<init>:55 NoClassDefFound Could not initialize class org...
  DateUtilsRoundingTest.<init>:55 ExceptionInInitializer
  DateUtilsRoundingTest.<init>:55 NoClassDefFound Could not initialize class org...
  DateUtilsRoundingTest.<init>:55 NoClassDefFound Could not initialize class org...
  DateUtilsRoundingTest.<init>:55 NoClassDefFound Could not initialize class org...
  DateUtilsRoundingTest.<init>:55 NoClassDefFound Could not initialize class org...
  DateUtilsRoundingTest.<init>:55 NoClassDefFound Could not initialize class org...
  DateUtilsRoundingTest.<init>:55 NoClassDefFound Could not initialize class org...
  DateUtilsRoundingTest.<init>:55 NoClassDefFound Could not initialize class org...
  DateUtilsRoundingTest.<init>:55 NoClassDefFound Could not initialize class org...
  DateUtilsRoundingTest.<init>:55 NoClassDefFound Could not initialize class org...
  DateUtilsRoundingTest.<init>:55 NoClassDefFound Could not initialize class org...
  DateUtilsRoundingTest.<init>:55 NoClassDefFound Could not initialize class org...
  DateUtilsRoundingTest.<init>:55 NoClassDefFound Could not initialize class org...
  DateUtilsRoundingTest.<init>:55 NoClassDefFound Could not initialize class org...
  DateUtilsRoundingTest.<init>:55 NoClassDefFound Could not initialize class org...
  DateUtilsRoundingTest.<init>:55 NoClassDefFound Could not initialize class org...
  DateUtilsRoundingTest.<init>:55 NoClassDefFound Could not initialize class org...
  DateUtilsTest.testLang530:1222 NoClassDefFound Could not initialize class org....
  DurationFormatUtilsTest.testFormatPeriodISO:269 NoClassDefFound Could not init...
  FastDateFormatTest.testLang954:259 » StringIndexOutOfBounds String index out o...
  FastDateFormatTest.testParseSync:265 » StringIndexOutOfBounds String index out...
  FastDateFormatTest.test_changeDefault_Locale_DateTimeInstance:145 » StringIndexOutOfBounds
  FastDateFormat_ParserTest>FastDateParserTest.test1806:632->FastDateParserTest.getInstance:76->getInstance:31 » StringIndexOutOfBounds
  FastDateFormat_ParserTest>FastDateParserTest.testLANG_832:411->FastDateParserTest.testSdfAndFdp:442->getInstance:31 » StringIndexOutOfBounds
  FastDateFormat_ParserTest>FastDateParserTest.testLang538:529->FastDateParserTest.getInstance:76->getInstance:31 » StringIndexOutOfBounds
  FastDateFormat_ParserTest>FastDateParserTest.testLocaleMatches:563->FastDateParserTest.getInstance:72->getInstance:31 » StringIndexOutOfBounds
  FastDateFormat_ParserTest>FastDateParserTest.testParseZone:122->getInstance:31 » StringIndexOutOfBounds
  FastDateFormat_ParserTest>FastDateParserTest.testPatternMatches:557->FastDateParserTest.getInstance:64->getInstance:31 » StringIndexOutOfBounds
  FastDateFormat_ParserTest>FastDateParserTest.testQuotes:387->getInstance:31 » StringIndexOutOfBounds
  FastDateFormat_ParserTest>FastDateParserTest.testSpecialCharacters:397->FastDateParserTest.testSdfAndFdp:442->getInstance:31 » StringIndexOutOfBounds
  FastDateFormat_ParserTest>FastDateParserTest.testTimeZoneMatches:569->FastDateParserTest.getInstance:76->getInstance:31 » StringIndexOutOfBounds
  FastDateFormat_ParserTest>FastDateParserTest.test_Equality_Hash:94->getInstance:31 » StringIndexOutOfBounds
  FastDateFormat_PrinterTest>FastDatePrinterTest.testFormat:89->FastDatePrinterTest.getInstance:48->getInstance:31 » StringIndexOutOfBounds
  FastDateFormat_PrinterTest>FastDatePrinterTest.testLang538:213->FastDatePrinterTest.getInstance:60->getInstance:31 » StringIndexOutOfBounds
  FastDateFormat_PrinterTest>FastDatePrinterTest.testLang645:226->FastDatePrinterTest.getInstance:56->getInstance:31 » StringIndexOutOfBounds
  FastDateParserTest.test1806:632->getInstance:76->getInstance:89 » StringIndexOutOfBounds
  FastDateParserTest.testLANG_832:411->testSdfAndFdp:442->getInstance:89 » StringIndexOutOfBounds
  FastDateParserTest.testLang538:529->getInstance:76->getInstance:89 » StringIndexOutOfBounds
  FastDateParserTest.testLocaleMatches:563->getInstance:72->getInstance:89 » StringIndexOutOfBounds
  FastDateParserTest.testParseZone:122->getInstance:89 » StringIndexOutOfBounds ...
  FastDateParserTest.testPatternMatches:557->getInstance:64->getInstance:89 » StringIndexOutOfBounds
  FastDateParserTest.testQuotes:387->getInstance:89 » StringIndexOutOfBounds Str...
  FastDateParserTest.testSpecialCharacters:397->testSdfAndFdp:442->getInstance:89 » StringIndexOutOfBounds
  FastDateParserTest.testTimeZoneMatches:569->getInstance:76->getInstance:89 » StringIndexOutOfBounds
  FastDateParserTest.test_Equality_Hash:94->getInstance:89 » StringIndexOutOfBounds


Tests run: 3526, Failures: 0, Errors: 60, Skipped: 97

[INFO] ------------------------------------------------------------------------
[INFO] BUILD FAILURE
[INFO] ------------------------------------------------------------------------
[INFO] Total time: 34.940s
[INFO] Finished at: Wed Aug 05 09:09:18 BST 2015
[INFO] Final Memory: 25M/497M
[INFO] ------------------------------------------------------------------------
[ERROR] Failed to execute goal org.apache.maven.plugins:maven-surefire-plugin:2.18:test (default-test) on project commons-lang3: There are test failures.
[ERROR] 
[ERROR] Please refer to /home/perham/Study/LittleDarwin/Cases/commons-lang3-3.4-src/target/surefire-reports for the individual test results.
[ERROR] -> [Help 1]
[ERROR] 
[ERROR] To see the full stack trace of the errors, re-run Maven with the -e switch.
[ERROR] Re-run Maven using the -X switch to enable full debug logging.
[ERROR] 
[ERROR] For more information about the errors and possible solutions, please read the following articles:
[ERROR] [Help 1] http://cwiki.apache.org/confluence/display/MAVEN/MojoFailureException
