[INFO] Scanning for projects...
[INFO]                                                                         
[INFO] ------------------------------------------------------------------------
[INFO] Building Apache Commons Lang 3.4
[INFO] ------------------------------------------------------------------------
[INFO] 
[INFO] --- maven-enforcer-plugin:1.3.1:enforce (enforce-maven-3) @ commons-lang3 ---
[INFO] 
[INFO] --- build-helper-maven-plugin:1.8:parse-version (parse-version) @ commons-lang3 ---
[INFO] 
[INFO] --- maven-antrun-plugin:1.8:run (javadoc.resources) @ commons-lang3 ---
[INFO] Executing tasks

main:
[INFO] Executed tasks
[INFO] 
[INFO] --- maven-remote-resources-plugin:1.5:process (default) @ commons-lang3 ---
[INFO] 
[INFO] --- buildnumber-maven-plugin:1.3:create (default) @ commons-lang3 ---
[INFO] Executing: /bin/sh -c cd /home/perham/Study/LittleDarwin/Cases/commons-lang3-3.4-src && svn --non-interactive info
[INFO] Working directory: /home/perham/Study/LittleDarwin/Cases/commons-lang3-3.4-src
[INFO] Storing buildNumber: ?????? at timestamp: 1438763690905
[INFO] Executing: /bin/sh -c cd /home/perham/Study/LittleDarwin/Cases/commons-lang3-3.4-src && svn --non-interactive info
[INFO] Working directory: /home/perham/Study/LittleDarwin/Cases/commons-lang3-3.4-src
[INFO] Storing buildScmBranch: UNKNOWN_BRANCH
[INFO] 
[INFO] --- maven-resources-plugin:2.7:resources (default-resources) @ commons-lang3 ---
[INFO] Using 'ISO-8859-1' encoding to copy filtered resources.
[INFO] Copying 0 resource
[INFO] Copying 2 resources to META-INF
[INFO] 
[INFO] --- maven-compiler-plugin:3.2:compile (default-compile) @ commons-lang3 ---
[INFO] Changes detected - recompiling the module!
[INFO] Compiling 133 source files to /home/perham/Study/LittleDarwin/Cases/commons-lang3-3.4-src/target/classes
[INFO] /home/perham/Study/LittleDarwin/Cases/commons-lang3-3.4-src/src/main/java/org/apache/commons/lang3/SerializationUtils.java: /home/perham/Study/LittleDarwin/Cases/commons-lang3-3.4-src/src/main/java/org/apache/commons/lang3/SerializationUtils.java uses unchecked or unsafe operations.
[INFO] /home/perham/Study/LittleDarwin/Cases/commons-lang3-3.4-src/src/main/java/org/apache/commons/lang3/SerializationUtils.java: Recompile with -Xlint:unchecked for details.
[INFO] 
[INFO] --- maven-bundle-plugin:2.5.3:manifest (bundle-manifest) @ commons-lang3 ---
[INFO] 
[INFO] --- animal-sniffer-maven-plugin:1.13:check (checkAPIcompatibility) @ commons-lang3 ---
[INFO] Checking unresolved references to org.codehaus.mojo.signature:java16:1.0
[INFO] 
[INFO] --- maven-resources-plugin:2.7:testResources (default-testResources) @ commons-lang3 ---
[INFO] Using 'ISO-8859-1' encoding to copy filtered resources.
[INFO] Copying 2 resources
[INFO] Copying 2 resources to META-INF
[INFO] 
[INFO] --- maven-compiler-plugin:3.2:testCompile (default-testCompile) @ commons-lang3 ---
[INFO] Nothing to compile - all classes are up to date
[INFO] 
[INFO] --- maven-surefire-plugin:2.18:test (default-test) @ commons-lang3 ---
[INFO] Surefire report directory: /home/perham/Study/LittleDarwin/Cases/commons-lang3-3.4-src/target/surefire-reports

-------------------------------------------------------
 T E S T S
-------------------------------------------------------
Running org.apache.commons.lang3.ValidateTest
Tests run: 63, Failures: 0, Errors: 0, Skipped: 0, Time elapsed: 0.038 sec - in org.apache.commons.lang3.ValidateTest
Running org.apache.commons.lang3.LocaleUtilsTest
Tests run: 15, Failures: 0, Errors: 0, Skipped: 0, Time elapsed: 0.009 sec - in org.apache.commons.lang3.LocaleUtilsTest
Running org.apache.commons.lang3.tuple.MutableTripleTest
Tests run: 8, Failures: 0, Errors: 0, Skipped: 0, Time elapsed: 0.013 sec - in org.apache.commons.lang3.tuple.MutableTripleTest
Running org.apache.commons.lang3.tuple.TripleTest
Tests run: 10, Failures: 0, Errors: 0, Skipped: 0, Time elapsed: 0.014 sec - in org.apache.commons.lang3.tuple.TripleTest
Running org.apache.commons.lang3.tuple.ImmutablePairTest
Tests run: 6, Failures: 0, Errors: 0, Skipped: 0, Time elapsed: 0.004 sec - in org.apache.commons.lang3.tuple.ImmutablePairTest
Running org.apache.commons.lang3.tuple.MutablePairTest
Tests run: 8, Failures: 0, Errors: 0, Skipped: 0, Time elapsed: 0.004 sec - in org.apache.commons.lang3.tuple.MutablePairTest
Running org.apache.commons.lang3.tuple.ImmutableTripleTest
Tests run: 6, Failures: 0, Errors: 0, Skipped: 0, Time elapsed: 0 sec - in org.apache.commons.lang3.tuple.ImmutableTripleTest
Running org.apache.commons.lang3.tuple.PairTest
Tests run: 9, Failures: 0, Errors: 0, Skipped: 0, Time elapsed: 0.001 sec - in org.apache.commons.lang3.tuple.PairTest
Running org.apache.commons.lang3.StringUtilsIsTest
Tests run: 8, Failures: 0, Errors: 0, Skipped: 0, Time elapsed: 0.015 sec - in org.apache.commons.lang3.StringUtilsIsTest
Running org.apache.commons.lang3.JavaVersionTest
Tests run: 3, Failures: 0, Errors: 0, Skipped: 0, Time elapsed: 0 sec - in org.apache.commons.lang3.JavaVersionTest
Running org.apache.commons.lang3.builder.NoFieldNamesToStringStyleTest
Tests run: 8, Failures: 0, Errors: 0, Skipped: 0, Time elapsed: 0.001 sec - in org.apache.commons.lang3.builder.NoFieldNamesToStringStyleTest
Running org.apache.commons.lang3.builder.ShortPrefixToStringStyleTest
Tests run: 8, Failures: 0, Errors: 0, Skipped: 0, Time elapsed: 0.004 sec - in org.apache.commons.lang3.builder.ShortPrefixToStringStyleTest
Running org.apache.commons.lang3.builder.DiffResultTest
Tests run: 9, Failures: 0, Errors: 0, Skipped: 0, Time elapsed: 0.007 sec - in org.apache.commons.lang3.builder.DiffResultTest
Running org.apache.commons.lang3.builder.CompareToBuilderTest
Tests run: 48, Failures: 0, Errors: 0, Skipped: 0, Time elapsed: 0.003 sec - in org.apache.commons.lang3.builder.CompareToBuilderTest
Running org.apache.commons.lang3.builder.MultilineRecursiveToStringStyleTest
Tests run: 10, Failures: 0, Errors: 0, Skipped: 0, Time elapsed: 0.001 sec - in org.apache.commons.lang3.builder.MultilineRecursiveToStringStyleTest
Running org.apache.commons.lang3.builder.RecursiveToStringStyleTest
Tests run: 8, Failures: 0, Errors: 0, Skipped: 0, Time elapsed: 0.002 sec - in org.apache.commons.lang3.builder.RecursiveToStringStyleTest
Running org.apache.commons.lang3.builder.DefaultToStringStyleTest
Tests run: 8, Failures: 0, Errors: 0, Skipped: 0, Time elapsed: 0.002 sec - in org.apache.commons.lang3.builder.DefaultToStringStyleTest
Running org.apache.commons.lang3.builder.ReflectionToStringBuilderExcludeTest
Tests run: 11, Failures: 0, Errors: 0, Skipped: 0, Time elapsed: 0.001 sec - in org.apache.commons.lang3.builder.ReflectionToStringBuilderExcludeTest
Running org.apache.commons.lang3.builder.StandardToStringStyleTest
Tests run: 8, Failures: 0, Errors: 0, Skipped: 0, Time elapsed: 0.001 sec - in org.apache.commons.lang3.builder.StandardToStringStyleTest
Running org.apache.commons.lang3.builder.ToStringStyleTest
Tests run: 12, Failures: 0, Errors: 0, Skipped: 0, Time elapsed: 0.001 sec - in org.apache.commons.lang3.builder.ToStringStyleTest
Running org.apache.commons.lang3.builder.DiffTest
Tests run: 4, Failures: 0, Errors: 0, Skipped: 0, Time elapsed: 0 sec - in org.apache.commons.lang3.builder.DiffTest
Running org.apache.commons.lang3.builder.SimpleToStringStyleTest
Tests run: 8, Failures: 0, Errors: 0, Skipped: 0, Time elapsed: 0 sec - in org.apache.commons.lang3.builder.SimpleToStringStyleTest
Running org.apache.commons.lang3.builder.MultiLineToStringStyleTest
Tests run: 8, Failures: 0, Errors: 0, Skipped: 0, Time elapsed: 0.007 sec - in org.apache.commons.lang3.builder.MultiLineToStringStyleTest
Running org.apache.commons.lang3.builder.ToStringStyleConcurrencyTest
Tests run: 3, Failures: 0, Errors: 0, Skipped: 0, Time elapsed: 5.186 sec - in org.apache.commons.lang3.builder.ToStringStyleConcurrencyTest
Running org.apache.commons.lang3.builder.ReflectionToStringBuilderMutateInspectConcurrencyTest
Tests run: 1, Failures: 0, Errors: 0, Skipped: 1, Time elapsed: 0 sec - in org.apache.commons.lang3.builder.ReflectionToStringBuilderMutateInspectConcurrencyTest
Running org.apache.commons.lang3.builder.ToStringBuilderTest
Tests run: 74, Failures: 0, Errors: 0, Skipped: 1, Time elapsed: 0.076 sec - in org.apache.commons.lang3.builder.ToStringBuilderTest
Running org.apache.commons.lang3.builder.EqualsBuilderTest
Tests run: 48, Failures: 0, Errors: 0, Skipped: 0, Time elapsed: 0.036 sec - in org.apache.commons.lang3.builder.EqualsBuilderTest
Running org.apache.commons.lang3.builder.HashCodeBuilderAndEqualsBuilderTest
Tests run: 4, Failures: 0, Errors: 0, Skipped: 0, Time elapsed: 0.008 sec - in org.apache.commons.lang3.builder.HashCodeBuilderAndEqualsBuilderTest
Running org.apache.commons.lang3.builder.ReflectionToStringBuilderConcurrencyTest
Tests run: 3, Failures: 0, Errors: 0, Skipped: 3, Time elapsed: 0.001 sec - in org.apache.commons.lang3.builder.ReflectionToStringBuilderConcurrencyTest
Running org.apache.commons.lang3.builder.JsonToStringStyleTest
Tests run: 9, Failures: 0, Errors: 0, Skipped: 0, Time elapsed: 0.002 sec - in org.apache.commons.lang3.builder.JsonToStringStyleTest
Running org.apache.commons.lang3.builder.NoClassNameToStringStyleTest
Tests run: 8, Failures: 0, Errors: 0, Skipped: 0, Time elapsed: 0.007 sec - in org.apache.commons.lang3.builder.NoClassNameToStringStyleTest
Running org.apache.commons.lang3.builder.DiffBuilderTest
Tests run: 30, Failures: 0, Errors: 0, Skipped: 0, Time elapsed: 0.024 sec - in org.apache.commons.lang3.builder.DiffBuilderTest
Running org.apache.commons.lang3.builder.HashCodeBuilderTest
Tests run: 44, Failures: 0, Errors: 0, Skipped: 0, Time elapsed: 0.026 sec - in org.apache.commons.lang3.builder.HashCodeBuilderTest
Running org.apache.commons.lang3.concurrent.AtomicInitializerTest
Tests run: 3, Failures: 0, Errors: 0, Skipped: 0, Time elapsed: 0.007 sec - in org.apache.commons.lang3.concurrent.AtomicInitializerTest
Running org.apache.commons.lang3.concurrent.CallableBackgroundInitializerTest
Tests run: 4, Failures: 0, Errors: 0, Skipped: 0, Time elapsed: 0.003 sec - in org.apache.commons.lang3.concurrent.CallableBackgroundInitializerTest
Running org.apache.commons.lang3.concurrent.BackgroundInitializerTest
Tests run: 15, Failures: 0, Errors: 0, Skipped: 0, Time elapsed: 0.016 sec - in org.apache.commons.lang3.concurrent.BackgroundInitializerTest
Running org.apache.commons.lang3.concurrent.LazyInitializerTest
Tests run: 3, Failures: 0, Errors: 0, Skipped: 0, Time elapsed: 0.008 sec - in org.apache.commons.lang3.concurrent.LazyInitializerTest
Running org.apache.commons.lang3.concurrent.BasicThreadFactoryTest
Tests run: 15, Failures: 0, Errors: 0, Skipped: 0, Time elapsed: 0.031 sec - in org.apache.commons.lang3.concurrent.BasicThreadFactoryTest
Running org.apache.commons.lang3.concurrent.ConstantInitializerTest
Tests run: 7, Failures: 0, Errors: 0, Skipped: 0, Time elapsed: 0.001 sec - in org.apache.commons.lang3.concurrent.ConstantInitializerTest
Running org.apache.commons.lang3.concurrent.MultiBackgroundInitializerTest
Tests run: 17, Failures: 0, Errors: 0, Skipped: 0, Time elapsed: 0.064 sec - in org.apache.commons.lang3.concurrent.MultiBackgroundInitializerTest
Running org.apache.commons.lang3.concurrent.AtomicSafeInitializerTest
Tests run: 4, Failures: 0, Errors: 0, Skipped: 0, Time elapsed: 0.004 sec - in org.apache.commons.lang3.concurrent.AtomicSafeInitializerTest
Running org.apache.commons.lang3.concurrent.ConcurrentUtilsTest
Tests run: 40, Failures: 0, Errors: 0, Skipped: 0, Time elapsed: 0.012 sec - in org.apache.commons.lang3.concurrent.ConcurrentUtilsTest
Running org.apache.commons.lang3.concurrent.TimedSemaphoreTest
Tests run: 15, Failures: 0, Errors: 0, Skipped: 0, Time elapsed: 1.182 sec - in org.apache.commons.lang3.concurrent.TimedSemaphoreTest
Running org.apache.commons.lang3.StringUtilsSubstringTest
Tests run: 14, Failures: 0, Errors: 0, Skipped: 0, Time elapsed: 0 sec - in org.apache.commons.lang3.StringUtilsSubstringTest
Running org.apache.commons.lang3.SystemUtilsTest
Tests run: 12, Failures: 0, Errors: 0, Skipped: 0, Time elapsed: 0.001 sec - in org.apache.commons.lang3.SystemUtilsTest
Running org.apache.commons.lang3.CharRangeTest
Tests run: 16, Failures: 0, Errors: 0, Skipped: 0, Time elapsed: 0.035 sec - in org.apache.commons.lang3.CharRangeTest
Running org.apache.commons.lang3.CharSetTest
Tests run: 14, Failures: 0, Errors: 0, Skipped: 0, Time elapsed: 0.009 sec - in org.apache.commons.lang3.CharSetTest
Running org.apache.commons.lang3.StringUtilsStartsEndsWithTest
Tests run: 6, Failures: 0, Errors: 0, Skipped: 0, Time elapsed: 0 sec - in org.apache.commons.lang3.StringUtilsStartsEndsWithTest
Running org.apache.commons.lang3.RandomStringUtilsTest
Tests run: 11, Failures: 0, Errors: 0, Skipped: 0, Time elapsed: 0.034 sec - in org.apache.commons.lang3.RandomStringUtilsTest
Running org.apache.commons.lang3.SerializationUtilsTest
Tests run: 26, Failures: 0, Errors: 0, Skipped: 0, Time elapsed: 0.053 sec - in org.apache.commons.lang3.SerializationUtilsTest
Running org.apache.commons.lang3.time.StopWatchTest
Tests run: 8, Failures: 0, Errors: 0, Skipped: 0, Time elapsed: 4.759 sec - in org.apache.commons.lang3.time.StopWatchTest
Running org.apache.commons.lang3.time.DateUtilsRoundingTest
Tests run: 22, Failures: 0, Errors: 0, Skipped: 0, Time elapsed: 0.172 sec - in org.apache.commons.lang3.time.DateUtilsRoundingTest
Running org.apache.commons.lang3.time.FastDateParserTest
Tests run: 33, Failures: 23, Errors: 1, Skipped: 0, Time elapsed: 0.106 sec <<< FAILURE! - in org.apache.commons.lang3.time.FastDateParserTest
testSpecialCharacters(org.apache.commons.lang3.time.FastDateParserTest)  Time elapsed: 0.012 sec  <<< ERROR!
java.lang.ArrayIndexOutOfBoundsException: 0
	at org.apache.commons.lang3.time.FastDateParser.parse(FastDateParser.java:100)
	at org.apache.commons.lang3.time.FastDateParser.parse(FastDateParser.java:88)
	at org.apache.commons.lang3.time.FastDateParserTest.testSdfAndFdp(FastDateParserTest.java:443)
	at org.apache.commons.lang3.time.FastDateParserTest.testSpecialCharacters(FastDateParserTest.java:395)

testShortDateStyleWithLocales(org.apache.commons.lang3.time.FastDateParserTest)  Time elapsed: 0.001 sec  <<< FAILURE!
java.lang.AssertionError: expected:<Tue Feb 03 00:00:00 GMT 2004> but was:<Thu Jan 01 00:00:00 GMT 1970>
	at org.junit.Assert.fail(Assert.java:88)
	at org.junit.Assert.failNotEquals(Assert.java:834)
	at org.junit.Assert.assertEquals(Assert.java:118)
	at org.junit.Assert.assertEquals(Assert.java:144)
	at org.apache.commons.lang3.time.FastDateParserTest.testShortDateStyleWithLocales(FastDateParserTest.java:479)

testMilleniumBug(org.apache.commons.lang3.time.FastDateParserTest)  Time elapsed: 0.003 sec  <<< FAILURE!
java.lang.AssertionError: expected:<Mon Jan 01 00:00:00 GMT 1000> but was:<Thu Jan 01 00:00:00 GMT 1970>
	at org.junit.Assert.fail(Assert.java:88)
	at org.junit.Assert.failNotEquals(Assert.java:834)
	at org.junit.Assert.assertEquals(Assert.java:118)
	at org.junit.Assert.assertEquals(Assert.java:144)
	at org.apache.commons.lang3.time.FastDateParserTest.testMilleniumBug(FastDateParserTest.java:512)

testDayOf(org.apache.commons.lang3.time.FastDateParserTest)  Time elapsed: 0.001 sec  <<< FAILURE!
java.lang.AssertionError: expected:<Mon Feb 10 05:00:00 GMT 2003> but was:<Thu Jan 01 06:00:00 GMT 1970>
	at org.junit.Assert.fail(Assert.java:88)
	at org.junit.Assert.failNotEquals(Assert.java:834)
	at org.junit.Assert.assertEquals(Assert.java:118)
	at org.junit.Assert.assertEquals(Assert.java:144)
	at org.apache.commons.lang3.time.FastDateParserTest.testDayOf(FastDateParserTest.java:465)

testParseZone(org.apache.commons.lang3.time.FastDateParserTest)  Time elapsed: 0.003 sec  <<< FAILURE!
java.lang.AssertionError: expected:<Thu Jul 10 21:33:20 BST 2003> but was:<Thu Jan 01 06:00:00 GMT 1970>
	at org.junit.Assert.fail(Assert.java:88)
	at org.junit.Assert.failNotEquals(Assert.java:834)
	at org.junit.Assert.assertEquals(Assert.java:118)
	at org.junit.Assert.assertEquals(Assert.java:144)
	at org.apache.commons.lang3.time.FastDateParserTest.testParseZone(FastDateParserTest.java:124)

test1806(org.apache.commons.lang3.time.FastDateParserTest)  Time elapsed: 0.002 sec  <<< FAILURE!
java.lang.AssertionError: India Standard Time;+05 expected:<981268736235> but was:<-21600000>
	at org.junit.Assert.fail(Assert.java:88)
	at org.junit.Assert.failNotEquals(Assert.java:834)
	at org.junit.Assert.assertEquals(Assert.java:645)
	at org.apache.commons.lang3.time.FastDateParserTest.test1806(FastDateParserTest.java:633)

testAmPm(org.apache.commons.lang3.time.FastDateParserTest)  Time elapsed: 0.002 sec  <<< FAILURE!
java.lang.AssertionError: expected:<Sun Aug 01 05:33:20 BST 2010> but was:<Thu Jan 01 06:00:00 GMT 1970>
	at org.junit.Assert.fail(Assert.java:88)
	at org.junit.Assert.failNotEquals(Assert.java:834)
	at org.junit.Assert.assertEquals(Assert.java:118)
	at org.junit.Assert.assertEquals(Assert.java:144)
	at org.apache.commons.lang3.time.FastDateParserTest.testAmPm(FastDateParserTest.java:174)

testLowYearPadding(org.apache.commons.lang3.time.FastDateParserTest)  Time elapsed: 0 sec  <<< FAILURE!
java.lang.AssertionError: expected:<Sat Jan 01 00:00:00 GMT 1> but was:<Thu Jan 01 00:00:00 GMT 1970>
	at org.junit.Assert.fail(Assert.java:88)
	at org.junit.Assert.failNotEquals(Assert.java:834)
	at org.junit.Assert.assertEquals(Assert.java:118)
	at org.junit.Assert.assertEquals(Assert.java:144)
	at org.apache.commons.lang3.time.FastDateParserTest.testLowYearPadding(FastDateParserTest.java:496)

testLocales_Long_AD(org.apache.commons.lang3.time.FastDateParserTest)  Time elapsed: 0.004 sec  <<< FAILURE!
java.lang.AssertionError: ms_MY CE/2003/Februari/0010/0012/0000/00/AM/Isnin
 expected:<Mon Feb 10 00:00:00 GMT 2003> but was:<Thu Jan 01 00:00:00 GMT 1970>
	at org.junit.Assert.fail(Assert.java:88)
	at org.junit.Assert.failNotEquals(Assert.java:834)
	at org.junit.Assert.assertEquals(Assert.java:118)
	at org.apache.commons.lang3.time.FastDateParserTest.checkParse(FastDateParserTest.java:366)
	at org.apache.commons.lang3.time.FastDateParserTest.checkParse(FastDateParserTest.java:358)
	at org.apache.commons.lang3.time.FastDateParserTest.testLocales(FastDateParserTest.java:338)
	at org.apache.commons.lang3.time.FastDateParserTest.testLocales_Long_AD(FastDateParserTest.java:283)

testLocales_Long_BC(org.apache.commons.lang3.time.FastDateParserTest)  Time elapsed: 0.002 sec  <<< FAILURE!
java.lang.AssertionError: ms_MY BCE/2003/Februari/0010/0012/0000/00/AM/Sabtu
 expected:<Sat Feb 10 00:00:00 GMT 2003> but was:<Thu Jan 01 00:00:00 GMT 1970>
	at org.junit.Assert.fail(Assert.java:88)
	at org.junit.Assert.failNotEquals(Assert.java:834)
	at org.junit.Assert.assertEquals(Assert.java:118)
	at org.apache.commons.lang3.time.FastDateParserTest.checkParse(FastDateParserTest.java:366)
	at org.apache.commons.lang3.time.FastDateParserTest.checkParse(FastDateParserTest.java:358)
	at org.apache.commons.lang3.time.FastDateParserTest.testLocales(FastDateParserTest.java:338)
	at org.apache.commons.lang3.time.FastDateParserTest.testLocales_Long_BC(FastDateParserTest.java:288)

testParseNumerics(org.apache.commons.lang3.time.FastDateParserTest)  Time elapsed: 0.001 sec  <<< FAILURE!
java.lang.AssertionError: expected:<Mon Feb 10 20:33:20 GMT 2003> but was:<Thu Jan 01 06:00:00 GMT 1970>
	at org.junit.Assert.fail(Assert.java:88)
	at org.junit.Assert.failNotEquals(Assert.java:834)
	at org.junit.Assert.assertEquals(Assert.java:118)
	at org.junit.Assert.assertEquals(Assert.java:144)
	at org.apache.commons.lang3.time.FastDateParserTest.testParseNumerics(FastDateParserTest.java:377)

testLang538(org.apache.commons.lang3.time.FastDateParserTest)  Time elapsed: 0.001 sec  <<< FAILURE!
java.lang.AssertionError: expected:<Fri Oct 16 17:42:16 BST 2009> but was:<Thu Jan 01 01:00:00 GMT 1970>
	at org.junit.Assert.fail(Assert.java:88)
	at org.junit.Assert.failNotEquals(Assert.java:834)
	at org.junit.Assert.assertEquals(Assert.java:118)
	at org.junit.Assert.assertEquals(Assert.java:144)
	at org.apache.commons.lang3.time.FastDateParserTest.testLang538(FastDateParserTest.java:535)

testLang996(org.apache.commons.lang3.time.FastDateParserTest)  Time elapsed: 0.001 sec  <<< FAILURE!
java.lang.AssertionError: expected:<Wed May 14 05:00:00 BST 2014> but was:<Thu Jan 01 06:00:00 GMT 1970>
	at org.junit.Assert.fail(Assert.java:88)
	at org.junit.Assert.failNotEquals(Assert.java:834)
	at org.junit.Assert.assertEquals(Assert.java:118)
	at org.junit.Assert.assertEquals(Assert.java:144)
	at org.apache.commons.lang3.time.FastDateParserTest.testLang996(FastDateParserTest.java:580)

testLANG_832(org.apache.commons.lang3.time.FastDateParserTest)  Time elapsed: 0.001 sec  <<< FAILURE!
java.lang.AssertionError: Parsed dates should be equal expected:<Sat Jan 03 06:00:00 GMT 1970> but was:<Thu Jan 01 06:00:00 GMT 1970>
	at org.junit.Assert.fail(Assert.java:88)
	at org.junit.Assert.failNotEquals(Assert.java:834)
	at org.junit.Assert.assertEquals(Assert.java:118)
	at org.apache.commons.lang3.time.FastDateParserTest.testSdfAndFdp(FastDateParserTest.java:455)
	at org.apache.commons.lang3.time.FastDateParserTest.testLANG_832(FastDateParserTest.java:411)

testTzParses(org.apache.commons.lang3.time.FastDateParserTest)  Time elapsed: 0.016 sec  <<< FAILURE!
java.lang.AssertionError: tz:America/New_York locale:Malay (Malaysia) expected:<Thu Feb 10 05:00:00 GMT 2000> but was:<Thu Jan 01 00:00:00 GMT 1970>
	at org.junit.Assert.fail(Assert.java:88)
	at org.junit.Assert.failNotEquals(Assert.java:834)
	at org.junit.Assert.assertEquals(Assert.java:118)
	at org.apache.commons.lang3.time.FastDateParserTest.testTzParses(FastDateParserTest.java:275)

testLocales_ShortNoEra_AD(org.apache.commons.lang3.time.FastDateParserTest)  Time elapsed: 0.001 sec  <<< FAILURE!
java.lang.AssertionError: ms_MY 2003/2/10/12/AM/0/0/Isn
 expected:<Mon Feb 10 00:00:00 GMT 2003> but was:<Thu Jan 01 00:00:00 GMT 1970>
	at org.junit.Assert.fail(Assert.java:88)
	at org.junit.Assert.failNotEquals(Assert.java:834)
	at org.junit.Assert.assertEquals(Assert.java:118)
	at org.apache.commons.lang3.time.FastDateParserTest.checkParse(FastDateParserTest.java:366)
	at org.apache.commons.lang3.time.FastDateParserTest.checkParse(FastDateParserTest.java:358)
	at org.apache.commons.lang3.time.FastDateParserTest.testLocales(FastDateParserTest.java:338)
	at org.apache.commons.lang3.time.FastDateParserTest.testLocales_ShortNoEra_AD(FastDateParserTest.java:313)

testLocales_ShortNoEra_BC(org.apache.commons.lang3.time.FastDateParserTest)  Time elapsed: 0.001 sec  <<< FAILURE!
java.lang.AssertionError: ms_MY 2003/2/10/12/AM/0/0/Sab
 expected:<Mon Feb 10 00:00:00 GMT 2003> but was:<Thu Jan 01 00:00:00 GMT 1970>
	at org.junit.Assert.fail(Assert.java:88)
	at org.junit.Assert.failNotEquals(Assert.java:834)
	at org.junit.Assert.assertEquals(Assert.java:118)
	at org.apache.commons.lang3.time.FastDateParserTest.checkParse(FastDateParserTest.java:366)
	at org.apache.commons.lang3.time.FastDateParserTest.checkParse(FastDateParserTest.java:358)
	at org.apache.commons.lang3.time.FastDateParserTest.testLocales(FastDateParserTest.java:338)
	at org.apache.commons.lang3.time.FastDateParserTest.testLocales_ShortNoEra_BC(FastDateParserTest.java:318)

testParseLongShort(org.apache.commons.lang3.time.FastDateParserTest)  Time elapsed: 0.003 sec  <<< FAILURE!
java.lang.AssertionError: expected:<Mon Feb 10 20:33:20 GMT 2003> but was:<Thu Jan 01 06:00:00 GMT 1970>
	at org.junit.Assert.fail(Assert.java:88)
	at org.junit.Assert.failNotEquals(Assert.java:834)
	at org.junit.Assert.assertEquals(Assert.java:118)
	at org.junit.Assert.assertEquals(Assert.java:144)
	at org.apache.commons.lang3.time.FastDateParserTest.testParseLongShort(FastDateParserTest.java:150)

testLocales_LongNoEra_AD(org.apache.commons.lang3.time.FastDateParserTest)  Time elapsed: 0.001 sec  <<< FAILURE!
java.lang.AssertionError: ms_MY 2003/Februari/0010/0012/0000/00/AM/Isnin
 expected:<Mon Feb 10 00:00:00 GMT 2003> but was:<Thu Jan 01 00:00:00 GMT 1970>
	at org.junit.Assert.fail(Assert.java:88)
	at org.junit.Assert.failNotEquals(Assert.java:834)
	at org.junit.Assert.assertEquals(Assert.java:118)
	at org.apache.commons.lang3.time.FastDateParserTest.checkParse(FastDateParserTest.java:366)
	at org.apache.commons.lang3.time.FastDateParserTest.checkParse(FastDateParserTest.java:358)
	at org.apache.commons.lang3.time.FastDateParserTest.testLocales(FastDateParserTest.java:338)
	at org.apache.commons.lang3.time.FastDateParserTest.testLocales_LongNoEra_AD(FastDateParserTest.java:303)

testLocales_LongNoEra_BC(org.apache.commons.lang3.time.FastDateParserTest)  Time elapsed: 0.001 sec  <<< FAILURE!
java.lang.AssertionError: ms_MY 2003/Februari/0010/0012/0000/00/AM/Sabtu
 expected:<Mon Feb 10 00:00:00 GMT 2003> but was:<Thu Jan 01 00:00:00 GMT 1970>
	at org.junit.Assert.fail(Assert.java:88)
	at org.junit.Assert.failNotEquals(Assert.java:834)
	at org.junit.Assert.assertEquals(Assert.java:118)
	at org.apache.commons.lang3.time.FastDateParserTest.checkParse(FastDateParserTest.java:366)
	at org.apache.commons.lang3.time.FastDateParserTest.checkParse(FastDateParserTest.java:358)
	at org.apache.commons.lang3.time.FastDateParserTest.testLocales(FastDateParserTest.java:338)
	at org.apache.commons.lang3.time.FastDateParserTest.testLocales_LongNoEra_BC(FastDateParserTest.java:308)

testLocales_Short_AD(org.apache.commons.lang3.time.FastDateParserTest)  Time elapsed: 0.002 sec  <<< FAILURE!
java.lang.AssertionError: ms_MY CE/2003/2/10/12/AM/0/0/Isn
 expected:<Mon Feb 10 00:00:00 GMT 2003> but was:<Thu Jan 01 00:00:00 GMT 1970>
	at org.junit.Assert.fail(Assert.java:88)
	at org.junit.Assert.failNotEquals(Assert.java:834)
	at org.junit.Assert.assertEquals(Assert.java:118)
	at org.apache.commons.lang3.time.FastDateParserTest.checkParse(FastDateParserTest.java:366)
	at org.apache.commons.lang3.time.FastDateParserTest.checkParse(FastDateParserTest.java:358)
	at org.apache.commons.lang3.time.FastDateParserTest.testLocales(FastDateParserTest.java:338)
	at org.apache.commons.lang3.time.FastDateParserTest.testLocales_Short_AD(FastDateParserTest.java:293)

testLocales_Short_BC(org.apache.commons.lang3.time.FastDateParserTest)  Time elapsed: 0.002 sec  <<< FAILURE!
java.lang.AssertionError: ms_MY BCE/2003/2/10/12/AM/0/0/Sab
 expected:<Sat Feb 10 00:00:00 GMT 2003> but was:<Thu Jan 01 00:00:00 GMT 1970>
	at org.junit.Assert.fail(Assert.java:88)
	at org.junit.Assert.failNotEquals(Assert.java:834)
	at org.junit.Assert.assertEquals(Assert.java:118)
	at org.apache.commons.lang3.time.FastDateParserTest.checkParse(FastDateParserTest.java:366)
	at org.apache.commons.lang3.time.FastDateParserTest.checkParse(FastDateParserTest.java:358)
	at org.apache.commons.lang3.time.FastDateParserTest.testLocales(FastDateParserTest.java:338)
	at org.apache.commons.lang3.time.FastDateParserTest.testLocales_Short_BC(FastDateParserTest.java:298)

testParses(org.apache.commons.lang3.time.FastDateParserTest)  Time elapsed: 0.001 sec  <<< FAILURE!
java.lang.AssertionError: ms_MY Thu Feb 10 05:00:00 GMT 2000 GGGG/yyyy/MMMM/dddd/hhhh/mmmm/ss/aaaa/EEEE America/New_York expected:<Thu Feb 10 05:00:00 GMT 2000> but was:<Thu Jan 01 06:00:00 GMT 1970>
	at org.junit.Assert.fail(Assert.java:88)
	at org.junit.Assert.failNotEquals(Assert.java:834)
	at org.junit.Assert.assertEquals(Assert.java:118)
	at org.apache.commons.lang3.time.FastDateParserTest.validateSdfFormatFdpParseEquality(FastDateParserTest.java:228)
	at org.apache.commons.lang3.time.FastDateParserTest.testParses(FastDateParserTest.java:251)

testQuotes(org.apache.commons.lang3.time.FastDateParserTest)  Time elapsed: 0.001 sec  <<< FAILURE!
java.lang.AssertionError: expected:<Mon Feb 10 20:33:20 GMT 2003> but was:<Thu Jan 01 06:00:00 GMT 1970>
	at org.junit.Assert.fail(Assert.java:88)
	at org.junit.Assert.failNotEquals(Assert.java:834)
	at org.junit.Assert.assertEquals(Assert.java:118)
	at org.junit.Assert.assertEquals(Assert.java:144)
	at org.apache.commons.lang3.time.FastDateParserTest.testQuotes(FastDateParserTest.java:388)

Running org.apache.commons.lang3.time.FastDateFormat_ParserTest
Tests run: 33, Failures: 23, Errors: 1, Skipped: 0, Time elapsed: 0.066 sec <<< FAILURE! - in org.apache.commons.lang3.time.FastDateFormat_ParserTest
testSpecialCharacters(org.apache.commons.lang3.time.FastDateFormat_ParserTest)  Time elapsed: 0 sec  <<< ERROR!
java.lang.ArrayIndexOutOfBoundsException: 0
	at org.apache.commons.lang3.time.FastDateParser.parse(FastDateParser.java:100)
	at org.apache.commons.lang3.time.FastDateParser.parse(FastDateParser.java:88)
	at org.apache.commons.lang3.time.FastDateFormat.parse(FastDateFormat.java:497)
	at org.apache.commons.lang3.time.FastDateParserTest.testSdfAndFdp(FastDateParserTest.java:443)
	at org.apache.commons.lang3.time.FastDateParserTest.testSpecialCharacters(FastDateParserTest.java:395)
	at sun.reflect.NativeMethodAccessorImpl.invoke0(Native Method)
	at sun.reflect.NativeMethodAccessorImpl.invoke(NativeMethodAccessorImpl.java:57)
	at sun.reflect.DelegatingMethodAccessorImpl.invoke(DelegatingMethodAccessorImpl.java:43)
	at java.lang.reflect.Method.invoke(Method.java:606)
	at org.junit.runners.model.FrameworkMethod$1.runReflectiveCall(FrameworkMethod.java:50)
	at org.junit.internal.runners.model.ReflectiveCallable.run(ReflectiveCallable.java:12)
	at org.junit.runners.model.FrameworkMethod.invokeExplosively(FrameworkMethod.java:47)
	at org.junit.internal.runners.statements.InvokeMethod.evaluate(InvokeMethod.java:17)
	at org.junit.runners.ParentRunner.runLeaf(ParentRunner.java:325)
	at org.junit.runners.BlockJUnit4ClassRunner.runChild(BlockJUnit4ClassRunner.java:78)
	at org.junit.runners.BlockJUnit4ClassRunner.runChild(BlockJUnit4ClassRunner.java:57)
	at org.junit.runners.ParentRunner$3.run(ParentRunner.java:290)
	at org.junit.runners.ParentRunner$1.schedule(ParentRunner.java:71)
	at org.junit.runners.ParentRunner.runChildren(ParentRunner.java:288)
	at org.junit.runners.ParentRunner.access$000(ParentRunner.java:58)
	at org.junit.runners.ParentRunner$2.evaluate(ParentRunner.java:268)
	at org.junit.runners.ParentRunner.run(ParentRunner.java:363)
	at org.apache.maven.surefire.junit4.JUnit4Provider.execute(JUnit4Provider.java:283)
	at org.apache.maven.surefire.junit4.JUnit4Provider.executeWithRerun(JUnit4Provider.java:173)
	at org.apache.maven.surefire.junit4.JUnit4Provider.executeTestSet(JUnit4Provider.java:153)
	at org.apache.maven.surefire.junit4.JUnit4Provider.invoke(JUnit4Provider.java:128)
	at org.apache.maven.surefire.booter.ForkedBooter.invokeProviderInSameClassLoader(ForkedBooter.java:203)
	at org.apache.maven.surefire.booter.ForkedBooter.runSuitesInProcess(ForkedBooter.java:155)
	at org.apache.maven.surefire.booter.ForkedBooter.main(ForkedBooter.java:103)

testShortDateStyleWithLocales(org.apache.commons.lang3.time.FastDateFormat_ParserTest)  Time elapsed: 0.004 sec  <<< FAILURE!
java.lang.AssertionError: expected:<Tue Feb 03 00:00:00 GMT 2004> but was:<Thu Jan 01 00:00:00 GMT 1970>
	at org.junit.Assert.fail(Assert.java:88)
	at org.junit.Assert.failNotEquals(Assert.java:834)
	at org.junit.Assert.assertEquals(Assert.java:118)
	at org.junit.Assert.assertEquals(Assert.java:144)
	at org.apache.commons.lang3.time.FastDateParserTest.testShortDateStyleWithLocales(FastDateParserTest.java:479)
	at sun.reflect.NativeMethodAccessorImpl.invoke0(Native Method)
	at sun.reflect.NativeMethodAccessorImpl.invoke(NativeMethodAccessorImpl.java:57)
	at sun.reflect.DelegatingMethodAccessorImpl.invoke(DelegatingMethodAccessorImpl.java:43)
	at java.lang.reflect.Method.invoke(Method.java:606)
	at org.junit.runners.model.FrameworkMethod$1.runReflectiveCall(FrameworkMethod.java:50)
	at org.junit.internal.runners.model.ReflectiveCallable.run(ReflectiveCallable.java:12)
	at org.junit.runners.model.FrameworkMethod.invokeExplosively(FrameworkMethod.java:47)
	at org.junit.internal.runners.statements.InvokeMethod.evaluate(InvokeMethod.java:17)
	at org.junit.runners.ParentRunner.runLeaf(ParentRunner.java:325)
	at org.junit.runners.BlockJUnit4ClassRunner.runChild(BlockJUnit4ClassRunner.java:78)
	at org.junit.runners.BlockJUnit4ClassRunner.runChild(BlockJUnit4ClassRunner.java:57)
	at org.junit.runners.ParentRunner$3.run(ParentRunner.java:290)
	at org.junit.runners.ParentRunner$1.schedule(ParentRunner.java:71)
	at org.junit.runners.ParentRunner.runChildren(ParentRunner.java:288)
	at org.junit.runners.ParentRunner.access$000(ParentRunner.java:58)
	at org.junit.runners.ParentRunner$2.evaluate(ParentRunner.java:268)
	at org.junit.runners.ParentRunner.run(ParentRunner.java:363)
	at org.apache.maven.surefire.junit4.JUnit4Provider.execute(JUnit4Provider.java:283)
	at org.apache.maven.surefire.junit4.JUnit4Provider.executeWithRerun(JUnit4Provider.java:173)
	at org.apache.maven.surefire.junit4.JUnit4Provider.executeTestSet(JUnit4Provider.java:153)
	at org.apache.maven.surefire.junit4.JUnit4Provider.invoke(JUnit4Provider.java:128)
	at org.apache.maven.surefire.booter.ForkedBooter.invokeProviderInSameClassLoader(ForkedBooter.java:203)
	at org.apache.maven.surefire.booter.ForkedBooter.runSuitesInProcess(ForkedBooter.java:155)
	at org.apache.maven.surefire.booter.ForkedBooter.main(ForkedBooter.java:103)

testMilleniumBug(org.apache.commons.lang3.time.FastDateFormat_ParserTest)  Time elapsed: 0.001 sec  <<< FAILURE!
java.lang.AssertionError: expected:<Mon Jan 01 00:00:00 GMT 1000> but was:<Thu Jan 01 00:00:00 GMT 1970>
	at org.junit.Assert.fail(Assert.java:88)
	at org.junit.Assert.failNotEquals(Assert.java:834)
	at org.junit.Assert.assertEquals(Assert.java:118)
	at org.junit.Assert.assertEquals(Assert.java:144)
	at org.apache.commons.lang3.time.FastDateParserTest.testMilleniumBug(FastDateParserTest.java:512)
	at sun.reflect.NativeMethodAccessorImpl.invoke0(Native Method)
	at sun.reflect.NativeMethodAccessorImpl.invoke(NativeMethodAccessorImpl.java:57)
	at sun.reflect.DelegatingMethodAccessorImpl.invoke(DelegatingMethodAccessorImpl.java:43)
	at java.lang.reflect.Method.invoke(Method.java:606)
	at org.junit.runners.model.FrameworkMethod$1.runReflectiveCall(FrameworkMethod.java:50)
	at org.junit.internal.runners.model.ReflectiveCallable.run(ReflectiveCallable.java:12)
	at org.junit.runners.model.FrameworkMethod.invokeExplosively(FrameworkMethod.java:47)
	at org.junit.internal.runners.statements.InvokeMethod.evaluate(InvokeMethod.java:17)
	at org.junit.runners.ParentRunner.runLeaf(ParentRunner.java:325)
	at org.junit.runners.BlockJUnit4ClassRunner.runChild(BlockJUnit4ClassRunner.java:78)
	at org.junit.runners.BlockJUnit4ClassRunner.runChild(BlockJUnit4ClassRunner.java:57)
	at org.junit.runners.ParentRunner$3.run(ParentRunner.java:290)
	at org.junit.runners.ParentRunner$1.schedule(ParentRunner.java:71)
	at org.junit.runners.ParentRunner.runChildren(ParentRunner.java:288)
	at org.junit.runners.ParentRunner.access$000(ParentRunner.java:58)
	at org.junit.runners.ParentRunner$2.evaluate(ParentRunner.java:268)
	at org.junit.runners.ParentRunner.run(ParentRunner.java:363)
	at org.apache.maven.surefire.junit4.JUnit4Provider.execute(JUnit4Provider.java:283)
	at org.apache.maven.surefire.junit4.JUnit4Provider.executeWithRerun(JUnit4Provider.java:173)
	at org.apache.maven.surefire.junit4.JUnit4Provider.executeTestSet(JUnit4Provider.java:153)
	at org.apache.maven.surefire.junit4.JUnit4Provider.invoke(JUnit4Provider.java:128)
	at org.apache.maven.surefire.booter.ForkedBooter.invokeProviderInSameClassLoader(ForkedBooter.java:203)
	at org.apache.maven.surefire.booter.ForkedBooter.runSuitesInProcess(ForkedBooter.java:155)
	at org.apache.maven.surefire.booter.ForkedBooter.main(ForkedBooter.java:103)

testDayOf(org.apache.commons.lang3.time.FastDateFormat_ParserTest)  Time elapsed: 0.002 sec  <<< FAILURE!
java.lang.AssertionError: expected:<Mon Feb 10 05:00:00 GMT 2003> but was:<Thu Jan 01 06:00:00 GMT 1970>
	at org.junit.Assert.fail(Assert.java:88)
	at org.junit.Assert.failNotEquals(Assert.java:834)
	at org.junit.Assert.assertEquals(Assert.java:118)
	at org.junit.Assert.assertEquals(Assert.java:144)
	at org.apache.commons.lang3.time.FastDateParserTest.testDayOf(FastDateParserTest.java:465)
	at sun.reflect.NativeMethodAccessorImpl.invoke0(Native Method)
	at sun.reflect.NativeMethodAccessorImpl.invoke(NativeMethodAccessorImpl.java:57)
	at sun.reflect.DelegatingMethodAccessorImpl.invoke(DelegatingMethodAccessorImpl.java:43)
	at java.lang.reflect.Method.invoke(Method.java:606)
	at org.junit.runners.model.FrameworkMethod$1.runReflectiveCall(FrameworkMethod.java:50)
	at org.junit.internal.runners.model.ReflectiveCallable.run(ReflectiveCallable.java:12)
	at org.junit.runners.model.FrameworkMethod.invokeExplosively(FrameworkMethod.java:47)
	at org.junit.internal.runners.statements.InvokeMethod.evaluate(InvokeMethod.java:17)
	at org.junit.runners.ParentRunner.runLeaf(ParentRunner.java:325)
	at org.junit.runners.BlockJUnit4ClassRunner.runChild(BlockJUnit4ClassRunner.java:78)
	at org.junit.runners.BlockJUnit4ClassRunner.runChild(BlockJUnit4ClassRunner.java:57)
	at org.junit.runners.ParentRunner$3.run(ParentRunner.java:290)
	at org.junit.runners.ParentRunner$1.schedule(ParentRunner.java:71)
	at org.junit.runners.ParentRunner.runChildren(ParentRunner.java:288)
	at org.junit.runners.ParentRunner.access$000(ParentRunner.java:58)
	at org.junit.runners.ParentRunner$2.evaluate(ParentRunner.java:268)
	at org.junit.runners.ParentRunner.run(ParentRunner.java:363)
	at org.apache.maven.surefire.junit4.JUnit4Provider.execute(JUnit4Provider.java:283)
	at org.apache.maven.surefire.junit4.JUnit4Provider.executeWithRerun(JUnit4Provider.java:173)
	at org.apache.maven.surefire.junit4.JUnit4Provider.executeTestSet(JUnit4Provider.java:153)
	at org.apache.maven.surefire.junit4.JUnit4Provider.invoke(JUnit4Provider.java:128)
	at org.apache.maven.surefire.booter.ForkedBooter.invokeProviderInSameClassLoader(ForkedBooter.java:203)
	at org.apache.maven.surefire.booter.ForkedBooter.runSuitesInProcess(ForkedBooter.java:155)
	at org.apache.maven.surefire.booter.ForkedBooter.main(ForkedBooter.java:103)

testParseZone(org.apache.commons.lang3.time.FastDateFormat_ParserTest)  Time elapsed: 0.002 sec  <<< FAILURE!
java.lang.AssertionError: expected:<Thu Jul 10 21:33:20 BST 2003> but was:<Thu Jan 01 06:00:00 GMT 1970>
	at org.junit.Assert.fail(Assert.java:88)
	at org.junit.Assert.failNotEquals(Assert.java:834)
	at org.junit.Assert.assertEquals(Assert.java:118)
	at org.junit.Assert.assertEquals(Assert.java:144)
	at org.apache.commons.lang3.time.FastDateParserTest.testParseZone(FastDateParserTest.java:124)
	at sun.reflect.NativeMethodAccessorImpl.invoke0(Native Method)
	at sun.reflect.NativeMethodAccessorImpl.invoke(NativeMethodAccessorImpl.java:57)
	at sun.reflect.DelegatingMethodAccessorImpl.invoke(DelegatingMethodAccessorImpl.java:43)
	at java.lang.reflect.Method.invoke(Method.java:606)
	at org.junit.runners.model.FrameworkMethod$1.runReflectiveCall(FrameworkMethod.java:50)
	at org.junit.internal.runners.model.ReflectiveCallable.run(ReflectiveCallable.java:12)
	at org.junit.runners.model.FrameworkMethod.invokeExplosively(FrameworkMethod.java:47)
	at org.junit.internal.runners.statements.InvokeMethod.evaluate(InvokeMethod.java:17)
	at org.junit.runners.ParentRunner.runLeaf(ParentRunner.java:325)
	at org.junit.runners.BlockJUnit4ClassRunner.runChild(BlockJUnit4ClassRunner.java:78)
	at org.junit.runners.BlockJUnit4ClassRunner.runChild(BlockJUnit4ClassRunner.java:57)
	at org.junit.runners.ParentRunner$3.run(ParentRunner.java:290)
	at org.junit.runners.ParentRunner$1.schedule(ParentRunner.java:71)
	at org.junit.runners.ParentRunner.runChildren(ParentRunner.java:288)
	at org.junit.runners.ParentRunner.access$000(ParentRunner.java:58)
	at org.junit.runners.ParentRunner$2.evaluate(ParentRunner.java:268)
	at org.junit.runners.ParentRunner.run(ParentRunner.java:363)
	at org.apache.maven.surefire.junit4.JUnit4Provider.execute(JUnit4Provider.java:283)
	at org.apache.maven.surefire.junit4.JUnit4Provider.executeWithRerun(JUnit4Provider.java:173)
	at org.apache.maven.surefire.junit4.JUnit4Provider.executeTestSet(JUnit4Provider.java:153)
	at org.apache.maven.surefire.junit4.JUnit4Provider.invoke(JUnit4Provider.java:128)
	at org.apache.maven.surefire.booter.ForkedBooter.invokeProviderInSameClassLoader(ForkedBooter.java:203)
	at org.apache.maven.surefire.booter.ForkedBooter.runSuitesInProcess(ForkedBooter.java:155)
	at org.apache.maven.surefire.booter.ForkedBooter.main(ForkedBooter.java:103)

test1806(org.apache.commons.lang3.time.FastDateFormat_ParserTest)  Time elapsed: 0.002 sec  <<< FAILURE!
java.lang.AssertionError: India Standard Time;+05 expected:<981268736235> but was:<-21600000>
	at org.junit.Assert.fail(Assert.java:88)
	at org.junit.Assert.failNotEquals(Assert.java:834)
	at org.junit.Assert.assertEquals(Assert.java:645)
	at org.apache.commons.lang3.time.FastDateParserTest.test1806(FastDateParserTest.java:633)
	at sun.reflect.NativeMethodAccessorImpl.invoke0(Native Method)
	at sun.reflect.NativeMethodAccessorImpl.invoke(NativeMethodAccessorImpl.java:57)
	at sun.reflect.DelegatingMethodAccessorImpl.invoke(DelegatingMethodAccessorImpl.java:43)
	at java.lang.reflect.Method.invoke(Method.java:606)
	at org.junit.runners.model.FrameworkMethod$1.runReflectiveCall(FrameworkMethod.java:50)
	at org.junit.internal.runners.model.ReflectiveCallable.run(ReflectiveCallable.java:12)
	at org.junit.runners.model.FrameworkMethod.invokeExplosively(FrameworkMethod.java:47)
	at org.junit.internal.runners.statements.InvokeMethod.evaluate(InvokeMethod.java:17)
	at org.junit.runners.ParentRunner.runLeaf(ParentRunner.java:325)
	at org.junit.runners.BlockJUnit4ClassRunner.runChild(BlockJUnit4ClassRunner.java:78)
	at org.junit.runners.BlockJUnit4ClassRunner.runChild(BlockJUnit4ClassRunner.java:57)
	at org.junit.runners.ParentRunner$3.run(ParentRunner.java:290)
	at org.junit.runners.ParentRunner$1.schedule(ParentRunner.java:71)
	at org.junit.runners.ParentRunner.runChildren(ParentRunner.java:288)
	at org.junit.runners.ParentRunner.access$000(ParentRunner.java:58)
	at org.junit.runners.ParentRunner$2.evaluate(ParentRunner.java:268)
	at org.junit.runners.ParentRunner.run(ParentRunner.java:363)
	at org.apache.maven.surefire.junit4.JUnit4Provider.execute(JUnit4Provider.java:283)
	at org.apache.maven.surefire.junit4.JUnit4Provider.executeWithRerun(JUnit4Provider.java:173)
	at org.apache.maven.surefire.junit4.JUnit4Provider.executeTestSet(JUnit4Provider.java:153)
	at org.apache.maven.surefire.junit4.JUnit4Provider.invoke(JUnit4Provider.java:128)
	at org.apache.maven.surefire.booter.ForkedBooter.invokeProviderInSameClassLoader(ForkedBooter.java:203)
	at org.apache.maven.surefire.booter.ForkedBooter.runSuitesInProcess(ForkedBooter.java:155)
	at org.apache.maven.surefire.booter.ForkedBooter.main(ForkedBooter.java:103)

testAmPm(org.apache.commons.lang3.time.FastDateFormat_ParserTest)  Time elapsed: 0.003 sec  <<< FAILURE!
java.lang.AssertionError: expected:<Sun Aug 01 05:33:20 BST 2010> but was:<Thu Jan 01 06:00:00 GMT 1970>
	at org.junit.Assert.fail(Assert.java:88)
	at org.junit.Assert.failNotEquals(Assert.java:834)
	at org.junit.Assert.assertEquals(Assert.java:118)
	at org.junit.Assert.assertEquals(Assert.java:144)
	at org.apache.commons.lang3.time.FastDateParserTest.testAmPm(FastDateParserTest.java:174)
	at sun.reflect.NativeMethodAccessorImpl.invoke0(Native Method)
	at sun.reflect.NativeMethodAccessorImpl.invoke(NativeMethodAccessorImpl.java:57)
	at sun.reflect.DelegatingMethodAccessorImpl.invoke(DelegatingMethodAccessorImpl.java:43)
	at java.lang.reflect.Method.invoke(Method.java:606)
	at org.junit.runners.model.FrameworkMethod$1.runReflectiveCall(FrameworkMethod.java:50)
	at org.junit.internal.runners.model.ReflectiveCallable.run(ReflectiveCallable.java:12)
	at org.junit.runners.model.FrameworkMethod.invokeExplosively(FrameworkMethod.java:47)
	at org.junit.internal.runners.statements.InvokeMethod.evaluate(InvokeMethod.java:17)
	at org.junit.runners.ParentRunner.runLeaf(ParentRunner.java:325)
	at org.junit.runners.BlockJUnit4ClassRunner.runChild(BlockJUnit4ClassRunner.java:78)
	at org.junit.runners.BlockJUnit4ClassRunner.runChild(BlockJUnit4ClassRunner.java:57)
	at org.junit.runners.ParentRunner$3.run(ParentRunner.java:290)
	at org.junit.runners.ParentRunner$1.schedule(ParentRunner.java:71)
	at org.junit.runners.ParentRunner.runChildren(ParentRunner.java:288)
	at org.junit.runners.ParentRunner.access$000(ParentRunner.java:58)
	at org.junit.runners.ParentRunner$2.evaluate(ParentRunner.java:268)
	at org.junit.runners.ParentRunner.run(ParentRunner.java:363)
	at org.apache.maven.surefire.junit4.JUnit4Provider.execute(JUnit4Provider.java:283)
	at org.apache.maven.surefire.junit4.JUnit4Provider.executeWithRerun(JUnit4Provider.java:173)
	at org.apache.maven.surefire.junit4.JUnit4Provider.executeTestSet(JUnit4Provider.java:153)
	at org.apache.maven.surefire.junit4.JUnit4Provider.invoke(JUnit4Provider.java:128)
	at org.apache.maven.surefire.booter.ForkedBooter.invokeProviderInSameClassLoader(ForkedBooter.java:203)
	at org.apache.maven.surefire.booter.ForkedBooter.runSuitesInProcess(ForkedBooter.java:155)
	at org.apache.maven.surefire.booter.ForkedBooter.main(ForkedBooter.java:103)

testLowYearPadding(org.apache.commons.lang3.time.FastDateFormat_ParserTest)  Time elapsed: 0.001 sec  <<< FAILURE!
java.lang.AssertionError: expected:<Sat Jan 01 00:00:00 GMT 1> but was:<Thu Jan 01 00:00:00 GMT 1970>
	at org.junit.Assert.fail(Assert.java:88)
	at org.junit.Assert.failNotEquals(Assert.java:834)
	at org.junit.Assert.assertEquals(Assert.java:118)
	at org.junit.Assert.assertEquals(Assert.java:144)
	at org.apache.commons.lang3.time.FastDateParserTest.testLowYearPadding(FastDateParserTest.java:496)
	at sun.reflect.NativeMethodAccessorImpl.invoke0(Native Method)
	at sun.reflect.NativeMethodAccessorImpl.invoke(NativeMethodAccessorImpl.java:57)
	at sun.reflect.DelegatingMethodAccessorImpl.invoke(DelegatingMethodAccessorImpl.java:43)
	at java.lang.reflect.Method.invoke(Method.java:606)
	at org.junit.runners.model.FrameworkMethod$1.runReflectiveCall(FrameworkMethod.java:50)
	at org.junit.internal.runners.model.ReflectiveCallable.run(ReflectiveCallable.java:12)
	at org.junit.runners.model.FrameworkMethod.invokeExplosively(FrameworkMethod.java:47)
	at org.junit.internal.runners.statements.InvokeMethod.evaluate(InvokeMethod.java:17)
	at org.junit.runners.ParentRunner.runLeaf(ParentRunner.java:325)
	at org.junit.runners.BlockJUnit4ClassRunner.runChild(BlockJUnit4ClassRunner.java:78)
	at org.junit.runners.BlockJUnit4ClassRunner.runChild(BlockJUnit4ClassRunner.java:57)
	at org.junit.runners.ParentRunner$3.run(ParentRunner.java:290)
	at org.junit.runners.ParentRunner$1.schedule(ParentRunner.java:71)
	at org.junit.runners.ParentRunner.runChildren(ParentRunner.java:288)
	at org.junit.runners.ParentRunner.access$000(ParentRunner.java:58)
	at org.junit.runners.ParentRunner$2.evaluate(ParentRunner.java:268)
	at org.junit.runners.ParentRunner.run(ParentRunner.java:363)
	at org.apache.maven.surefire.junit4.JUnit4Provider.execute(JUnit4Provider.java:283)
	at org.apache.maven.surefire.junit4.JUnit4Provider.executeWithRerun(JUnit4Provider.java:173)
	at org.apache.maven.surefire.junit4.JUnit4Provider.executeTestSet(JUnit4Provider.java:153)
	at org.apache.maven.surefire.junit4.JUnit4Provider.invoke(JUnit4Provider.java:128)
	at org.apache.maven.surefire.booter.ForkedBooter.invokeProviderInSameClassLoader(ForkedBooter.java:203)
	at org.apache.maven.surefire.booter.ForkedBooter.runSuitesInProcess(ForkedBooter.java:155)
	at org.apache.maven.surefire.booter.ForkedBooter.main(ForkedBooter.java:103)

testLocales_Long_AD(org.apache.commons.lang3.time.FastDateFormat_ParserTest)  Time elapsed: 0.002 sec  <<< FAILURE!
java.lang.AssertionError: ms_MY CE/2003/Februari/0010/0012/0000/00/AM/Isnin
 expected:<Mon Feb 10 00:00:00 GMT 2003> but was:<Thu Jan 01 00:00:00 GMT 1970>
	at org.junit.Assert.fail(Assert.java:88)
	at org.junit.Assert.failNotEquals(Assert.java:834)
	at org.junit.Assert.assertEquals(Assert.java:118)
	at org.apache.commons.lang3.time.FastDateParserTest.checkParse(FastDateParserTest.java:366)
	at org.apache.commons.lang3.time.FastDateParserTest.checkParse(FastDateParserTest.java:358)
	at org.apache.commons.lang3.time.FastDateParserTest.testLocales(FastDateParserTest.java:338)
	at org.apache.commons.lang3.time.FastDateParserTest.testLocales_Long_AD(FastDateParserTest.java:283)
	at sun.reflect.NativeMethodAccessorImpl.invoke0(Native Method)
	at sun.reflect.NativeMethodAccessorImpl.invoke(NativeMethodAccessorImpl.java:57)
	at sun.reflect.DelegatingMethodAccessorImpl.invoke(DelegatingMethodAccessorImpl.java:43)
	at java.lang.reflect.Method.invoke(Method.java:606)
	at org.junit.runners.model.FrameworkMethod$1.runReflectiveCall(FrameworkMethod.java:50)
	at org.junit.internal.runners.model.ReflectiveCallable.run(ReflectiveCallable.java:12)
	at org.junit.runners.model.FrameworkMethod.invokeExplosively(FrameworkMethod.java:47)
	at org.junit.internal.runners.statements.InvokeMethod.evaluate(InvokeMethod.java:17)
	at org.junit.runners.ParentRunner.runLeaf(ParentRunner.java:325)
	at org.junit.runners.BlockJUnit4ClassRunner.runChild(BlockJUnit4ClassRunner.java:78)
	at org.junit.runners.BlockJUnit4ClassRunner.runChild(BlockJUnit4ClassRunner.java:57)
	at org.junit.runners.ParentRunner$3.run(ParentRunner.java:290)
	at org.junit.runners.ParentRunner$1.schedule(ParentRunner.java:71)
	at org.junit.runners.ParentRunner.runChildren(ParentRunner.java:288)
	at org.junit.runners.ParentRunner.access$000(ParentRunner.java:58)
	at org.junit.runners.ParentRunner$2.evaluate(ParentRunner.java:268)
	at org.junit.runners.ParentRunner.run(ParentRunner.java:363)
	at org.apache.maven.surefire.junit4.JUnit4Provider.execute(JUnit4Provider.java:283)
	at org.apache.maven.surefire.junit4.JUnit4Provider.executeWithRerun(JUnit4Provider.java:173)
	at org.apache.maven.surefire.junit4.JUnit4Provider.executeTestSet(JUnit4Provider.java:153)
	at org.apache.maven.surefire.junit4.JUnit4Provider.invoke(JUnit4Provider.java:128)
	at org.apache.maven.surefire.booter.ForkedBooter.invokeProviderInSameClassLoader(ForkedBooter.java:203)
	at org.apache.maven.surefire.booter.ForkedBooter.runSuitesInProcess(ForkedBooter.java:155)
	at org.apache.maven.surefire.booter.ForkedBooter.main(ForkedBooter.java:103)

testLocales_Long_BC(org.apache.commons.lang3.time.FastDateFormat_ParserTest)  Time elapsed: 0.005 sec  <<< FAILURE!
java.lang.AssertionError: ms_MY BCE/2003/Februari/0010/0012/0000/00/AM/Sabtu
 expected:<Sat Feb 10 00:00:00 GMT 2003> but was:<Thu Jan 01 00:00:00 GMT 1970>
	at org.junit.Assert.fail(Assert.java:88)
	at org.junit.Assert.failNotEquals(Assert.java:834)
	at org.junit.Assert.assertEquals(Assert.java:118)
	at org.apache.commons.lang3.time.FastDateParserTest.checkParse(FastDateParserTest.java:366)
	at org.apache.commons.lang3.time.FastDateParserTest.checkParse(FastDateParserTest.java:358)
	at org.apache.commons.lang3.time.FastDateParserTest.testLocales(FastDateParserTest.java:338)
	at org.apache.commons.lang3.time.FastDateParserTest.testLocales_Long_BC(FastDateParserTest.java:288)
	at sun.reflect.NativeMethodAccessorImpl.invoke0(Native Method)
	at sun.reflect.NativeMethodAccessorImpl.invoke(NativeMethodAccessorImpl.java:57)
	at sun.reflect.DelegatingMethodAccessorImpl.invoke(DelegatingMethodAccessorImpl.java:43)
	at java.lang.reflect.Method.invoke(Method.java:606)
	at org.junit.runners.model.FrameworkMethod$1.runReflectiveCall(FrameworkMethod.java:50)
	at org.junit.internal.runners.model.ReflectiveCallable.run(ReflectiveCallable.java:12)
	at org.junit.runners.model.FrameworkMethod.invokeExplosively(FrameworkMethod.java:47)
	at org.junit.internal.runners.statements.InvokeMethod.evaluate(InvokeMethod.java:17)
	at org.junit.runners.ParentRunner.runLeaf(ParentRunner.java:325)
	at org.junit.runners.BlockJUnit4ClassRunner.runChild(BlockJUnit4ClassRunner.java:78)
	at org.junit.runners.BlockJUnit4ClassRunner.runChild(BlockJUnit4ClassRunner.java:57)
	at org.junit.runners.ParentRunner$3.run(ParentRunner.java:290)
	at org.junit.runners.ParentRunner$1.schedule(ParentRunner.java:71)
	at org.junit.runners.ParentRunner.runChildren(ParentRunner.java:288)
	at org.junit.runners.ParentRunner.access$000(ParentRunner.java:58)
	at org.junit.runners.ParentRunner$2.evaluate(ParentRunner.java:268)
	at org.junit.runners.ParentRunner.run(ParentRunner.java:363)
	at org.apache.maven.surefire.junit4.JUnit4Provider.execute(JUnit4Provider.java:283)
	at org.apache.maven.surefire.junit4.JUnit4Provider.executeWithRerun(JUnit4Provider.java:173)
	at org.apache.maven.surefire.junit4.JUnit4Provider.executeTestSet(JUnit4Provider.java:153)
	at org.apache.maven.surefire.junit4.JUnit4Provider.invoke(JUnit4Provider.java:128)
	at org.apache.maven.surefire.booter.ForkedBooter.invokeProviderInSameClassLoader(ForkedBooter.java:203)
	at org.apache.maven.surefire.booter.ForkedBooter.runSuitesInProcess(ForkedBooter.java:155)
	at org.apache.maven.surefire.booter.ForkedBooter.main(ForkedBooter.java:103)

testParseNumerics(org.apache.commons.lang3.time.FastDateFormat_ParserTest)  Time elapsed: 0.001 sec  <<< FAILURE!
java.lang.AssertionError: expected:<Mon Feb 10 20:33:20 GMT 2003> but was:<Thu Jan 01 06:00:00 GMT 1970>
	at org.junit.Assert.fail(Assert.java:88)
	at org.junit.Assert.failNotEquals(Assert.java:834)
	at org.junit.Assert.assertEquals(Assert.java:118)
	at org.junit.Assert.assertEquals(Assert.java:144)
	at org.apache.commons.lang3.time.FastDateParserTest.testParseNumerics(FastDateParserTest.java:377)
	at sun.reflect.NativeMethodAccessorImpl.invoke0(Native Method)
	at sun.reflect.NativeMethodAccessorImpl.invoke(NativeMethodAccessorImpl.java:57)
	at sun.reflect.DelegatingMethodAccessorImpl.invoke(DelegatingMethodAccessorImpl.java:43)
	at java.lang.reflect.Method.invoke(Method.java:606)
	at org.junit.runners.model.FrameworkMethod$1.runReflectiveCall(FrameworkMethod.java:50)
	at org.junit.internal.runners.model.ReflectiveCallable.run(ReflectiveCallable.java:12)
	at org.junit.runners.model.FrameworkMethod.invokeExplosively(FrameworkMethod.java:47)
	at org.junit.internal.runners.statements.InvokeMethod.evaluate(InvokeMethod.java:17)
	at org.junit.runners.ParentRunner.runLeaf(ParentRunner.java:325)
	at org.junit.runners.BlockJUnit4ClassRunner.runChild(BlockJUnit4ClassRunner.java:78)
	at org.junit.runners.BlockJUnit4ClassRunner.runChild(BlockJUnit4ClassRunner.java:57)
	at org.junit.runners.ParentRunner$3.run(ParentRunner.java:290)
	at org.junit.runners.ParentRunner$1.schedule(ParentRunner.java:71)
	at org.junit.runners.ParentRunner.runChildren(ParentRunner.java:288)
	at org.junit.runners.ParentRunner.access$000(ParentRunner.java:58)
	at org.junit.runners.ParentRunner$2.evaluate(ParentRunner.java:268)
	at org.junit.runners.ParentRunner.run(ParentRunner.java:363)
	at org.apache.maven.surefire.junit4.JUnit4Provider.execute(JUnit4Provider.java:283)
	at org.apache.maven.surefire.junit4.JUnit4Provider.executeWithRerun(JUnit4Provider.java:173)
	at org.apache.maven.surefire.junit4.JUnit4Provider.executeTestSet(JUnit4Provider.java:153)
	at org.apache.maven.surefire.junit4.JUnit4Provider.invoke(JUnit4Provider.java:128)
	at org.apache.maven.surefire.booter.ForkedBooter.invokeProviderInSameClassLoader(ForkedBooter.java:203)
	at org.apache.maven.surefire.booter.ForkedBooter.runSuitesInProcess(ForkedBooter.java:155)
	at org.apache.maven.surefire.booter.ForkedBooter.main(ForkedBooter.java:103)

testLang538(org.apache.commons.lang3.time.FastDateFormat_ParserTest)  Time elapsed: 0.001 sec  <<< FAILURE!
java.lang.AssertionError: expected:<Fri Oct 16 17:42:16 BST 2009> but was:<Thu Jan 01 01:00:00 GMT 1970>
	at org.junit.Assert.fail(Assert.java:88)
	at org.junit.Assert.failNotEquals(Assert.java:834)
	at org.junit.Assert.assertEquals(Assert.java:118)
	at org.junit.Assert.assertEquals(Assert.java:144)
	at org.apache.commons.lang3.time.FastDateParserTest.testLang538(FastDateParserTest.java:535)
	at sun.reflect.NativeMethodAccessorImpl.invoke0(Native Method)
	at sun.reflect.NativeMethodAccessorImpl.invoke(NativeMethodAccessorImpl.java:57)
	at sun.reflect.DelegatingMethodAccessorImpl.invoke(DelegatingMethodAccessorImpl.java:43)
	at java.lang.reflect.Method.invoke(Method.java:606)
	at org.junit.runners.model.FrameworkMethod$1.runReflectiveCall(FrameworkMethod.java:50)
	at org.junit.internal.runners.model.ReflectiveCallable.run(ReflectiveCallable.java:12)
	at org.junit.runners.model.FrameworkMethod.invokeExplosively(FrameworkMethod.java:47)
	at org.junit.internal.runners.statements.InvokeMethod.evaluate(InvokeMethod.java:17)
	at org.junit.runners.ParentRunner.runLeaf(ParentRunner.java:325)
	at org.junit.runners.BlockJUnit4ClassRunner.runChild(BlockJUnit4ClassRunner.java:78)
	at org.junit.runners.BlockJUnit4ClassRunner.runChild(BlockJUnit4ClassRunner.java:57)
	at org.junit.runners.ParentRunner$3.run(ParentRunner.java:290)
	at org.junit.runners.ParentRunner$1.schedule(ParentRunner.java:71)
	at org.junit.runners.ParentRunner.runChildren(ParentRunner.java:288)
	at org.junit.runners.ParentRunner.access$000(ParentRunner.java:58)
	at org.junit.runners.ParentRunner$2.evaluate(ParentRunner.java:268)
	at org.junit.runners.ParentRunner.run(ParentRunner.java:363)
	at org.apache.maven.surefire.junit4.JUnit4Provider.execute(JUnit4Provider.java:283)
	at org.apache.maven.surefire.junit4.JUnit4Provider.executeWithRerun(JUnit4Provider.java:173)
	at org.apache.maven.surefire.junit4.JUnit4Provider.executeTestSet(JUnit4Provider.java:153)
	at org.apache.maven.surefire.junit4.JUnit4Provider.invoke(JUnit4Provider.java:128)
	at org.apache.maven.surefire.booter.ForkedBooter.invokeProviderInSameClassLoader(ForkedBooter.java:203)
	at org.apache.maven.surefire.booter.ForkedBooter.runSuitesInProcess(ForkedBooter.java:155)
	at org.apache.maven.surefire.booter.ForkedBooter.main(ForkedBooter.java:103)

testLang996(org.apache.commons.lang3.time.FastDateFormat_ParserTest)  Time elapsed: 0.001 sec  <<< FAILURE!
java.lang.AssertionError: expected:<Wed May 14 05:00:00 BST 2014> but was:<Thu Jan 01 06:00:00 GMT 1970>
	at org.junit.Assert.fail(Assert.java:88)
	at org.junit.Assert.failNotEquals(Assert.java:834)
	at org.junit.Assert.assertEquals(Assert.java:118)
	at org.junit.Assert.assertEquals(Assert.java:144)
	at org.apache.commons.lang3.time.FastDateParserTest.testLang996(FastDateParserTest.java:580)
	at sun.reflect.NativeMethodAccessorImpl.invoke0(Native Method)
	at sun.reflect.NativeMethodAccessorImpl.invoke(NativeMethodAccessorImpl.java:57)
	at sun.reflect.DelegatingMethodAccessorImpl.invoke(DelegatingMethodAccessorImpl.java:43)
	at java.lang.reflect.Method.invoke(Method.java:606)
	at org.junit.runners.model.FrameworkMethod$1.runReflectiveCall(FrameworkMethod.java:50)
	at org.junit.internal.runners.model.ReflectiveCallable.run(ReflectiveCallable.java:12)
	at org.junit.runners.model.FrameworkMethod.invokeExplosively(FrameworkMethod.java:47)
	at org.junit.internal.runners.statements.InvokeMethod.evaluate(InvokeMethod.java:17)
	at org.junit.runners.ParentRunner.runLeaf(ParentRunner.java:325)
	at org.junit.runners.BlockJUnit4ClassRunner.runChild(BlockJUnit4ClassRunner.java:78)
	at org.junit.runners.BlockJUnit4ClassRunner.runChild(BlockJUnit4ClassRunner.java:57)
	at org.junit.runners.ParentRunner$3.run(ParentRunner.java:290)
	at org.junit.runners.ParentRunner$1.schedule(ParentRunner.java:71)
	at org.junit.runners.ParentRunner.runChildren(ParentRunner.java:288)
	at org.junit.runners.ParentRunner.access$000(ParentRunner.java:58)
	at org.junit.runners.ParentRunner$2.evaluate(ParentRunner.java:268)
	at org.junit.runners.ParentRunner.run(ParentRunner.java:363)
	at org.apache.maven.surefire.junit4.JUnit4Provider.execute(JUnit4Provider.java:283)
	at org.apache.maven.surefire.junit4.JUnit4Provider.executeWithRerun(JUnit4Provider.java:173)
	at org.apache.maven.surefire.junit4.JUnit4Provider.executeTestSet(JUnit4Provider.java:153)
	at org.apache.maven.surefire.junit4.JUnit4Provider.invoke(JUnit4Provider.java:128)
	at org.apache.maven.surefire.booter.ForkedBooter.invokeProviderInSameClassLoader(ForkedBooter.java:203)
	at org.apache.maven.surefire.booter.ForkedBooter.runSuitesInProcess(ForkedBooter.java:155)
	at org.apache.maven.surefire.booter.ForkedBooter.main(ForkedBooter.java:103)

testLANG_832(org.apache.commons.lang3.time.FastDateFormat_ParserTest)  Time elapsed: 0.001 sec  <<< FAILURE!
java.lang.AssertionError: Parsed dates should be equal expected:<Sat Jan 03 06:00:00 GMT 1970> but was:<Thu Jan 01 06:00:00 GMT 1970>
	at org.junit.Assert.fail(Assert.java:88)
	at org.junit.Assert.failNotEquals(Assert.java:834)
	at org.junit.Assert.assertEquals(Assert.java:118)
	at org.apache.commons.lang3.time.FastDateParserTest.testSdfAndFdp(FastDateParserTest.java:455)
	at org.apache.commons.lang3.time.FastDateParserTest.testLANG_832(FastDateParserTest.java:411)
	at sun.reflect.NativeMethodAccessorImpl.invoke0(Native Method)
	at sun.reflect.NativeMethodAccessorImpl.invoke(NativeMethodAccessorImpl.java:57)
	at sun.reflect.DelegatingMethodAccessorImpl.invoke(DelegatingMethodAccessorImpl.java:43)
	at java.lang.reflect.Method.invoke(Method.java:606)
	at org.junit.runners.model.FrameworkMethod$1.runReflectiveCall(FrameworkMethod.java:50)
	at org.junit.internal.runners.model.ReflectiveCallable.run(ReflectiveCallable.java:12)
	at org.junit.runners.model.FrameworkMethod.invokeExplosively(FrameworkMethod.java:47)
	at org.junit.internal.runners.statements.InvokeMethod.evaluate(InvokeMethod.java:17)
	at org.junit.runners.ParentRunner.runLeaf(ParentRunner.java:325)
	at org.junit.runners.BlockJUnit4ClassRunner.runChild(BlockJUnit4ClassRunner.java:78)
	at org.junit.runners.BlockJUnit4ClassRunner.runChild(BlockJUnit4ClassRunner.java:57)
	at org.junit.runners.ParentRunner$3.run(ParentRunner.java:290)
	at org.junit.runners.ParentRunner$1.schedule(ParentRunner.java:71)
	at org.junit.runners.ParentRunner.runChildren(ParentRunner.java:288)
	at org.junit.runners.ParentRunner.access$000(ParentRunner.java:58)
	at org.junit.runners.ParentRunner$2.evaluate(ParentRunner.java:268)
	at org.junit.runners.ParentRunner.run(ParentRunner.java:363)
	at org.apache.maven.surefire.junit4.JUnit4Provider.execute(JUnit4Provider.java:283)
	at org.apache.maven.surefire.junit4.JUnit4Provider.executeWithRerun(JUnit4Provider.java:173)
	at org.apache.maven.surefire.junit4.JUnit4Provider.executeTestSet(JUnit4Provider.java:153)
	at org.apache.maven.surefire.junit4.JUnit4Provider.invoke(JUnit4Provider.java:128)
	at org.apache.maven.surefire.booter.ForkedBooter.invokeProviderInSameClassLoader(ForkedBooter.java:203)
	at org.apache.maven.surefire.booter.ForkedBooter.runSuitesInProcess(ForkedBooter.java:155)
	at org.apache.maven.surefire.booter.ForkedBooter.main(ForkedBooter.java:103)

testTzParses(org.apache.commons.lang3.time.FastDateFormat_ParserTest)  Time elapsed: 0.005 sec  <<< FAILURE!
java.lang.AssertionError: tz:America/New_York locale:Malay (Malaysia) expected:<Thu Feb 10 05:00:00 GMT 2000> but was:<Thu Jan 01 00:00:00 GMT 1970>
	at org.junit.Assert.fail(Assert.java:88)
	at org.junit.Assert.failNotEquals(Assert.java:834)
	at org.junit.Assert.assertEquals(Assert.java:118)
	at org.apache.commons.lang3.time.FastDateParserTest.testTzParses(FastDateParserTest.java:275)
	at sun.reflect.NativeMethodAccessorImpl.invoke0(Native Method)
	at sun.reflect.NativeMethodAccessorImpl.invoke(NativeMethodAccessorImpl.java:57)
	at sun.reflect.DelegatingMethodAccessorImpl.invoke(DelegatingMethodAccessorImpl.java:43)
	at java.lang.reflect.Method.invoke(Method.java:606)
	at org.junit.runners.model.FrameworkMethod$1.runReflectiveCall(FrameworkMethod.java:50)
	at org.junit.internal.runners.model.ReflectiveCallable.run(ReflectiveCallable.java:12)
	at org.junit.runners.model.FrameworkMethod.invokeExplosively(FrameworkMethod.java:47)
	at org.junit.internal.runners.statements.InvokeMethod.evaluate(InvokeMethod.java:17)
	at org.junit.runners.ParentRunner.runLeaf(ParentRunner.java:325)
	at org.junit.runners.BlockJUnit4ClassRunner.runChild(BlockJUnit4ClassRunner.java:78)
	at org.junit.runners.BlockJUnit4ClassRunner.runChild(BlockJUnit4ClassRunner.java:57)
	at org.junit.runners.ParentRunner$3.run(ParentRunner.java:290)
	at org.junit.runners.ParentRunner$1.schedule(ParentRunner.java:71)
	at org.junit.runners.ParentRunner.runChildren(ParentRunner.java:288)
	at org.junit.runners.ParentRunner.access$000(ParentRunner.java:58)
	at org.junit.runners.ParentRunner$2.evaluate(ParentRunner.java:268)
	at org.junit.runners.ParentRunner.run(ParentRunner.java:363)
	at org.apache.maven.surefire.junit4.JUnit4Provider.execute(JUnit4Provider.java:283)
	at org.apache.maven.surefire.junit4.JUnit4Provider.executeWithRerun(JUnit4Provider.java:173)
	at org.apache.maven.surefire.junit4.JUnit4Provider.executeTestSet(JUnit4Provider.java:153)
	at org.apache.maven.surefire.junit4.JUnit4Provider.invoke(JUnit4Provider.java:128)
	at org.apache.maven.surefire.booter.ForkedBooter.invokeProviderInSameClassLoader(ForkedBooter.java:203)
	at org.apache.maven.surefire.booter.ForkedBooter.runSuitesInProcess(ForkedBooter.java:155)
	at org.apache.maven.surefire.booter.ForkedBooter.main(ForkedBooter.java:103)

testLocales_ShortNoEra_AD(org.apache.commons.lang3.time.FastDateFormat_ParserTest)  Time elapsed: 0.002 sec  <<< FAILURE!
java.lang.AssertionError: ms_MY 2003/2/10/12/AM/0/0/Isn
 expected:<Mon Feb 10 00:00:00 GMT 2003> but was:<Thu Jan 01 00:00:00 GMT 1970>
	at org.junit.Assert.fail(Assert.java:88)
	at org.junit.Assert.failNotEquals(Assert.java:834)
	at org.junit.Assert.assertEquals(Assert.java:118)
	at org.apache.commons.lang3.time.FastDateParserTest.checkParse(FastDateParserTest.java:366)
	at org.apache.commons.lang3.time.FastDateParserTest.checkParse(FastDateParserTest.java:358)
	at org.apache.commons.lang3.time.FastDateParserTest.testLocales(FastDateParserTest.java:338)
	at org.apache.commons.lang3.time.FastDateParserTest.testLocales_ShortNoEra_AD(FastDateParserTest.java:313)
	at sun.reflect.NativeMethodAccessorImpl.invoke0(Native Method)
	at sun.reflect.NativeMethodAccessorImpl.invoke(NativeMethodAccessorImpl.java:57)
	at sun.reflect.DelegatingMethodAccessorImpl.invoke(DelegatingMethodAccessorImpl.java:43)
	at java.lang.reflect.Method.invoke(Method.java:606)
	at org.junit.runners.model.FrameworkMethod$1.runReflectiveCall(FrameworkMethod.java:50)
	at org.junit.internal.runners.model.ReflectiveCallable.run(ReflectiveCallable.java:12)
	at org.junit.runners.model.FrameworkMethod.invokeExplosively(FrameworkMethod.java:47)
	at org.junit.internal.runners.statements.InvokeMethod.evaluate(InvokeMethod.java:17)
	at org.junit.runners.ParentRunner.runLeaf(ParentRunner.java:325)
	at org.junit.runners.BlockJUnit4ClassRunner.runChild(BlockJUnit4ClassRunner.java:78)
	at org.junit.runners.BlockJUnit4ClassRunner.runChild(BlockJUnit4ClassRunner.java:57)
	at org.junit.runners.ParentRunner$3.run(ParentRunner.java:290)
	at org.junit.runners.ParentRunner$1.schedule(ParentRunner.java:71)
	at org.junit.runners.ParentRunner.runChildren(ParentRunner.java:288)
	at org.junit.runners.ParentRunner.access$000(ParentRunner.java:58)
	at org.junit.runners.ParentRunner$2.evaluate(ParentRunner.java:268)
	at org.junit.runners.ParentRunner.run(ParentRunner.java:363)
	at org.apache.maven.surefire.junit4.JUnit4Provider.execute(JUnit4Provider.java:283)
	at org.apache.maven.surefire.junit4.JUnit4Provider.executeWithRerun(JUnit4Provider.java:173)
	at org.apache.maven.surefire.junit4.JUnit4Provider.executeTestSet(JUnit4Provider.java:153)
	at org.apache.maven.surefire.junit4.JUnit4Provider.invoke(JUnit4Provider.java:128)
	at org.apache.maven.surefire.booter.ForkedBooter.invokeProviderInSameClassLoader(ForkedBooter.java:203)
	at org.apache.maven.surefire.booter.ForkedBooter.runSuitesInProcess(ForkedBooter.java:155)
	at org.apache.maven.surefire.booter.ForkedBooter.main(ForkedBooter.java:103)

testLocales_ShortNoEra_BC(org.apache.commons.lang3.time.FastDateFormat_ParserTest)  Time elapsed: 0.001 sec  <<< FAILURE!
java.lang.AssertionError: ms_MY 2003/2/10/12/AM/0/0/Sab
 expected:<Mon Feb 10 00:00:00 GMT 2003> but was:<Thu Jan 01 00:00:00 GMT 1970>
	at org.junit.Assert.fail(Assert.java:88)
	at org.junit.Assert.failNotEquals(Assert.java:834)
	at org.junit.Assert.assertEquals(Assert.java:118)
	at org.apache.commons.lang3.time.FastDateParserTest.checkParse(FastDateParserTest.java:366)
	at org.apache.commons.lang3.time.FastDateParserTest.checkParse(FastDateParserTest.java:358)
	at org.apache.commons.lang3.time.FastDateParserTest.testLocales(FastDateParserTest.java:338)
	at org.apache.commons.lang3.time.FastDateParserTest.testLocales_ShortNoEra_BC(FastDateParserTest.java:318)
	at sun.reflect.NativeMethodAccessorImpl.invoke0(Native Method)
	at sun.reflect.NativeMethodAccessorImpl.invoke(NativeMethodAccessorImpl.java:57)
	at sun.reflect.DelegatingMethodAccessorImpl.invoke(DelegatingMethodAccessorImpl.java:43)
	at java.lang.reflect.Method.invoke(Method.java:606)
	at org.junit.runners.model.FrameworkMethod$1.runReflectiveCall(FrameworkMethod.java:50)
	at org.junit.internal.runners.model.ReflectiveCallable.run(ReflectiveCallable.java:12)
	at org.junit.runners.model.FrameworkMethod.invokeExplosively(FrameworkMethod.java:47)
	at org.junit.internal.runners.statements.InvokeMethod.evaluate(InvokeMethod.java:17)
	at org.junit.runners.ParentRunner.runLeaf(ParentRunner.java:325)
	at org.junit.runners.BlockJUnit4ClassRunner.runChild(BlockJUnit4ClassRunner.java:78)
	at org.junit.runners.BlockJUnit4ClassRunner.runChild(BlockJUnit4ClassRunner.java:57)
	at org.junit.runners.ParentRunner$3.run(ParentRunner.java:290)
	at org.junit.runners.ParentRunner$1.schedule(ParentRunner.java:71)
	at org.junit.runners.ParentRunner.runChildren(ParentRunner.java:288)
	at org.junit.runners.ParentRunner.access$000(ParentRunner.java:58)
	at org.junit.runners.ParentRunner$2.evaluate(ParentRunner.java:268)
	at org.junit.runners.ParentRunner.run(ParentRunner.java:363)
	at org.apache.maven.surefire.junit4.JUnit4Provider.execute(JUnit4Provider.java:283)
	at org.apache.maven.surefire.junit4.JUnit4Provider.executeWithRerun(JUnit4Provider.java:173)
	at org.apache.maven.surefire.junit4.JUnit4Provider.executeTestSet(JUnit4Provider.java:153)
	at org.apache.maven.surefire.junit4.JUnit4Provider.invoke(JUnit4Provider.java:128)
	at org.apache.maven.surefire.booter.ForkedBooter.invokeProviderInSameClassLoader(ForkedBooter.java:203)
	at org.apache.maven.surefire.booter.ForkedBooter.runSuitesInProcess(ForkedBooter.java:155)
	at org.apache.maven.surefire.booter.ForkedBooter.main(ForkedBooter.java:103)

testParseLongShort(org.apache.commons.lang3.time.FastDateFormat_ParserTest)  Time elapsed: 0.003 sec  <<< FAILURE!
java.lang.AssertionError: expected:<Mon Feb 10 20:33:20 GMT 2003> but was:<Thu Jan 01 06:00:00 GMT 1970>
	at org.junit.Assert.fail(Assert.java:88)
	at org.junit.Assert.failNotEquals(Assert.java:834)
	at org.junit.Assert.assertEquals(Assert.java:118)
	at org.junit.Assert.assertEquals(Assert.java:144)
	at org.apache.commons.lang3.time.FastDateParserTest.testParseLongShort(FastDateParserTest.java:150)
	at sun.reflect.NativeMethodAccessorImpl.invoke0(Native Method)
	at sun.reflect.NativeMethodAccessorImpl.invoke(NativeMethodAccessorImpl.java:57)
	at sun.reflect.DelegatingMethodAccessorImpl.invoke(DelegatingMethodAccessorImpl.java:43)
	at java.lang.reflect.Method.invoke(Method.java:606)
	at org.junit.runners.model.FrameworkMethod$1.runReflectiveCall(FrameworkMethod.java:50)
	at org.junit.internal.runners.model.ReflectiveCallable.run(ReflectiveCallable.java:12)
	at org.junit.runners.model.FrameworkMethod.invokeExplosively(FrameworkMethod.java:47)
	at org.junit.internal.runners.statements.InvokeMethod.evaluate(InvokeMethod.java:17)
	at org.junit.runners.ParentRunner.runLeaf(ParentRunner.java:325)
	at org.junit.runners.BlockJUnit4ClassRunner.runChild(BlockJUnit4ClassRunner.java:78)
	at org.junit.runners.BlockJUnit4ClassRunner.runChild(BlockJUnit4ClassRunner.java:57)
	at org.junit.runners.ParentRunner$3.run(ParentRunner.java:290)
	at org.junit.runners.ParentRunner$1.schedule(ParentRunner.java:71)
	at org.junit.runners.ParentRunner.runChildren(ParentRunner.java:288)
	at org.junit.runners.ParentRunner.access$000(ParentRunner.java:58)
	at org.junit.runners.ParentRunner$2.evaluate(ParentRunner.java:268)
	at org.junit.runners.ParentRunner.run(ParentRunner.java:363)
	at org.apache.maven.surefire.junit4.JUnit4Provider.execute(JUnit4Provider.java:283)
	at org.apache.maven.surefire.junit4.JUnit4Provider.executeWithRerun(JUnit4Provider.java:173)
	at org.apache.maven.surefire.junit4.JUnit4Provider.executeTestSet(JUnit4Provider.java:153)
	at org.apache.maven.surefire.junit4.JUnit4Provider.invoke(JUnit4Provider.java:128)
	at org.apache.maven.surefire.booter.ForkedBooter.invokeProviderInSameClassLoader(ForkedBooter.java:203)
	at org.apache.maven.surefire.booter.ForkedBooter.runSuitesInProcess(ForkedBooter.java:155)
	at org.apache.maven.surefire.booter.ForkedBooter.main(ForkedBooter.java:103)

testLocales_LongNoEra_AD(org.apache.commons.lang3.time.FastDateFormat_ParserTest)  Time elapsed: 0.002 sec  <<< FAILURE!
java.lang.AssertionError: ms_MY 2003/Februari/0010/0012/0000/00/AM/Isnin
 expected:<Mon Feb 10 00:00:00 GMT 2003> but was:<Thu Jan 01 00:00:00 GMT 1970>
	at org.junit.Assert.fail(Assert.java:88)
	at org.junit.Assert.failNotEquals(Assert.java:834)
	at org.junit.Assert.assertEquals(Assert.java:118)
	at org.apache.commons.lang3.time.FastDateParserTest.checkParse(FastDateParserTest.java:366)
	at org.apache.commons.lang3.time.FastDateParserTest.checkParse(FastDateParserTest.java:358)
	at org.apache.commons.lang3.time.FastDateParserTest.testLocales(FastDateParserTest.java:338)
	at org.apache.commons.lang3.time.FastDateParserTest.testLocales_LongNoEra_AD(FastDateParserTest.java:303)
	at sun.reflect.NativeMethodAccessorImpl.invoke0(Native Method)
	at sun.reflect.NativeMethodAccessorImpl.invoke(NativeMethodAccessorImpl.java:57)
	at sun.reflect.DelegatingMethodAccessorImpl.invoke(DelegatingMethodAccessorImpl.java:43)
	at java.lang.reflect.Method.invoke(Method.java:606)
	at org.junit.runners.model.FrameworkMethod$1.runReflectiveCall(FrameworkMethod.java:50)
	at org.junit.internal.runners.model.ReflectiveCallable.run(ReflectiveCallable.java:12)
	at org.junit.runners.model.FrameworkMethod.invokeExplosively(FrameworkMethod.java:47)
	at org.junit.internal.runners.statements.InvokeMethod.evaluate(InvokeMethod.java:17)
	at org.junit.runners.ParentRunner.runLeaf(ParentRunner.java:325)
	at org.junit.runners.BlockJUnit4ClassRunner.runChild(BlockJUnit4ClassRunner.java:78)
	at org.junit.runners.BlockJUnit4ClassRunner.runChild(BlockJUnit4ClassRunner.java:57)
	at org.junit.runners.ParentRunner$3.run(ParentRunner.java:290)
	at org.junit.runners.ParentRunner$1.schedule(ParentRunner.java:71)
	at org.junit.runners.ParentRunner.runChildren(ParentRunner.java:288)
	at org.junit.runners.ParentRunner.access$000(ParentRunner.java:58)
	at org.junit.runners.ParentRunner$2.evaluate(ParentRunner.java:268)
	at org.junit.runners.ParentRunner.run(ParentRunner.java:363)
	at org.apache.maven.surefire.junit4.JUnit4Provider.execute(JUnit4Provider.java:283)
	at org.apache.maven.surefire.junit4.JUnit4Provider.executeWithRerun(JUnit4Provider.java:173)
	at org.apache.maven.surefire.junit4.JUnit4Provider.executeTestSet(JUnit4Provider.java:153)
	at org.apache.maven.surefire.junit4.JUnit4Provider.invoke(JUnit4Provider.java:128)
	at org.apache.maven.surefire.booter.ForkedBooter.invokeProviderInSameClassLoader(ForkedBooter.java:203)
	at org.apache.maven.surefire.booter.ForkedBooter.runSuitesInProcess(ForkedBooter.java:155)
	at org.apache.maven.surefire.booter.ForkedBooter.main(ForkedBooter.java:103)

testLocales_LongNoEra_BC(org.apache.commons.lang3.time.FastDateFormat_ParserTest)  Time elapsed: 0.001 sec  <<< FAILURE!
java.lang.AssertionError: ms_MY 2003/Februari/0010/0012/0000/00/AM/Sabtu
 expected:<Mon Feb 10 00:00:00 GMT 2003> but was:<Thu Jan 01 00:00:00 GMT 1970>
	at org.junit.Assert.fail(Assert.java:88)
	at org.junit.Assert.failNotEquals(Assert.java:834)
	at org.junit.Assert.assertEquals(Assert.java:118)
	at org.apache.commons.lang3.time.FastDateParserTest.checkParse(FastDateParserTest.java:366)
	at org.apache.commons.lang3.time.FastDateParserTest.checkParse(FastDateParserTest.java:358)
	at org.apache.commons.lang3.time.FastDateParserTest.testLocales(FastDateParserTest.java:338)
	at org.apache.commons.lang3.time.FastDateParserTest.testLocales_LongNoEra_BC(FastDateParserTest.java:308)
	at sun.reflect.NativeMethodAccessorImpl.invoke0(Native Method)
	at sun.reflect.NativeMethodAccessorImpl.invoke(NativeMethodAccessorImpl.java:57)
	at sun.reflect.DelegatingMethodAccessorImpl.invoke(DelegatingMethodAccessorImpl.java:43)
	at java.lang.reflect.Method.invoke(Method.java:606)
	at org.junit.runners.model.FrameworkMethod$1.runReflectiveCall(FrameworkMethod.java:50)
	at org.junit.internal.runners.model.ReflectiveCallable.run(ReflectiveCallable.java:12)
	at org.junit.runners.model.FrameworkMethod.invokeExplosively(FrameworkMethod.java:47)
	at org.junit.internal.runners.statements.InvokeMethod.evaluate(InvokeMethod.java:17)
	at org.junit.runners.ParentRunner.runLeaf(ParentRunner.java:325)
	at org.junit.runners.BlockJUnit4ClassRunner.runChild(BlockJUnit4ClassRunner.java:78)
	at org.junit.runners.BlockJUnit4ClassRunner.runChild(BlockJUnit4ClassRunner.java:57)
	at org.junit.runners.ParentRunner$3.run(ParentRunner.java:290)
	at org.junit.runners.ParentRunner$1.schedule(ParentRunner.java:71)
	at org.junit.runners.ParentRunner.runChildren(ParentRunner.java:288)
	at org.junit.runners.ParentRunner.access$000(ParentRunner.java:58)
	at org.junit.runners.ParentRunner$2.evaluate(ParentRunner.java:268)
	at org.junit.runners.ParentRunner.run(ParentRunner.java:363)
	at org.apache.maven.surefire.junit4.JUnit4Provider.execute(JUnit4Provider.java:283)
	at org.apache.maven.surefire.junit4.JUnit4Provider.executeWithRerun(JUnit4Provider.java:173)
	at org.apache.maven.surefire.junit4.JUnit4Provider.executeTestSet(JUnit4Provider.java:153)
	at org.apache.maven.surefire.junit4.JUnit4Provider.invoke(JUnit4Provider.java:128)
	at org.apache.maven.surefire.booter.ForkedBooter.invokeProviderInSameClassLoader(ForkedBooter.java:203)
	at org.apache.maven.surefire.booter.ForkedBooter.runSuitesInProcess(ForkedBooter.java:155)
	at org.apache.maven.surefire.booter.ForkedBooter.main(ForkedBooter.java:103)

testLocales_Short_AD(org.apache.commons.lang3.time.FastDateFormat_ParserTest)  Time elapsed: 0.002 sec  <<< FAILURE!
java.lang.AssertionError: ms_MY CE/2003/2/10/12/AM/0/0/Isn
 expected:<Mon Feb 10 00:00:00 GMT 2003> but was:<Thu Jan 01 00:00:00 GMT 1970>
	at org.junit.Assert.fail(Assert.java:88)
	at org.junit.Assert.failNotEquals(Assert.java:834)
	at org.junit.Assert.assertEquals(Assert.java:118)
	at org.apache.commons.lang3.time.FastDateParserTest.checkParse(FastDateParserTest.java:366)
	at org.apache.commons.lang3.time.FastDateParserTest.checkParse(FastDateParserTest.java:358)
	at org.apache.commons.lang3.time.FastDateParserTest.testLocales(FastDateParserTest.java:338)
	at org.apache.commons.lang3.time.FastDateParserTest.testLocales_Short_AD(FastDateParserTest.java:293)
	at sun.reflect.NativeMethodAccessorImpl.invoke0(Native Method)
	at sun.reflect.NativeMethodAccessorImpl.invoke(NativeMethodAccessorImpl.java:57)
	at sun.reflect.DelegatingMethodAccessorImpl.invoke(DelegatingMethodAccessorImpl.java:43)
	at java.lang.reflect.Method.invoke(Method.java:606)
	at org.junit.runners.model.FrameworkMethod$1.runReflectiveCall(FrameworkMethod.java:50)
	at org.junit.internal.runners.model.ReflectiveCallable.run(ReflectiveCallable.java:12)
	at org.junit.runners.model.FrameworkMethod.invokeExplosively(FrameworkMethod.java:47)
	at org.junit.internal.runners.statements.InvokeMethod.evaluate(InvokeMethod.java:17)
	at org.junit.runners.ParentRunner.runLeaf(ParentRunner.java:325)
	at org.junit.runners.BlockJUnit4ClassRunner.runChild(BlockJUnit4ClassRunner.java:78)
	at org.junit.runners.BlockJUnit4ClassRunner.runChild(BlockJUnit4ClassRunner.java:57)
	at org.junit.runners.ParentRunner$3.run(ParentRunner.java:290)
	at org.junit.runners.ParentRunner$1.schedule(ParentRunner.java:71)
	at org.junit.runners.ParentRunner.runChildren(ParentRunner.java:288)
	at org.junit.runners.ParentRunner.access$000(ParentRunner.java:58)
	at org.junit.runners.ParentRunner$2.evaluate(ParentRunner.java:268)
	at org.junit.runners.ParentRunner.run(ParentRunner.java:363)
	at org.apache.maven.surefire.junit4.JUnit4Provider.execute(JUnit4Provider.java:283)
	at org.apache.maven.surefire.junit4.JUnit4Provider.executeWithRerun(JUnit4Provider.java:173)
	at org.apache.maven.surefire.junit4.JUnit4Provider.executeTestSet(JUnit4Provider.java:153)
	at org.apache.maven.surefire.junit4.JUnit4Provider.invoke(JUnit4Provider.java:128)
	at org.apache.maven.surefire.booter.ForkedBooter.invokeProviderInSameClassLoader(ForkedBooter.java:203)
	at org.apache.maven.surefire.booter.ForkedBooter.runSuitesInProcess(ForkedBooter.java:155)
	at org.apache.maven.surefire.booter.ForkedBooter.main(ForkedBooter.java:103)

testLocales_Short_BC(org.apache.commons.lang3.time.FastDateFormat_ParserTest)  Time elapsed: 0.001 sec  <<< FAILURE!
java.lang.AssertionError: ms_MY BCE/2003/2/10/12/AM/0/0/Sab
 expected:<Sat Feb 10 00:00:00 GMT 2003> but was:<Thu Jan 01 00:00:00 GMT 1970>
	at org.junit.Assert.fail(Assert.java:88)
	at org.junit.Assert.failNotEquals(Assert.java:834)
	at org.junit.Assert.assertEquals(Assert.java:118)
	at org.apache.commons.lang3.time.FastDateParserTest.checkParse(FastDateParserTest.java:366)
	at org.apache.commons.lang3.time.FastDateParserTest.checkParse(FastDateParserTest.java:358)
	at org.apache.commons.lang3.time.FastDateParserTest.testLocales(FastDateParserTest.java:338)
	at org.apache.commons.lang3.time.FastDateParserTest.testLocales_Short_BC(FastDateParserTest.java:298)
	at sun.reflect.NativeMethodAccessorImpl.invoke0(Native Method)
	at sun.reflect.NativeMethodAccessorImpl.invoke(NativeMethodAccessorImpl.java:57)
	at sun.reflect.DelegatingMethodAccessorImpl.invoke(DelegatingMethodAccessorImpl.java:43)
	at java.lang.reflect.Method.invoke(Method.java:606)
	at org.junit.runners.model.FrameworkMethod$1.runReflectiveCall(FrameworkMethod.java:50)
	at org.junit.internal.runners.model.ReflectiveCallable.run(ReflectiveCallable.java:12)
	at org.junit.runners.model.FrameworkMethod.invokeExplosively(FrameworkMethod.java:47)
	at org.junit.internal.runners.statements.InvokeMethod.evaluate(InvokeMethod.java:17)
	at org.junit.runners.ParentRunner.runLeaf(ParentRunner.java:325)
	at org.junit.runners.BlockJUnit4ClassRunner.runChild(BlockJUnit4ClassRunner.java:78)
	at org.junit.runners.BlockJUnit4ClassRunner.runChild(BlockJUnit4ClassRunner.java:57)
	at org.junit.runners.ParentRunner$3.run(ParentRunner.java:290)
	at org.junit.runners.ParentRunner$1.schedule(ParentRunner.java:71)
	at org.junit.runners.ParentRunner.runChildren(ParentRunner.java:288)
	at org.junit.runners.ParentRunner.access$000(ParentRunner.java:58)
	at org.junit.runners.ParentRunner$2.evaluate(ParentRunner.java:268)
	at org.junit.runners.ParentRunner.run(ParentRunner.java:363)
	at org.apache.maven.surefire.junit4.JUnit4Provider.execute(JUnit4Provider.java:283)
	at org.apache.maven.surefire.junit4.JUnit4Provider.executeWithRerun(JUnit4Provider.java:173)
	at org.apache.maven.surefire.junit4.JUnit4Provider.executeTestSet(JUnit4Provider.java:153)
	at org.apache.maven.surefire.junit4.JUnit4Provider.invoke(JUnit4Provider.java:128)
	at org.apache.maven.surefire.booter.ForkedBooter.invokeProviderInSameClassLoader(ForkedBooter.java:203)
	at org.apache.maven.surefire.booter.ForkedBooter.runSuitesInProcess(ForkedBooter.java:155)
	at org.apache.maven.surefire.booter.ForkedBooter.main(ForkedBooter.java:103)

testParses(org.apache.commons.lang3.time.FastDateFormat_ParserTest)  Time elapsed: 0.001 sec  <<< FAILURE!
java.lang.AssertionError: ms_MY Thu Feb 10 05:00:00 GMT 2000 GGGG/yyyy/MMMM/dddd/hhhh/mmmm/ss/aaaa/EEEE America/New_York expected:<Thu Feb 10 05:00:00 GMT 2000> but was:<Thu Jan 01 06:00:00 GMT 1970>
	at org.junit.Assert.fail(Assert.java:88)
	at org.junit.Assert.failNotEquals(Assert.java:834)
	at org.junit.Assert.assertEquals(Assert.java:118)
	at org.apache.commons.lang3.time.FastDateParserTest.validateSdfFormatFdpParseEquality(FastDateParserTest.java:228)
	at org.apache.commons.lang3.time.FastDateParserTest.testParses(FastDateParserTest.java:251)
	at sun.reflect.NativeMethodAccessorImpl.invoke0(Native Method)
	at sun.reflect.NativeMethodAccessorImpl.invoke(NativeMethodAccessorImpl.java:57)
	at sun.reflect.DelegatingMethodAccessorImpl.invoke(DelegatingMethodAccessorImpl.java:43)
	at java.lang.reflect.Method.invoke(Method.java:606)
	at org.junit.runners.model.FrameworkMethod$1.runReflectiveCall(FrameworkMethod.java:50)
	at org.junit.internal.runners.model.ReflectiveCallable.run(ReflectiveCallable.java:12)
	at org.junit.runners.model.FrameworkMethod.invokeExplosively(FrameworkMethod.java:47)
	at org.junit.internal.runners.statements.InvokeMethod.evaluate(InvokeMethod.java:17)
	at org.junit.runners.ParentRunner.runLeaf(ParentRunner.java:325)
	at org.junit.runners.BlockJUnit4ClassRunner.runChild(BlockJUnit4ClassRunner.java:78)
	at org.junit.runners.BlockJUnit4ClassRunner.runChild(BlockJUnit4ClassRunner.java:57)
	at org.junit.runners.ParentRunner$3.run(ParentRunner.java:290)
	at org.junit.runners.ParentRunner$1.schedule(ParentRunner.java:71)
	at org.junit.runners.ParentRunner.runChildren(ParentRunner.java:288)
	at org.junit.runners.ParentRunner.access$000(ParentRunner.java:58)
	at org.junit.runners.ParentRunner$2.evaluate(ParentRunner.java:268)
	at org.junit.runners.ParentRunner.run(ParentRunner.java:363)
	at org.apache.maven.surefire.junit4.JUnit4Provider.execute(JUnit4Provider.java:283)
	at org.apache.maven.surefire.junit4.JUnit4Provider.executeWithRerun(JUnit4Provider.java:173)
	at org.apache.maven.surefire.junit4.JUnit4Provider.executeTestSet(JUnit4Provider.java:153)
	at org.apache.maven.surefire.junit4.JUnit4Provider.invoke(JUnit4Provider.java:128)
	at org.apache.maven.surefire.booter.ForkedBooter.invokeProviderInSameClassLoader(ForkedBooter.java:203)
	at org.apache.maven.surefire.booter.ForkedBooter.runSuitesInProcess(ForkedBooter.java:155)
	at org.apache.maven.surefire.booter.ForkedBooter.main(ForkedBooter.java:103)

testQuotes(org.apache.commons.lang3.time.FastDateFormat_ParserTest)  Time elapsed: 0 sec  <<< FAILURE!
java.lang.AssertionError: expected:<Mon Feb 10 20:33:20 GMT 2003> but was:<Thu Jan 01 06:00:00 GMT 1970>
	at org.junit.Assert.fail(Assert.java:88)
	at org.junit.Assert.failNotEquals(Assert.java:834)
	at org.junit.Assert.assertEquals(Assert.java:118)
	at org.junit.Assert.assertEquals(Assert.java:144)
	at org.apache.commons.lang3.time.FastDateParserTest.testQuotes(FastDateParserTest.java:388)
	at sun.reflect.NativeMethodAccessorImpl.invoke0(Native Method)
	at sun.reflect.NativeMethodAccessorImpl.invoke(NativeMethodAccessorImpl.java:57)
	at sun.reflect.DelegatingMethodAccessorImpl.invoke(DelegatingMethodAccessorImpl.java:43)
	at java.lang.reflect.Method.invoke(Method.java:606)
	at org.junit.runners.model.FrameworkMethod$1.runReflectiveCall(FrameworkMethod.java:50)
	at org.junit.internal.runners.model.ReflectiveCallable.run(ReflectiveCallable.java:12)
	at org.junit.runners.model.FrameworkMethod.invokeExplosively(FrameworkMethod.java:47)
	at org.junit.internal.runners.statements.InvokeMethod.evaluate(InvokeMethod.java:17)
	at org.junit.runners.ParentRunner.runLeaf(ParentRunner.java:325)
	at org.junit.runners.BlockJUnit4ClassRunner.runChild(BlockJUnit4ClassRunner.java:78)
	at org.junit.runners.BlockJUnit4ClassRunner.runChild(BlockJUnit4ClassRunner.java:57)
	at org.junit.runners.ParentRunner$3.run(ParentRunner.java:290)
	at org.junit.runners.ParentRunner$1.schedule(ParentRunner.java:71)
	at org.junit.runners.ParentRunner.runChildren(ParentRunner.java:288)
	at org.junit.runners.ParentRunner.access$000(ParentRunner.java:58)
	at org.junit.runners.ParentRunner$2.evaluate(ParentRunner.java:268)
	at org.junit.runners.ParentRunner.run(ParentRunner.java:363)
	at org.apache.maven.surefire.junit4.JUnit4Provider.execute(JUnit4Provider.java:283)
	at org.apache.maven.surefire.junit4.JUnit4Provider.executeWithRerun(JUnit4Provider.java:173)
	at org.apache.maven.surefire.junit4.JUnit4Provider.executeTestSet(JUnit4Provider.java:153)
	at org.apache.maven.surefire.junit4.JUnit4Provider.invoke(JUnit4Provider.java:128)
	at org.apache.maven.surefire.booter.ForkedBooter.invokeProviderInSameClassLoader(ForkedBooter.java:203)
	at org.apache.maven.surefire.booter.ForkedBooter.runSuitesInProcess(ForkedBooter.java:155)
	at org.apache.maven.surefire.booter.ForkedBooter.main(ForkedBooter.java:103)

Running org.apache.commons.lang3.time.DurationFormatUtilsTest
Tests run: 25, Failures: 0, Errors: 0, Skipped: 0, Time elapsed: 1.223 sec - in org.apache.commons.lang3.time.DurationFormatUtilsTest
Running org.apache.commons.lang3.time.DateFormatUtilsTest
Tests run: 10, Failures: 1, Errors: 0, Skipped: 0, Time elapsed: 0.007 sec <<< FAILURE! - in org.apache.commons.lang3.time.DateFormatUtilsTest
testDateTimeISO(org.apache.commons.lang3.time.DateFormatUtilsTest)  Time elapsed: 0.002 sec  <<< FAILURE!
java.lang.AssertionError: expected:<Sat Feb 23 09:11:12 UTC 2002> but was:<Wed Dec 31 23:00:00 UTC 1969>
	at org.junit.Assert.fail(Assert.java:88)
	at org.junit.Assert.failNotEquals(Assert.java:834)
	at org.junit.Assert.assertEquals(Assert.java:118)
	at org.junit.Assert.assertEquals(Assert.java:144)
	at org.apache.commons.lang3.time.DateFormatUtilsTest.testDateTimeISO(DateFormatUtilsTest.java:137)

Running org.apache.commons.lang3.time.DateUtilsFragmentTest
Tests run: 57, Failures: 0, Errors: 0, Skipped: 0, Time elapsed: 0.016 sec - in org.apache.commons.lang3.time.DateUtilsFragmentTest
Running org.apache.commons.lang3.time.FastDatePrinterTimeZonesTest
Tests run: 617, Failures: 0, Errors: 0, Skipped: 0, Time elapsed: 0.281 sec - in org.apache.commons.lang3.time.FastDatePrinterTimeZonesTest
Running org.apache.commons.lang3.time.FastDateFormatTest
Tests run: 14, Failures: 1, Errors: 0, Skipped: 0, Time elapsed: 1.157 sec <<< FAILURE! - in org.apache.commons.lang3.time.FastDateFormatTest
testParseSync(org.apache.commons.lang3.time.FastDateFormatTest)  Time elapsed: 1.112 sec  <<< FAILURE!
java.lang.AssertionError: expected:<0> but was:<100000>
	at org.junit.Assert.fail(Assert.java:88)
	at org.junit.Assert.failNotEquals(Assert.java:834)
	at org.junit.Assert.assertEquals(Assert.java:645)
	at org.junit.Assert.assertEquals(Assert.java:631)
	at org.apache.commons.lang3.time.FastDateFormatTest.measureTime(FastDateFormatTest.java:322)
	at org.apache.commons.lang3.time.FastDateFormatTest.testParseSync(FastDateFormatTest.java:278)

Running org.apache.commons.lang3.time.FastDateFormat_PrinterTest
Tests run: 17, Failures: 0, Errors: 0, Skipped: 0, Time elapsed: 0.017 sec - in org.apache.commons.lang3.time.FastDateFormat_PrinterTest
Running org.apache.commons.lang3.time.FastDatePrinterTest
Tests run: 17, Failures: 0, Errors: 0, Skipped: 0, Time elapsed: 0.005 sec - in org.apache.commons.lang3.time.FastDatePrinterTest
Running org.apache.commons.lang3.time.FastDateParserSDFTest
Tests run: 276, Failures: 144, Errors: 0, Skipped: 92, Time elapsed: 0.151 sec <<< FAILURE! - in org.apache.commons.lang3.time.FastDateParserSDFTest
testUpperCasePP[0: z yyyy GMT 2010 en_GB](org.apache.commons.lang3.time.FastDateParserSDFTest)  Time elapsed: 0.006 sec  <<< FAILURE!
java.lang.AssertionError: en_GB GMT 2010
 expected:<Fri Jan 01 00:00:00 UTC 2010> but was:<Thu Jan 01 00:00:00 UTC 1970>
	at org.junit.Assert.fail(Assert.java:88)
	at org.junit.Assert.failNotEquals(Assert.java:834)
	at org.junit.Assert.assertEquals(Assert.java:118)
	at org.apache.commons.lang3.time.FastDateParserSDFTest.checkParsePosition(FastDateParserSDFTest.java:222)
	at org.apache.commons.lang3.time.FastDateParserSDFTest.testUpperCasePP(FastDateParserSDFTest.java:137)

testUpperCase[0: z yyyy GMT 2010 en_GB](org.apache.commons.lang3.time.FastDateParserSDFTest)  Time elapsed: 0.001 sec  <<< FAILURE!
java.lang.AssertionError: en_GB GMT 2010
 expected:<Fri Jan 01 00:00:00 UTC 2010> but was:<Thu Jan 01 00:00:00 UTC 1970>
	at org.junit.Assert.fail(Assert.java:88)
	at org.junit.Assert.failNotEquals(Assert.java:834)
	at org.junit.Assert.assertEquals(Assert.java:118)
	at org.apache.commons.lang3.time.FastDateParserSDFTest.checkParse(FastDateParserSDFTest.java:187)
	at org.apache.commons.lang3.time.FastDateParserSDFTest.testUpperCase(FastDateParserSDFTest.java:132)

testOriginalPP[0: z yyyy GMT 2010 en_GB](org.apache.commons.lang3.time.FastDateParserSDFTest)  Time elapsed: 0.001 sec  <<< FAILURE!
java.lang.AssertionError: en_GB GMT 2010
 expected:<Fri Jan 01 00:00:00 UTC 2010> but was:<Thu Jan 01 00:00:00 UTC 1970>
	at org.junit.Assert.fail(Assert.java:88)
	at org.junit.Assert.failNotEquals(Assert.java:834)
	at org.junit.Assert.assertEquals(Assert.java:118)
	at org.apache.commons.lang3.time.FastDateParserSDFTest.checkParsePosition(FastDateParserSDFTest.java:222)
	at org.apache.commons.lang3.time.FastDateParserSDFTest.testOriginalPP(FastDateParserSDFTest.java:127)

testOriginal[0: z yyyy GMT 2010 en_GB](org.apache.commons.lang3.time.FastDateParserSDFTest)  Time elapsed: 0.001 sec  <<< FAILURE!
java.lang.AssertionError: en_GB GMT 2010
 expected:<Fri Jan 01 00:00:00 UTC 2010> but was:<Thu Jan 01 00:00:00 UTC 1970>
	at org.junit.Assert.fail(Assert.java:88)
	at org.junit.Assert.failNotEquals(Assert.java:834)
	at org.junit.Assert.assertEquals(Assert.java:118)
	at org.apache.commons.lang3.time.FastDateParserSDFTest.checkParse(FastDateParserSDFTest.java:187)
	at org.apache.commons.lang3.time.FastDateParserSDFTest.testOriginal(FastDateParserSDFTest.java:122)

testUpperCasePP[3: z yyyy GMT-12:34 2010 en_GB](org.apache.commons.lang3.time.FastDateParserSDFTest)  Time elapsed: 0.001 sec  <<< FAILURE!
java.lang.AssertionError: en_GB GMT-12:34 2010
 expected:<Fri Jan 01 12:34:00 UTC 2010> but was:<Thu Jan 01 00:00:00 UTC 1970>
	at org.junit.Assert.fail(Assert.java:88)
	at org.junit.Assert.failNotEquals(Assert.java:834)
	at org.junit.Assert.assertEquals(Assert.java:118)
	at org.apache.commons.lang3.time.FastDateParserSDFTest.checkParsePosition(FastDateParserSDFTest.java:222)
	at org.apache.commons.lang3.time.FastDateParserSDFTest.testUpperCasePP(FastDateParserSDFTest.java:137)

testUpperCase[3: z yyyy GMT-12:34 2010 en_GB](org.apache.commons.lang3.time.FastDateParserSDFTest)  Time elapsed: 0.001 sec  <<< FAILURE!
java.lang.AssertionError: en_GB GMT-12:34 2010
 expected:<Fri Jan 01 12:34:00 UTC 2010> but was:<Thu Jan 01 00:00:00 UTC 1970>
	at org.junit.Assert.fail(Assert.java:88)
	at org.junit.Assert.failNotEquals(Assert.java:834)
	at org.junit.Assert.assertEquals(Assert.java:118)
	at org.apache.commons.lang3.time.FastDateParserSDFTest.checkParse(FastDateParserSDFTest.java:187)
	at org.apache.commons.lang3.time.FastDateParserSDFTest.testUpperCase(FastDateParserSDFTest.java:132)

testOriginalPP[3: z yyyy GMT-12:34 2010 en_GB](org.apache.commons.lang3.time.FastDateParserSDFTest)  Time elapsed: 0.002 sec  <<< FAILURE!
java.lang.AssertionError: en_GB GMT-12:34 2010
 expected:<Fri Jan 01 12:34:00 UTC 2010> but was:<Thu Jan 01 00:00:00 UTC 1970>
	at org.junit.Assert.fail(Assert.java:88)
	at org.junit.Assert.failNotEquals(Assert.java:834)
	at org.junit.Assert.assertEquals(Assert.java:118)
	at org.apache.commons.lang3.time.FastDateParserSDFTest.checkParsePosition(FastDateParserSDFTest.java:222)
	at org.apache.commons.lang3.time.FastDateParserSDFTest.testOriginalPP(FastDateParserSDFTest.java:127)

testOriginal[3: z yyyy GMT-12:34 2010 en_GB](org.apache.commons.lang3.time.FastDateParserSDFTest)  Time elapsed: 0.001 sec  <<< FAILURE!
java.lang.AssertionError: en_GB GMT-12:34 2010
 expected:<Fri Jan 01 12:34:00 UTC 2010> but was:<Thu Jan 01 00:00:00 UTC 1970>
	at org.junit.Assert.fail(Assert.java:88)
	at org.junit.Assert.failNotEquals(Assert.java:834)
	at org.junit.Assert.assertEquals(Assert.java:118)
	at org.apache.commons.lang3.time.FastDateParserSDFTest.checkParse(FastDateParserSDFTest.java:187)
	at org.apache.commons.lang3.time.FastDateParserSDFTest.testOriginal(FastDateParserSDFTest.java:122)

testUpperCasePP[4: z yyyy GMT-1:23 2010 en_GB](org.apache.commons.lang3.time.FastDateParserSDFTest)  Time elapsed: 0.001 sec  <<< FAILURE!
java.lang.AssertionError: en_GB GMT-1:23 2010
 expected:<Fri Jan 01 01:23:00 UTC 2010> but was:<Thu Jan 01 00:00:00 UTC 1970>
	at org.junit.Assert.fail(Assert.java:88)
	at org.junit.Assert.failNotEquals(Assert.java:834)
	at org.junit.Assert.assertEquals(Assert.java:118)
	at org.apache.commons.lang3.time.FastDateParserSDFTest.checkParsePosition(FastDateParserSDFTest.java:222)
	at org.apache.commons.lang3.time.FastDateParserSDFTest.testUpperCasePP(FastDateParserSDFTest.java:137)

testUpperCase[4: z yyyy GMT-1:23 2010 en_GB](org.apache.commons.lang3.time.FastDateParserSDFTest)  Time elapsed: 0.001 sec  <<< FAILURE!
java.lang.AssertionError: en_GB GMT-1:23 2010
 expected:<Fri Jan 01 01:23:00 UTC 2010> but was:<Thu Jan 01 00:00:00 UTC 1970>
	at org.junit.Assert.fail(Assert.java:88)
	at org.junit.Assert.failNotEquals(Assert.java:834)
	at org.junit.Assert.assertEquals(Assert.java:118)
	at org.apache.commons.lang3.time.FastDateParserSDFTest.checkParse(FastDateParserSDFTest.java:187)
	at org.apache.commons.lang3.time.FastDateParserSDFTest.testUpperCase(FastDateParserSDFTest.java:132)

testOriginalPP[4: z yyyy GMT-1:23 2010 en_GB](org.apache.commons.lang3.time.FastDateParserSDFTest)  Time elapsed: 0.001 sec  <<< FAILURE!
java.lang.AssertionError: en_GB GMT-1:23 2010
 expected:<Fri Jan 01 01:23:00 UTC 2010> but was:<Thu Jan 01 00:00:00 UTC 1970>
	at org.junit.Assert.fail(Assert.java:88)
	at org.junit.Assert.failNotEquals(Assert.java:834)
	at org.junit.Assert.assertEquals(Assert.java:118)
	at org.apache.commons.lang3.time.FastDateParserSDFTest.checkParsePosition(FastDateParserSDFTest.java:222)
	at org.apache.commons.lang3.time.FastDateParserSDFTest.testOriginalPP(FastDateParserSDFTest.java:127)

testOriginal[4: z yyyy GMT-1:23 2010 en_GB](org.apache.commons.lang3.time.FastDateParserSDFTest)  Time elapsed: 0 sec  <<< FAILURE!
java.lang.AssertionError: en_GB GMT-1:23 2010
 expected:<Fri Jan 01 01:23:00 UTC 2010> but was:<Thu Jan 01 00:00:00 UTC 1970>
	at org.junit.Assert.fail(Assert.java:88)
	at org.junit.Assert.failNotEquals(Assert.java:834)
	at org.junit.Assert.assertEquals(Assert.java:118)
	at org.apache.commons.lang3.time.FastDateParserSDFTest.checkParse(FastDateParserSDFTest.java:187)
	at org.apache.commons.lang3.time.FastDateParserSDFTest.testOriginal(FastDateParserSDFTest.java:122)

testUpperCasePP[5: z yyyy -1234 2010 en_GB](org.apache.commons.lang3.time.FastDateParserSDFTest)  Time elapsed: 0.001 sec  <<< FAILURE!
java.lang.AssertionError: en_GB -1234 2010
 expected:<Fri Jan 01 12:34:00 UTC 2010> but was:<Thu Jan 01 00:00:00 UTC 1970>
	at org.junit.Assert.fail(Assert.java:88)
	at org.junit.Assert.failNotEquals(Assert.java:834)
	at org.junit.Assert.assertEquals(Assert.java:118)
	at org.apache.commons.lang3.time.FastDateParserSDFTest.checkParsePosition(FastDateParserSDFTest.java:222)
	at org.apache.commons.lang3.time.FastDateParserSDFTest.testUpperCasePP(FastDateParserSDFTest.java:137)

testUpperCase[5: z yyyy -1234 2010 en_GB](org.apache.commons.lang3.time.FastDateParserSDFTest)  Time elapsed: 0 sec  <<< FAILURE!
java.lang.AssertionError: en_GB -1234 2010
 expected:<Fri Jan 01 12:34:00 UTC 2010> but was:<Thu Jan 01 00:00:00 UTC 1970>
	at org.junit.Assert.fail(Assert.java:88)
	at org.junit.Assert.failNotEquals(Assert.java:834)
	at org.junit.Assert.assertEquals(Assert.java:118)
	at org.apache.commons.lang3.time.FastDateParserSDFTest.checkParse(FastDateParserSDFTest.java:187)
	at org.apache.commons.lang3.time.FastDateParserSDFTest.testUpperCase(FastDateParserSDFTest.java:132)

testOriginalPP[5: z yyyy -1234 2010 en_GB](org.apache.commons.lang3.time.FastDateParserSDFTest)  Time elapsed: 0.001 sec  <<< FAILURE!
java.lang.AssertionError: en_GB -1234 2010
 expected:<Fri Jan 01 12:34:00 UTC 2010> but was:<Thu Jan 01 00:00:00 UTC 1970>
	at org.junit.Assert.fail(Assert.java:88)
	at org.junit.Assert.failNotEquals(Assert.java:834)
	at org.junit.Assert.assertEquals(Assert.java:118)
	at org.apache.commons.lang3.time.FastDateParserSDFTest.checkParsePosition(FastDateParserSDFTest.java:222)
	at org.apache.commons.lang3.time.FastDateParserSDFTest.testOriginalPP(FastDateParserSDFTest.java:127)

testOriginal[5: z yyyy -1234 2010 en_GB](org.apache.commons.lang3.time.FastDateParserSDFTest)  Time elapsed: 0.001 sec  <<< FAILURE!
java.lang.AssertionError: en_GB -1234 2010
 expected:<Fri Jan 01 12:34:00 UTC 2010> but was:<Thu Jan 01 00:00:00 UTC 1970>
	at org.junit.Assert.fail(Assert.java:88)
	at org.junit.Assert.failNotEquals(Assert.java:834)
	at org.junit.Assert.assertEquals(Assert.java:118)
	at org.apache.commons.lang3.time.FastDateParserSDFTest.checkParse(FastDateParserSDFTest.java:187)
	at org.apache.commons.lang3.time.FastDateParserSDFTest.testOriginal(FastDateParserSDFTest.java:122)

testUpperCasePP[8: MM/dd/yyyy 01/11/12 en_GB](org.apache.commons.lang3.time.FastDateParserSDFTest)  Time elapsed: 0.001 sec  <<< FAILURE!
java.lang.AssertionError: en_GB 01/11/12
 expected:<Mon Jan 11 00:00:00 UTC 12> but was:<Thu Jan 01 00:00:00 UTC 1970>
	at org.junit.Assert.fail(Assert.java:88)
	at org.junit.Assert.failNotEquals(Assert.java:834)
	at org.junit.Assert.assertEquals(Assert.java:118)
	at org.apache.commons.lang3.time.FastDateParserSDFTest.checkParsePosition(FastDateParserSDFTest.java:222)
	at org.apache.commons.lang3.time.FastDateParserSDFTest.testUpperCasePP(FastDateParserSDFTest.java:137)

testUpperCase[8: MM/dd/yyyy 01/11/12 en_GB](org.apache.commons.lang3.time.FastDateParserSDFTest)  Time elapsed: 0.001 sec  <<< FAILURE!
java.lang.AssertionError: en_GB 01/11/12
 expected:<Mon Jan 11 00:00:00 UTC 12> but was:<Thu Jan 01 00:00:00 UTC 1970>
	at org.junit.Assert.fail(Assert.java:88)
	at org.junit.Assert.failNotEquals(Assert.java:834)
	at org.junit.Assert.assertEquals(Assert.java:118)
	at org.apache.commons.lang3.time.FastDateParserSDFTest.checkParse(FastDateParserSDFTest.java:187)
	at org.apache.commons.lang3.time.FastDateParserSDFTest.testUpperCase(FastDateParserSDFTest.java:132)

testOriginalPP[8: MM/dd/yyyy 01/11/12 en_GB](org.apache.commons.lang3.time.FastDateParserSDFTest)  Time elapsed: 0.001 sec  <<< FAILURE!
java.lang.AssertionError: en_GB 01/11/12
 expected:<Mon Jan 11 00:00:00 UTC 12> but was:<Thu Jan 01 00:00:00 UTC 1970>
	at org.junit.Assert.fail(Assert.java:88)
	at org.junit.Assert.failNotEquals(Assert.java:834)
	at org.junit.Assert.assertEquals(Assert.java:118)
	at org.apache.commons.lang3.time.FastDateParserSDFTest.checkParsePosition(FastDateParserSDFTest.java:222)
	at org.apache.commons.lang3.time.FastDateParserSDFTest.testOriginalPP(FastDateParserSDFTest.java:127)

testOriginal[8: MM/dd/yyyy 01/11/12 en_GB](org.apache.commons.lang3.time.FastDateParserSDFTest)  Time elapsed: 0.001 sec  <<< FAILURE!
java.lang.AssertionError: en_GB 01/11/12
 expected:<Mon Jan 11 00:00:00 UTC 12> but was:<Thu Jan 01 00:00:00 UTC 1970>
	at org.junit.Assert.fail(Assert.java:88)
	at org.junit.Assert.failNotEquals(Assert.java:834)
	at org.junit.Assert.assertEquals(Assert.java:118)
	at org.apache.commons.lang3.time.FastDateParserSDFTest.checkParse(FastDateParserSDFTest.java:187)
	at org.apache.commons.lang3.time.FastDateParserSDFTest.testOriginal(FastDateParserSDFTest.java:122)

testUpperCasePP[9: MM/dd/yy 01/11/12 en_GB](org.apache.commons.lang3.time.FastDateParserSDFTest)  Time elapsed: 0.001 sec  <<< FAILURE!
java.lang.AssertionError: en_GB 01/11/12
 expected:<Wed Jan 11 00:00:00 UTC 2012> but was:<Thu Jan 01 00:00:00 UTC 1970>
	at org.junit.Assert.fail(Assert.java:88)
	at org.junit.Assert.failNotEquals(Assert.java:834)
	at org.junit.Assert.assertEquals(Assert.java:118)
	at org.apache.commons.lang3.time.FastDateParserSDFTest.checkParsePosition(FastDateParserSDFTest.java:222)
	at org.apache.commons.lang3.time.FastDateParserSDFTest.testUpperCasePP(FastDateParserSDFTest.java:137)

testUpperCase[9: MM/dd/yy 01/11/12 en_GB](org.apache.commons.lang3.time.FastDateParserSDFTest)  Time elapsed: 0 sec  <<< FAILURE!
java.lang.AssertionError: en_GB 01/11/12
 expected:<Wed Jan 11 00:00:00 UTC 2012> but was:<Thu Jan 01 00:00:00 UTC 1970>
	at org.junit.Assert.fail(Assert.java:88)
	at org.junit.Assert.failNotEquals(Assert.java:834)
	at org.junit.Assert.assertEquals(Assert.java:118)
	at org.apache.commons.lang3.time.FastDateParserSDFTest.checkParse(FastDateParserSDFTest.java:187)
	at org.apache.commons.lang3.time.FastDateParserSDFTest.testUpperCase(FastDateParserSDFTest.java:132)

testOriginalPP[9: MM/dd/yy 01/11/12 en_GB](org.apache.commons.lang3.time.FastDateParserSDFTest)  Time elapsed: 0 sec  <<< FAILURE!
java.lang.AssertionError: en_GB 01/11/12
 expected:<Wed Jan 11 00:00:00 UTC 2012> but was:<Thu Jan 01 00:00:00 UTC 1970>
	at org.junit.Assert.fail(Assert.java:88)
	at org.junit.Assert.failNotEquals(Assert.java:834)
	at org.junit.Assert.assertEquals(Assert.java:118)
	at org.apache.commons.lang3.time.FastDateParserSDFTest.checkParsePosition(FastDateParserSDFTest.java:222)
	at org.apache.commons.lang3.time.FastDateParserSDFTest.testOriginalPP(FastDateParserSDFTest.java:127)

testOriginal[9: MM/dd/yy 01/11/12 en_GB](org.apache.commons.lang3.time.FastDateParserSDFTest)  Time elapsed: 0.001 sec  <<< FAILURE!
java.lang.AssertionError: en_GB 01/11/12
 expected:<Wed Jan 11 00:00:00 UTC 2012> but was:<Thu Jan 01 00:00:00 UTC 1970>
	at org.junit.Assert.fail(Assert.java:88)
	at org.junit.Assert.failNotEquals(Assert.java:834)
	at org.junit.Assert.assertEquals(Assert.java:118)
	at org.apache.commons.lang3.time.FastDateParserSDFTest.checkParse(FastDateParserSDFTest.java:187)
	at org.apache.commons.lang3.time.FastDateParserSDFTest.testOriginal(FastDateParserSDFTest.java:122)

testUpperCasePP[14: HH 01 en_GB](org.apache.commons.lang3.time.FastDateParserSDFTest)  Time elapsed: 0.001 sec  <<< FAILURE!
java.lang.AssertionError: en_GB 01
 expected:<Thu Jan 01 01:00:00 UTC 1970> but was:<Thu Jan 01 00:00:00 UTC 1970>
	at org.junit.Assert.fail(Assert.java:88)
	at org.junit.Assert.failNotEquals(Assert.java:834)
	at org.junit.Assert.assertEquals(Assert.java:118)
	at org.apache.commons.lang3.time.FastDateParserSDFTest.checkParsePosition(FastDateParserSDFTest.java:222)
	at org.apache.commons.lang3.time.FastDateParserSDFTest.testUpperCasePP(FastDateParserSDFTest.java:137)

testUpperCase[14: HH 01 en_GB](org.apache.commons.lang3.time.FastDateParserSDFTest)  Time elapsed: 0 sec  <<< FAILURE!
java.lang.AssertionError: en_GB 01
 expected:<Thu Jan 01 01:00:00 UTC 1970> but was:<Thu Jan 01 00:00:00 UTC 1970>
	at org.junit.Assert.fail(Assert.java:88)
	at org.junit.Assert.failNotEquals(Assert.java:834)
	at org.junit.Assert.assertEquals(Assert.java:118)
	at org.apache.commons.lang3.time.FastDateParserSDFTest.checkParse(FastDateParserSDFTest.java:187)
	at org.apache.commons.lang3.time.FastDateParserSDFTest.testUpperCase(FastDateParserSDFTest.java:132)

testOriginalPP[14: HH 01 en_GB](org.apache.commons.lang3.time.FastDateParserSDFTest)  Time elapsed: 0 sec  <<< FAILURE!
java.lang.AssertionError: en_GB 01
 expected:<Thu Jan 01 01:00:00 UTC 1970> but was:<Thu Jan 01 00:00:00 UTC 1970>
	at org.junit.Assert.fail(Assert.java:88)
	at org.junit.Assert.failNotEquals(Assert.java:834)
	at org.junit.Assert.assertEquals(Assert.java:118)
	at org.apache.commons.lang3.time.FastDateParserSDFTest.checkParsePosition(FastDateParserSDFTest.java:222)
	at org.apache.commons.lang3.time.FastDateParserSDFTest.testOriginalPP(FastDateParserSDFTest.java:127)

testOriginal[14: HH 01 en_GB](org.apache.commons.lang3.time.FastDateParserSDFTest)  Time elapsed: 0.001 sec  <<< FAILURE!
java.lang.AssertionError: en_GB 01
 expected:<Thu Jan 01 01:00:00 UTC 1970> but was:<Thu Jan 01 00:00:00 UTC 1970>
	at org.junit.Assert.fail(Assert.java:88)
	at org.junit.Assert.failNotEquals(Assert.java:834)
	at org.junit.Assert.assertEquals(Assert.java:118)
	at org.apache.commons.lang3.time.FastDateParserSDFTest.checkParse(FastDateParserSDFTest.java:187)
	at org.apache.commons.lang3.time.FastDateParserSDFTest.testOriginal(FastDateParserSDFTest.java:122)

testUpperCasePP[15: KK 01 en_GB](org.apache.commons.lang3.time.FastDateParserSDFTest)  Time elapsed: 0.001 sec  <<< FAILURE!
java.lang.AssertionError: en_GB 01
 expected:<Thu Jan 01 01:00:00 UTC 1970> but was:<Thu Jan 01 00:00:00 UTC 1970>
	at org.junit.Assert.fail(Assert.java:88)
	at org.junit.Assert.failNotEquals(Assert.java:834)
	at org.junit.Assert.assertEquals(Assert.java:118)
	at org.apache.commons.lang3.time.FastDateParserSDFTest.checkParsePosition(FastDateParserSDFTest.java:222)
	at org.apache.commons.lang3.time.FastDateParserSDFTest.testUpperCasePP(FastDateParserSDFTest.java:137)

testUpperCase[15: KK 01 en_GB](org.apache.commons.lang3.time.FastDateParserSDFTest)  Time elapsed: 0 sec  <<< FAILURE!
java.lang.AssertionError: en_GB 01
 expected:<Thu Jan 01 01:00:00 UTC 1970> but was:<Thu Jan 01 00:00:00 UTC 1970>
	at org.junit.Assert.fail(Assert.java:88)
	at org.junit.Assert.failNotEquals(Assert.java:834)
	at org.junit.Assert.assertEquals(Assert.java:118)
	at org.apache.commons.lang3.time.FastDateParserSDFTest.checkParse(FastDateParserSDFTest.java:187)
	at org.apache.commons.lang3.time.FastDateParserSDFTest.testUpperCase(FastDateParserSDFTest.java:132)

testOriginalPP[15: KK 01 en_GB](org.apache.commons.lang3.time.FastDateParserSDFTest)  Time elapsed: 0 sec  <<< FAILURE!
java.lang.AssertionError: en_GB 01
 expected:<Thu Jan 01 01:00:00 UTC 1970> but was:<Thu Jan 01 00:00:00 UTC 1970>
	at org.junit.Assert.fail(Assert.java:88)
	at org.junit.Assert.failNotEquals(Assert.java:834)
	at org.junit.Assert.assertEquals(Assert.java:118)
	at org.apache.commons.lang3.time.FastDateParserSDFTest.checkParsePosition(FastDateParserSDFTest.java:222)
	at org.apache.commons.lang3.time.FastDateParserSDFTest.testOriginalPP(FastDateParserSDFTest.java:127)

testOriginal[15: KK 01 en_GB](org.apache.commons.lang3.time.FastDateParserSDFTest)  Time elapsed: 0 sec  <<< FAILURE!
java.lang.AssertionError: en_GB 01
 expected:<Thu Jan 01 01:00:00 UTC 1970> but was:<Thu Jan 01 00:00:00 UTC 1970>
	at org.junit.Assert.fail(Assert.java:88)
	at org.junit.Assert.failNotEquals(Assert.java:834)
	at org.junit.Assert.assertEquals(Assert.java:118)
	at org.apache.commons.lang3.time.FastDateParserSDFTest.checkParse(FastDateParserSDFTest.java:187)
	at org.apache.commons.lang3.time.FastDateParserSDFTest.testOriginal(FastDateParserSDFTest.java:122)

testUpperCasePP[16: hh 01 en_GB](org.apache.commons.lang3.time.FastDateParserSDFTest)  Time elapsed: 0 sec  <<< FAILURE!
java.lang.AssertionError: en_GB 01
 expected:<Thu Jan 01 01:00:00 UTC 1970> but was:<Thu Jan 01 00:00:00 UTC 1970>
	at org.junit.Assert.fail(Assert.java:88)
	at org.junit.Assert.failNotEquals(Assert.java:834)
	at org.junit.Assert.assertEquals(Assert.java:118)
	at org.apache.commons.lang3.time.FastDateParserSDFTest.checkParsePosition(FastDateParserSDFTest.java:222)
	at org.apache.commons.lang3.time.FastDateParserSDFTest.testUpperCasePP(FastDateParserSDFTest.java:137)

testUpperCase[16: hh 01 en_GB](org.apache.commons.lang3.time.FastDateParserSDFTest)  Time elapsed: 0.001 sec  <<< FAILURE!
java.lang.AssertionError: en_GB 01
 expected:<Thu Jan 01 01:00:00 UTC 1970> but was:<Thu Jan 01 00:00:00 UTC 1970>
	at org.junit.Assert.fail(Assert.java:88)
	at org.junit.Assert.failNotEquals(Assert.java:834)
	at org.junit.Assert.assertEquals(Assert.java:118)
	at org.apache.commons.lang3.time.FastDateParserSDFTest.checkParse(FastDateParserSDFTest.java:187)
	at org.apache.commons.lang3.time.FastDateParserSDFTest.testUpperCase(FastDateParserSDFTest.java:132)

testOriginalPP[16: hh 01 en_GB](org.apache.commons.lang3.time.FastDateParserSDFTest)  Time elapsed: 0.001 sec  <<< FAILURE!
java.lang.AssertionError: en_GB 01
 expected:<Thu Jan 01 01:00:00 UTC 1970> but was:<Thu Jan 01 00:00:00 UTC 1970>
	at org.junit.Assert.fail(Assert.java:88)
	at org.junit.Assert.failNotEquals(Assert.java:834)
	at org.junit.Assert.assertEquals(Assert.java:118)
	at org.apache.commons.lang3.time.FastDateParserSDFTest.checkParsePosition(FastDateParserSDFTest.java:222)
	at org.apache.commons.lang3.time.FastDateParserSDFTest.testOriginalPP(FastDateParserSDFTest.java:127)

testOriginal[16: hh 01 en_GB](org.apache.commons.lang3.time.FastDateParserSDFTest)  Time elapsed: 0 sec  <<< FAILURE!
java.lang.AssertionError: en_GB 01
 expected:<Thu Jan 01 01:00:00 UTC 1970> but was:<Thu Jan 01 00:00:00 UTC 1970>
	at org.junit.Assert.fail(Assert.java:88)
	at org.junit.Assert.failNotEquals(Assert.java:834)
	at org.junit.Assert.assertEquals(Assert.java:118)
	at org.apache.commons.lang3.time.FastDateParserSDFTest.checkParse(FastDateParserSDFTest.java:187)
	at org.apache.commons.lang3.time.FastDateParserSDFTest.testOriginal(FastDateParserSDFTest.java:122)

testUpperCasePP[17: kk 01 en_GB](org.apache.commons.lang3.time.FastDateParserSDFTest)  Time elapsed: 0 sec  <<< FAILURE!
java.lang.AssertionError: en_GB 01
 expected:<Thu Jan 01 01:00:00 UTC 1970> but was:<Thu Jan 01 00:00:00 UTC 1970>
	at org.junit.Assert.fail(Assert.java:88)
	at org.junit.Assert.failNotEquals(Assert.java:834)
	at org.junit.Assert.assertEquals(Assert.java:118)
	at org.apache.commons.lang3.time.FastDateParserSDFTest.checkParsePosition(FastDateParserSDFTest.java:222)
	at org.apache.commons.lang3.time.FastDateParserSDFTest.testUpperCasePP(FastDateParserSDFTest.java:137)

testUpperCase[17: kk 01 en_GB](org.apache.commons.lang3.time.FastDateParserSDFTest)  Time elapsed: 0 sec  <<< FAILURE!
java.lang.AssertionError: en_GB 01
 expected:<Thu Jan 01 01:00:00 UTC 1970> but was:<Thu Jan 01 00:00:00 UTC 1970>
	at org.junit.Assert.fail(Assert.java:88)
	at org.junit.Assert.failNotEquals(Assert.java:834)
	at org.junit.Assert.assertEquals(Assert.java:118)
	at org.apache.commons.lang3.time.FastDateParserSDFTest.checkParse(FastDateParserSDFTest.java:187)
	at org.apache.commons.lang3.time.FastDateParserSDFTest.testUpperCase(FastDateParserSDFTest.java:132)

testOriginalPP[17: kk 01 en_GB](org.apache.commons.lang3.time.FastDateParserSDFTest)  Time elapsed: 0.001 sec  <<< FAILURE!
java.lang.AssertionError: en_GB 01
 expected:<Thu Jan 01 01:00:00 UTC 1970> but was:<Thu Jan 01 00:00:00 UTC 1970>
	at org.junit.Assert.fail(Assert.java:88)
	at org.junit.Assert.failNotEquals(Assert.java:834)
	at org.junit.Assert.assertEquals(Assert.java:118)
	at org.apache.commons.lang3.time.FastDateParserSDFTest.checkParsePosition(FastDateParserSDFTest.java:222)
	at org.apache.commons.lang3.time.FastDateParserSDFTest.testOriginalPP(FastDateParserSDFTest.java:127)

testOriginal[17: kk 01 en_GB](org.apache.commons.lang3.time.FastDateParserSDFTest)  Time elapsed: 0.001 sec  <<< FAILURE!
java.lang.AssertionError: en_GB 01
 expected:<Thu Jan 01 01:00:00 UTC 1970> but was:<Thu Jan 01 00:00:00 UTC 1970>
	at org.junit.Assert.fail(Assert.java:88)
	at org.junit.Assert.failNotEquals(Assert.java:834)
	at org.junit.Assert.assertEquals(Assert.java:118)
	at org.apache.commons.lang3.time.FastDateParserSDFTest.checkParse(FastDateParserSDFTest.java:187)
	at org.apache.commons.lang3.time.FastDateParserSDFTest.testOriginal(FastDateParserSDFTest.java:122)

testUpperCasePP[18: HH 11 en_GB](org.apache.commons.lang3.time.FastDateParserSDFTest)  Time elapsed: 0.001 sec  <<< FAILURE!
java.lang.AssertionError: en_GB 11
 expected:<Thu Jan 01 11:00:00 UTC 1970> but was:<Thu Jan 01 00:00:00 UTC 1970>
	at org.junit.Assert.fail(Assert.java:88)
	at org.junit.Assert.failNotEquals(Assert.java:834)
	at org.junit.Assert.assertEquals(Assert.java:118)
	at org.apache.commons.lang3.time.FastDateParserSDFTest.checkParsePosition(FastDateParserSDFTest.java:222)
	at org.apache.commons.lang3.time.FastDateParserSDFTest.testUpperCasePP(FastDateParserSDFTest.java:137)

testUpperCase[18: HH 11 en_GB](org.apache.commons.lang3.time.FastDateParserSDFTest)  Time elapsed: 0.001 sec  <<< FAILURE!
java.lang.AssertionError: en_GB 11
 expected:<Thu Jan 01 11:00:00 UTC 1970> but was:<Thu Jan 01 00:00:00 UTC 1970>
	at org.junit.Assert.fail(Assert.java:88)
	at org.junit.Assert.failNotEquals(Assert.java:834)
	at org.junit.Assert.assertEquals(Assert.java:118)
	at org.apache.commons.lang3.time.FastDateParserSDFTest.checkParse(FastDateParserSDFTest.java:187)
	at org.apache.commons.lang3.time.FastDateParserSDFTest.testUpperCase(FastDateParserSDFTest.java:132)

testOriginalPP[18: HH 11 en_GB](org.apache.commons.lang3.time.FastDateParserSDFTest)  Time elapsed: 0 sec  <<< FAILURE!
java.lang.AssertionError: en_GB 11
 expected:<Thu Jan 01 11:00:00 UTC 1970> but was:<Thu Jan 01 00:00:00 UTC 1970>
	at org.junit.Assert.fail(Assert.java:88)
	at org.junit.Assert.failNotEquals(Assert.java:834)
	at org.junit.Assert.assertEquals(Assert.java:118)
	at org.apache.commons.lang3.time.FastDateParserSDFTest.checkParsePosition(FastDateParserSDFTest.java:222)
	at org.apache.commons.lang3.time.FastDateParserSDFTest.testOriginalPP(FastDateParserSDFTest.java:127)

testOriginal[18: HH 11 en_GB](org.apache.commons.lang3.time.FastDateParserSDFTest)  Time elapsed: 0 sec  <<< FAILURE!
java.lang.AssertionError: en_GB 11
 expected:<Thu Jan 01 11:00:00 UTC 1970> but was:<Thu Jan 01 00:00:00 UTC 1970>
	at org.junit.Assert.fail(Assert.java:88)
	at org.junit.Assert.failNotEquals(Assert.java:834)
	at org.junit.Assert.assertEquals(Assert.java:118)
	at org.apache.commons.lang3.time.FastDateParserSDFTest.checkParse(FastDateParserSDFTest.java:187)
	at org.apache.commons.lang3.time.FastDateParserSDFTest.testOriginal(FastDateParserSDFTest.java:122)

testUpperCasePP[19: KK 11 en_GB](org.apache.commons.lang3.time.FastDateParserSDFTest)  Time elapsed: 0.001 sec  <<< FAILURE!
java.lang.AssertionError: en_GB 11
 expected:<Thu Jan 01 11:00:00 UTC 1970> but was:<Thu Jan 01 00:00:00 UTC 1970>
	at org.junit.Assert.fail(Assert.java:88)
	at org.junit.Assert.failNotEquals(Assert.java:834)
	at org.junit.Assert.assertEquals(Assert.java:118)
	at org.apache.commons.lang3.time.FastDateParserSDFTest.checkParsePosition(FastDateParserSDFTest.java:222)
	at org.apache.commons.lang3.time.FastDateParserSDFTest.testUpperCasePP(FastDateParserSDFTest.java:137)

testUpperCase[19: KK 11 en_GB](org.apache.commons.lang3.time.FastDateParserSDFTest)  Time elapsed: 0.001 sec  <<< FAILURE!
java.lang.AssertionError: en_GB 11
 expected:<Thu Jan 01 11:00:00 UTC 1970> but was:<Thu Jan 01 00:00:00 UTC 1970>
	at org.junit.Assert.fail(Assert.java:88)
	at org.junit.Assert.failNotEquals(Assert.java:834)
	at org.junit.Assert.assertEquals(Assert.java:118)
	at org.apache.commons.lang3.time.FastDateParserSDFTest.checkParse(FastDateParserSDFTest.java:187)
	at org.apache.commons.lang3.time.FastDateParserSDFTest.testUpperCase(FastDateParserSDFTest.java:132)

testOriginalPP[19: KK 11 en_GB](org.apache.commons.lang3.time.FastDateParserSDFTest)  Time elapsed: 0.001 sec  <<< FAILURE!
java.lang.AssertionError: en_GB 11
 expected:<Thu Jan 01 11:00:00 UTC 1970> but was:<Thu Jan 01 00:00:00 UTC 1970>
	at org.junit.Assert.fail(Assert.java:88)
	at org.junit.Assert.failNotEquals(Assert.java:834)
	at org.junit.Assert.assertEquals(Assert.java:118)
	at org.apache.commons.lang3.time.FastDateParserSDFTest.checkParsePosition(FastDateParserSDFTest.java:222)
	at org.apache.commons.lang3.time.FastDateParserSDFTest.testOriginalPP(FastDateParserSDFTest.java:127)

testOriginal[19: KK 11 en_GB](org.apache.commons.lang3.time.FastDateParserSDFTest)  Time elapsed: 0 sec  <<< FAILURE!
java.lang.AssertionError: en_GB 11
 expected:<Thu Jan 01 11:00:00 UTC 1970> but was:<Thu Jan 01 00:00:00 UTC 1970>
	at org.junit.Assert.fail(Assert.java:88)
	at org.junit.Assert.failNotEquals(Assert.java:834)
	at org.junit.Assert.assertEquals(Assert.java:118)
	at org.apache.commons.lang3.time.FastDateParserSDFTest.checkParse(FastDateParserSDFTest.java:187)
	at org.apache.commons.lang3.time.FastDateParserSDFTest.testOriginal(FastDateParserSDFTest.java:122)

testUpperCasePP[20: hh 11 en_GB](org.apache.commons.lang3.time.FastDateParserSDFTest)  Time elapsed: 0 sec  <<< FAILURE!
java.lang.AssertionError: en_GB 11
 expected:<Thu Jan 01 11:00:00 UTC 1970> but was:<Thu Jan 01 00:00:00 UTC 1970>
	at org.junit.Assert.fail(Assert.java:88)
	at org.junit.Assert.failNotEquals(Assert.java:834)
	at org.junit.Assert.assertEquals(Assert.java:118)
	at org.apache.commons.lang3.time.FastDateParserSDFTest.checkParsePosition(FastDateParserSDFTest.java:222)
	at org.apache.commons.lang3.time.FastDateParserSDFTest.testUpperCasePP(FastDateParserSDFTest.java:137)

testUpperCase[20: hh 11 en_GB](org.apache.commons.lang3.time.FastDateParserSDFTest)  Time elapsed: 0 sec  <<< FAILURE!
java.lang.AssertionError: en_GB 11
 expected:<Thu Jan 01 11:00:00 UTC 1970> but was:<Thu Jan 01 00:00:00 UTC 1970>
	at org.junit.Assert.fail(Assert.java:88)
	at org.junit.Assert.failNotEquals(Assert.java:834)
	at org.junit.Assert.assertEquals(Assert.java:118)
	at org.apache.commons.lang3.time.FastDateParserSDFTest.checkParse(FastDateParserSDFTest.java:187)
	at org.apache.commons.lang3.time.FastDateParserSDFTest.testUpperCase(FastDateParserSDFTest.java:132)

testOriginalPP[20: hh 11 en_GB](org.apache.commons.lang3.time.FastDateParserSDFTest)  Time elapsed: 0.001 sec  <<< FAILURE!
java.lang.AssertionError: en_GB 11
 expected:<Thu Jan 01 11:00:00 UTC 1970> but was:<Thu Jan 01 00:00:00 UTC 1970>
	at org.junit.Assert.fail(Assert.java:88)
	at org.junit.Assert.failNotEquals(Assert.java:834)
	at org.junit.Assert.assertEquals(Assert.java:118)
	at org.apache.commons.lang3.time.FastDateParserSDFTest.checkParsePosition(FastDateParserSDFTest.java:222)
	at org.apache.commons.lang3.time.FastDateParserSDFTest.testOriginalPP(FastDateParserSDFTest.java:127)

testOriginal[20: hh 11 en_GB](org.apache.commons.lang3.time.FastDateParserSDFTest)  Time elapsed: 0 sec  <<< FAILURE!
java.lang.AssertionError: en_GB 11
 expected:<Thu Jan 01 11:00:00 UTC 1970> but was:<Thu Jan 01 00:00:00 UTC 1970>
	at org.junit.Assert.fail(Assert.java:88)
	at org.junit.Assert.failNotEquals(Assert.java:834)
	at org.junit.Assert.assertEquals(Assert.java:118)
	at org.apache.commons.lang3.time.FastDateParserSDFTest.checkParse(FastDateParserSDFTest.java:187)
	at org.apache.commons.lang3.time.FastDateParserSDFTest.testOriginal(FastDateParserSDFTest.java:122)

testUpperCasePP[21: kk 11 en_GB](org.apache.commons.lang3.time.FastDateParserSDFTest)  Time elapsed: 0 sec  <<< FAILURE!
java.lang.AssertionError: en_GB 11
 expected:<Thu Jan 01 11:00:00 UTC 1970> but was:<Thu Jan 01 00:00:00 UTC 1970>
	at org.junit.Assert.fail(Assert.java:88)
	at org.junit.Assert.failNotEquals(Assert.java:834)
	at org.junit.Assert.assertEquals(Assert.java:118)
	at org.apache.commons.lang3.time.FastDateParserSDFTest.checkParsePosition(FastDateParserSDFTest.java:222)
	at org.apache.commons.lang3.time.FastDateParserSDFTest.testUpperCasePP(FastDateParserSDFTest.java:137)

testUpperCase[21: kk 11 en_GB](org.apache.commons.lang3.time.FastDateParserSDFTest)  Time elapsed: 0 sec  <<< FAILURE!
java.lang.AssertionError: en_GB 11
 expected:<Thu Jan 01 11:00:00 UTC 1970> but was:<Thu Jan 01 00:00:00 UTC 1970>
	at org.junit.Assert.fail(Assert.java:88)
	at org.junit.Assert.failNotEquals(Assert.java:834)
	at org.junit.Assert.assertEquals(Assert.java:118)
	at org.apache.commons.lang3.time.FastDateParserSDFTest.checkParse(FastDateParserSDFTest.java:187)
	at org.apache.commons.lang3.time.FastDateParserSDFTest.testUpperCase(FastDateParserSDFTest.java:132)

testOriginalPP[21: kk 11 en_GB](org.apache.commons.lang3.time.FastDateParserSDFTest)  Time elapsed: 0.001 sec  <<< FAILURE!
java.lang.AssertionError: en_GB 11
 expected:<Thu Jan 01 11:00:00 UTC 1970> but was:<Thu Jan 01 00:00:00 UTC 1970>
	at org.junit.Assert.fail(Assert.java:88)
	at org.junit.Assert.failNotEquals(Assert.java:834)
	at org.junit.Assert.assertEquals(Assert.java:118)
	at org.apache.commons.lang3.time.FastDateParserSDFTest.checkParsePosition(FastDateParserSDFTest.java:222)
	at org.apache.commons.lang3.time.FastDateParserSDFTest.testOriginalPP(FastDateParserSDFTest.java:127)

testOriginal[21: kk 11 en_GB](org.apache.commons.lang3.time.FastDateParserSDFTest)  Time elapsed: 0 sec  <<< FAILURE!
java.lang.AssertionError: en_GB 11
 expected:<Thu Jan 01 11:00:00 UTC 1970> but was:<Thu Jan 01 00:00:00 UTC 1970>
	at org.junit.Assert.fail(Assert.java:88)
	at org.junit.Assert.failNotEquals(Assert.java:834)
	at org.junit.Assert.assertEquals(Assert.java:118)
	at org.apache.commons.lang3.time.FastDateParserSDFTest.checkParse(FastDateParserSDFTest.java:187)
	at org.apache.commons.lang3.time.FastDateParserSDFTest.testOriginal(FastDateParserSDFTest.java:122)

testUpperCasePP[22: HH 12 en_GB](org.apache.commons.lang3.time.FastDateParserSDFTest)  Time elapsed: 0.001 sec  <<< FAILURE!
java.lang.AssertionError: en_GB 12
 expected:<Thu Jan 01 12:00:00 UTC 1970> but was:<Thu Jan 01 00:00:00 UTC 1970>
	at org.junit.Assert.fail(Assert.java:88)
	at org.junit.Assert.failNotEquals(Assert.java:834)
	at org.junit.Assert.assertEquals(Assert.java:118)
	at org.apache.commons.lang3.time.FastDateParserSDFTest.checkParsePosition(FastDateParserSDFTest.java:222)
	at org.apache.commons.lang3.time.FastDateParserSDFTest.testUpperCasePP(FastDateParserSDFTest.java:137)

testUpperCase[22: HH 12 en_GB](org.apache.commons.lang3.time.FastDateParserSDFTest)  Time elapsed: 0 sec  <<< FAILURE!
java.lang.AssertionError: en_GB 12
 expected:<Thu Jan 01 12:00:00 UTC 1970> but was:<Thu Jan 01 00:00:00 UTC 1970>
	at org.junit.Assert.fail(Assert.java:88)
	at org.junit.Assert.failNotEquals(Assert.java:834)
	at org.junit.Assert.assertEquals(Assert.java:118)
	at org.apache.commons.lang3.time.FastDateParserSDFTest.checkParse(FastDateParserSDFTest.java:187)
	at org.apache.commons.lang3.time.FastDateParserSDFTest.testUpperCase(FastDateParserSDFTest.java:132)

testOriginalPP[22: HH 12 en_GB](org.apache.commons.lang3.time.FastDateParserSDFTest)  Time elapsed: 0 sec  <<< FAILURE!
java.lang.AssertionError: en_GB 12
 expected:<Thu Jan 01 12:00:00 UTC 1970> but was:<Thu Jan 01 00:00:00 UTC 1970>
	at org.junit.Assert.fail(Assert.java:88)
	at org.junit.Assert.failNotEquals(Assert.java:834)
	at org.junit.Assert.assertEquals(Assert.java:118)
	at org.apache.commons.lang3.time.FastDateParserSDFTest.checkParsePosition(FastDateParserSDFTest.java:222)
	at org.apache.commons.lang3.time.FastDateParserSDFTest.testOriginalPP(FastDateParserSDFTest.java:127)

testOriginal[22: HH 12 en_GB](org.apache.commons.lang3.time.FastDateParserSDFTest)  Time elapsed: 0.001 sec  <<< FAILURE!
java.lang.AssertionError: en_GB 12
 expected:<Thu Jan 01 12:00:00 UTC 1970> but was:<Thu Jan 01 00:00:00 UTC 1970>
	at org.junit.Assert.fail(Assert.java:88)
	at org.junit.Assert.failNotEquals(Assert.java:834)
	at org.junit.Assert.assertEquals(Assert.java:118)
	at org.apache.commons.lang3.time.FastDateParserSDFTest.checkParse(FastDateParserSDFTest.java:187)
	at org.apache.commons.lang3.time.FastDateParserSDFTest.testOriginal(FastDateParserSDFTest.java:122)

testUpperCasePP[23: KK 12 en_GB](org.apache.commons.lang3.time.FastDateParserSDFTest)  Time elapsed: 0 sec  <<< FAILURE!
java.lang.AssertionError: en_GB 12
 expected:<Thu Jan 01 12:00:00 UTC 1970> but was:<Thu Jan 01 00:00:00 UTC 1970>
	at org.junit.Assert.fail(Assert.java:88)
	at org.junit.Assert.failNotEquals(Assert.java:834)
	at org.junit.Assert.assertEquals(Assert.java:118)
	at org.apache.commons.lang3.time.FastDateParserSDFTest.checkParsePosition(FastDateParserSDFTest.java:222)
	at org.apache.commons.lang3.time.FastDateParserSDFTest.testUpperCasePP(FastDateParserSDFTest.java:137)

testUpperCase[23: KK 12 en_GB](org.apache.commons.lang3.time.FastDateParserSDFTest)  Time elapsed: 0.001 sec  <<< FAILURE!
java.lang.AssertionError: en_GB 12
 expected:<Thu Jan 01 12:00:00 UTC 1970> but was:<Thu Jan 01 00:00:00 UTC 1970>
	at org.junit.Assert.fail(Assert.java:88)
	at org.junit.Assert.failNotEquals(Assert.java:834)
	at org.junit.Assert.assertEquals(Assert.java:118)
	at org.apache.commons.lang3.time.FastDateParserSDFTest.checkParse(FastDateParserSDFTest.java:187)
	at org.apache.commons.lang3.time.FastDateParserSDFTest.testUpperCase(FastDateParserSDFTest.java:132)

testOriginalPP[23: KK 12 en_GB](org.apache.commons.lang3.time.FastDateParserSDFTest)  Time elapsed: 0 sec  <<< FAILURE!
java.lang.AssertionError: en_GB 12
 expected:<Thu Jan 01 12:00:00 UTC 1970> but was:<Thu Jan 01 00:00:00 UTC 1970>
	at org.junit.Assert.fail(Assert.java:88)
	at org.junit.Assert.failNotEquals(Assert.java:834)
	at org.junit.Assert.assertEquals(Assert.java:118)
	at org.apache.commons.lang3.time.FastDateParserSDFTest.checkParsePosition(FastDateParserSDFTest.java:222)
	at org.apache.commons.lang3.time.FastDateParserSDFTest.testOriginalPP(FastDateParserSDFTest.java:127)

testOriginal[23: KK 12 en_GB](org.apache.commons.lang3.time.FastDateParserSDFTest)  Time elapsed: 0 sec  <<< FAILURE!
java.lang.AssertionError: en_GB 12
 expected:<Thu Jan 01 12:00:00 UTC 1970> but was:<Thu Jan 01 00:00:00 UTC 1970>
	at org.junit.Assert.fail(Assert.java:88)
	at org.junit.Assert.failNotEquals(Assert.java:834)
	at org.junit.Assert.assertEquals(Assert.java:118)
	at org.apache.commons.lang3.time.FastDateParserSDFTest.checkParse(FastDateParserSDFTest.java:187)
	at org.apache.commons.lang3.time.FastDateParserSDFTest.testOriginal(FastDateParserSDFTest.java:122)

testUpperCasePP[25: kk 12 en_GB](org.apache.commons.lang3.time.FastDateParserSDFTest)  Time elapsed: 0 sec  <<< FAILURE!
java.lang.AssertionError: en_GB 12
 expected:<Thu Jan 01 12:00:00 UTC 1970> but was:<Thu Jan 01 00:00:00 UTC 1970>
	at org.junit.Assert.fail(Assert.java:88)
	at org.junit.Assert.failNotEquals(Assert.java:834)
	at org.junit.Assert.assertEquals(Assert.java:118)
	at org.apache.commons.lang3.time.FastDateParserSDFTest.checkParsePosition(FastDateParserSDFTest.java:222)
	at org.apache.commons.lang3.time.FastDateParserSDFTest.testUpperCasePP(FastDateParserSDFTest.java:137)

testUpperCase[25: kk 12 en_GB](org.apache.commons.lang3.time.FastDateParserSDFTest)  Time elapsed: 0 sec  <<< FAILURE!
java.lang.AssertionError: en_GB 12
 expected:<Thu Jan 01 12:00:00 UTC 1970> but was:<Thu Jan 01 00:00:00 UTC 1970>
	at org.junit.Assert.fail(Assert.java:88)
	at org.junit.Assert.failNotEquals(Assert.java:834)
	at org.junit.Assert.assertEquals(Assert.java:118)
	at org.apache.commons.lang3.time.FastDateParserSDFTest.checkParse(FastDateParserSDFTest.java:187)
	at org.apache.commons.lang3.time.FastDateParserSDFTest.testUpperCase(FastDateParserSDFTest.java:132)

testOriginalPP[25: kk 12 en_GB](org.apache.commons.lang3.time.FastDateParserSDFTest)  Time elapsed: 0.001 sec  <<< FAILURE!
java.lang.AssertionError: en_GB 12
 expected:<Thu Jan 01 12:00:00 UTC 1970> but was:<Thu Jan 01 00:00:00 UTC 1970>
	at org.junit.Assert.fail(Assert.java:88)
	at org.junit.Assert.failNotEquals(Assert.java:834)
	at org.junit.Assert.assertEquals(Assert.java:118)
	at org.apache.commons.lang3.time.FastDateParserSDFTest.checkParsePosition(FastDateParserSDFTest.java:222)
	at org.apache.commons.lang3.time.FastDateParserSDFTest.testOriginalPP(FastDateParserSDFTest.java:127)

testOriginal[25: kk 12 en_GB](org.apache.commons.lang3.time.FastDateParserSDFTest)  Time elapsed: 0 sec  <<< FAILURE!
java.lang.AssertionError: en_GB 12
 expected:<Thu Jan 01 12:00:00 UTC 1970> but was:<Thu Jan 01 00:00:00 UTC 1970>
	at org.junit.Assert.fail(Assert.java:88)
	at org.junit.Assert.failNotEquals(Assert.java:834)
	at org.junit.Assert.assertEquals(Assert.java:118)
	at org.apache.commons.lang3.time.FastDateParserSDFTest.checkParse(FastDateParserSDFTest.java:187)
	at org.apache.commons.lang3.time.FastDateParserSDFTest.testOriginal(FastDateParserSDFTest.java:122)

testUpperCasePP[26: HH 13 en_GB](org.apache.commons.lang3.time.FastDateParserSDFTest)  Time elapsed: 0.001 sec  <<< FAILURE!
java.lang.AssertionError: en_GB 13
 expected:<Thu Jan 01 13:00:00 UTC 1970> but was:<Thu Jan 01 00:00:00 UTC 1970>
	at org.junit.Assert.fail(Assert.java:88)
	at org.junit.Assert.failNotEquals(Assert.java:834)
	at org.junit.Assert.assertEquals(Assert.java:118)
	at org.apache.commons.lang3.time.FastDateParserSDFTest.checkParsePosition(FastDateParserSDFTest.java:222)
	at org.apache.commons.lang3.time.FastDateParserSDFTest.testUpperCasePP(FastDateParserSDFTest.java:137)

testUpperCase[26: HH 13 en_GB](org.apache.commons.lang3.time.FastDateParserSDFTest)  Time elapsed: 0.001 sec  <<< FAILURE!
java.lang.AssertionError: en_GB 13
 expected:<Thu Jan 01 13:00:00 UTC 1970> but was:<Thu Jan 01 00:00:00 UTC 1970>
	at org.junit.Assert.fail(Assert.java:88)
	at org.junit.Assert.failNotEquals(Assert.java:834)
	at org.junit.Assert.assertEquals(Assert.java:118)
	at org.apache.commons.lang3.time.FastDateParserSDFTest.checkParse(FastDateParserSDFTest.java:187)
	at org.apache.commons.lang3.time.FastDateParserSDFTest.testUpperCase(FastDateParserSDFTest.java:132)

testOriginalPP[26: HH 13 en_GB](org.apache.commons.lang3.time.FastDateParserSDFTest)  Time elapsed: 0 sec  <<< FAILURE!
java.lang.AssertionError: en_GB 13
 expected:<Thu Jan 01 13:00:00 UTC 1970> but was:<Thu Jan 01 00:00:00 UTC 1970>
	at org.junit.Assert.fail(Assert.java:88)
	at org.junit.Assert.failNotEquals(Assert.java:834)
	at org.junit.Assert.assertEquals(Assert.java:118)
	at org.apache.commons.lang3.time.FastDateParserSDFTest.checkParsePosition(FastDateParserSDFTest.java:222)
	at org.apache.commons.lang3.time.FastDateParserSDFTest.testOriginalPP(FastDateParserSDFTest.java:127)

testOriginal[26: HH 13 en_GB](org.apache.commons.lang3.time.FastDateParserSDFTest)  Time elapsed: 0 sec  <<< FAILURE!
java.lang.AssertionError: en_GB 13
 expected:<Thu Jan 01 13:00:00 UTC 1970> but was:<Thu Jan 01 00:00:00 UTC 1970>
	at org.junit.Assert.fail(Assert.java:88)
	at org.junit.Assert.failNotEquals(Assert.java:834)
	at org.junit.Assert.assertEquals(Assert.java:118)
	at org.apache.commons.lang3.time.FastDateParserSDFTest.checkParse(FastDateParserSDFTest.java:187)
	at org.apache.commons.lang3.time.FastDateParserSDFTest.testOriginal(FastDateParserSDFTest.java:122)

testUpperCasePP[27: KK 13 en_GB](org.apache.commons.lang3.time.FastDateParserSDFTest)  Time elapsed: 0 sec  <<< FAILURE!
java.lang.AssertionError: en_GB 13
 expected:<Thu Jan 01 13:00:00 UTC 1970> but was:<Thu Jan 01 00:00:00 UTC 1970>
	at org.junit.Assert.fail(Assert.java:88)
	at org.junit.Assert.failNotEquals(Assert.java:834)
	at org.junit.Assert.assertEquals(Assert.java:118)
	at org.apache.commons.lang3.time.FastDateParserSDFTest.checkParsePosition(FastDateParserSDFTest.java:222)
	at org.apache.commons.lang3.time.FastDateParserSDFTest.testUpperCasePP(FastDateParserSDFTest.java:137)

testUpperCase[27: KK 13 en_GB](org.apache.commons.lang3.time.FastDateParserSDFTest)  Time elapsed: 0.001 sec  <<< FAILURE!
java.lang.AssertionError: en_GB 13
 expected:<Thu Jan 01 13:00:00 UTC 1970> but was:<Thu Jan 01 00:00:00 UTC 1970>
	at org.junit.Assert.fail(Assert.java:88)
	at org.junit.Assert.failNotEquals(Assert.java:834)
	at org.junit.Assert.assertEquals(Assert.java:118)
	at org.apache.commons.lang3.time.FastDateParserSDFTest.checkParse(FastDateParserSDFTest.java:187)
	at org.apache.commons.lang3.time.FastDateParserSDFTest.testUpperCase(FastDateParserSDFTest.java:132)

testOriginalPP[27: KK 13 en_GB](org.apache.commons.lang3.time.FastDateParserSDFTest)  Time elapsed: 0 sec  <<< FAILURE!
java.lang.AssertionError: en_GB 13
 expected:<Thu Jan 01 13:00:00 UTC 1970> but was:<Thu Jan 01 00:00:00 UTC 1970>
	at org.junit.Assert.fail(Assert.java:88)
	at org.junit.Assert.failNotEquals(Assert.java:834)
	at org.junit.Assert.assertEquals(Assert.java:118)
	at org.apache.commons.lang3.time.FastDateParserSDFTest.checkParsePosition(FastDateParserSDFTest.java:222)
	at org.apache.commons.lang3.time.FastDateParserSDFTest.testOriginalPP(FastDateParserSDFTest.java:127)

testOriginal[27: KK 13 en_GB](org.apache.commons.lang3.time.FastDateParserSDFTest)  Time elapsed: 0 sec  <<< FAILURE!
java.lang.AssertionError: en_GB 13
 expected:<Thu Jan 01 13:00:00 UTC 1970> but was:<Thu Jan 01 00:00:00 UTC 1970>
	at org.junit.Assert.fail(Assert.java:88)
	at org.junit.Assert.failNotEquals(Assert.java:834)
	at org.junit.Assert.assertEquals(Assert.java:118)
	at org.apache.commons.lang3.time.FastDateParserSDFTest.checkParse(FastDateParserSDFTest.java:187)
	at org.apache.commons.lang3.time.FastDateParserSDFTest.testOriginal(FastDateParserSDFTest.java:122)

testUpperCasePP[28: hh 13 en_GB](org.apache.commons.lang3.time.FastDateParserSDFTest)  Time elapsed: 0 sec  <<< FAILURE!
java.lang.AssertionError: en_GB 13
 expected:<Thu Jan 01 13:00:00 UTC 1970> but was:<Thu Jan 01 00:00:00 UTC 1970>
	at org.junit.Assert.fail(Assert.java:88)
	at org.junit.Assert.failNotEquals(Assert.java:834)
	at org.junit.Assert.assertEquals(Assert.java:118)
	at org.apache.commons.lang3.time.FastDateParserSDFTest.checkParsePosition(FastDateParserSDFTest.java:222)
	at org.apache.commons.lang3.time.FastDateParserSDFTest.testUpperCasePP(FastDateParserSDFTest.java:137)

testUpperCase[28: hh 13 en_GB](org.apache.commons.lang3.time.FastDateParserSDFTest)  Time elapsed: 0 sec  <<< FAILURE!
java.lang.AssertionError: en_GB 13
 expected:<Thu Jan 01 13:00:00 UTC 1970> but was:<Thu Jan 01 00:00:00 UTC 1970>
	at org.junit.Assert.fail(Assert.java:88)
	at org.junit.Assert.failNotEquals(Assert.java:834)
	at org.junit.Assert.assertEquals(Assert.java:118)
	at org.apache.commons.lang3.time.FastDateParserSDFTest.checkParse(FastDateParserSDFTest.java:187)
	at org.apache.commons.lang3.time.FastDateParserSDFTest.testUpperCase(FastDateParserSDFTest.java:132)

testOriginalPP[28: hh 13 en_GB](org.apache.commons.lang3.time.FastDateParserSDFTest)  Time elapsed: 0 sec  <<< FAILURE!
java.lang.AssertionError: en_GB 13
 expected:<Thu Jan 01 13:00:00 UTC 1970> but was:<Thu Jan 01 00:00:00 UTC 1970>
	at org.junit.Assert.fail(Assert.java:88)
	at org.junit.Assert.failNotEquals(Assert.java:834)
	at org.junit.Assert.assertEquals(Assert.java:118)
	at org.apache.commons.lang3.time.FastDateParserSDFTest.checkParsePosition(FastDateParserSDFTest.java:222)
	at org.apache.commons.lang3.time.FastDateParserSDFTest.testOriginalPP(FastDateParserSDFTest.java:127)

testOriginal[28: hh 13 en_GB](org.apache.commons.lang3.time.FastDateParserSDFTest)  Time elapsed: 0 sec  <<< FAILURE!
java.lang.AssertionError: en_GB 13
 expected:<Thu Jan 01 13:00:00 UTC 1970> but was:<Thu Jan 01 00:00:00 UTC 1970>
	at org.junit.Assert.fail(Assert.java:88)
	at org.junit.Assert.failNotEquals(Assert.java:834)
	at org.junit.Assert.assertEquals(Assert.java:118)
	at org.apache.commons.lang3.time.FastDateParserSDFTest.checkParse(FastDateParserSDFTest.java:187)
	at org.apache.commons.lang3.time.FastDateParserSDFTest.testOriginal(FastDateParserSDFTest.java:122)

testUpperCasePP[29: kk 13 en_GB](org.apache.commons.lang3.time.FastDateParserSDFTest)  Time elapsed: 0.001 sec  <<< FAILURE!
java.lang.AssertionError: en_GB 13
 expected:<Thu Jan 01 13:00:00 UTC 1970> but was:<Thu Jan 01 00:00:00 UTC 1970>
	at org.junit.Assert.fail(Assert.java:88)
	at org.junit.Assert.failNotEquals(Assert.java:834)
	at org.junit.Assert.assertEquals(Assert.java:118)
	at org.apache.commons.lang3.time.FastDateParserSDFTest.checkParsePosition(FastDateParserSDFTest.java:222)
	at org.apache.commons.lang3.time.FastDateParserSDFTest.testUpperCasePP(FastDateParserSDFTest.java:137)

testUpperCase[29: kk 13 en_GB](org.apache.commons.lang3.time.FastDateParserSDFTest)  Time elapsed: 0.001 sec  <<< FAILURE!
java.lang.AssertionError: en_GB 13
 expected:<Thu Jan 01 13:00:00 UTC 1970> but was:<Thu Jan 01 00:00:00 UTC 1970>
	at org.junit.Assert.fail(Assert.java:88)
	at org.junit.Assert.failNotEquals(Assert.java:834)
	at org.junit.Assert.assertEquals(Assert.java:118)
	at org.apache.commons.lang3.time.FastDateParserSDFTest.checkParse(FastDateParserSDFTest.java:187)
	at org.apache.commons.lang3.time.FastDateParserSDFTest.testUpperCase(FastDateParserSDFTest.java:132)

testOriginalPP[29: kk 13 en_GB](org.apache.commons.lang3.time.FastDateParserSDFTest)  Time elapsed: 0.001 sec  <<< FAILURE!
java.lang.AssertionError: en_GB 13
 expected:<Thu Jan 01 13:00:00 UTC 1970> but was:<Thu Jan 01 00:00:00 UTC 1970>
	at org.junit.Assert.fail(Assert.java:88)
	at org.junit.Assert.failNotEquals(Assert.java:834)
	at org.junit.Assert.assertEquals(Assert.java:118)
	at org.apache.commons.lang3.time.FastDateParserSDFTest.checkParsePosition(FastDateParserSDFTest.java:222)
	at org.apache.commons.lang3.time.FastDateParserSDFTest.testOriginalPP(FastDateParserSDFTest.java:127)

testOriginal[29: kk 13 en_GB](org.apache.commons.lang3.time.FastDateParserSDFTest)  Time elapsed: 0 sec  <<< FAILURE!
java.lang.AssertionError: en_GB 13
 expected:<Thu Jan 01 13:00:00 UTC 1970> but was:<Thu Jan 01 00:00:00 UTC 1970>
	at org.junit.Assert.fail(Assert.java:88)
	at org.junit.Assert.failNotEquals(Assert.java:834)
	at org.junit.Assert.assertEquals(Assert.java:118)
	at org.apache.commons.lang3.time.FastDateParserSDFTest.checkParse(FastDateParserSDFTest.java:187)
	at org.apache.commons.lang3.time.FastDateParserSDFTest.testOriginal(FastDateParserSDFTest.java:122)

testUpperCasePP[30: HH 23 en_GB](org.apache.commons.lang3.time.FastDateParserSDFTest)  Time elapsed: 0.001 sec  <<< FAILURE!
java.lang.AssertionError: en_GB 23
 expected:<Thu Jan 01 23:00:00 UTC 1970> but was:<Thu Jan 01 00:00:00 UTC 1970>
	at org.junit.Assert.fail(Assert.java:88)
	at org.junit.Assert.failNotEquals(Assert.java:834)
	at org.junit.Assert.assertEquals(Assert.java:118)
	at org.apache.commons.lang3.time.FastDateParserSDFTest.checkParsePosition(FastDateParserSDFTest.java:222)
	at org.apache.commons.lang3.time.FastDateParserSDFTest.testUpperCasePP(FastDateParserSDFTest.java:137)

testUpperCase[30: HH 23 en_GB](org.apache.commons.lang3.time.FastDateParserSDFTest)  Time elapsed: 0 sec  <<< FAILURE!
java.lang.AssertionError: en_GB 23
 expected:<Thu Jan 01 23:00:00 UTC 1970> but was:<Thu Jan 01 00:00:00 UTC 1970>
	at org.junit.Assert.fail(Assert.java:88)
	at org.junit.Assert.failNotEquals(Assert.java:834)
	at org.junit.Assert.assertEquals(Assert.java:118)
	at org.apache.commons.lang3.time.FastDateParserSDFTest.checkParse(FastDateParserSDFTest.java:187)
	at org.apache.commons.lang3.time.FastDateParserSDFTest.testUpperCase(FastDateParserSDFTest.java:132)

testOriginalPP[30: HH 23 en_GB](org.apache.commons.lang3.time.FastDateParserSDFTest)  Time elapsed: 0 sec  <<< FAILURE!
java.lang.AssertionError: en_GB 23
 expected:<Thu Jan 01 23:00:00 UTC 1970> but was:<Thu Jan 01 00:00:00 UTC 1970>
	at org.junit.Assert.fail(Assert.java:88)
	at org.junit.Assert.failNotEquals(Assert.java:834)
	at org.junit.Assert.assertEquals(Assert.java:118)
	at org.apache.commons.lang3.time.FastDateParserSDFTest.checkParsePosition(FastDateParserSDFTest.java:222)
	at org.apache.commons.lang3.time.FastDateParserSDFTest.testOriginalPP(FastDateParserSDFTest.java:127)

testOriginal[30: HH 23 en_GB](org.apache.commons.lang3.time.FastDateParserSDFTest)  Time elapsed: 0 sec  <<< FAILURE!
java.lang.AssertionError: en_GB 23
 expected:<Thu Jan 01 23:00:00 UTC 1970> but was:<Thu Jan 01 00:00:00 UTC 1970>
	at org.junit.Assert.fail(Assert.java:88)
	at org.junit.Assert.failNotEquals(Assert.java:834)
	at org.junit.Assert.assertEquals(Assert.java:118)
	at org.apache.commons.lang3.time.FastDateParserSDFTest.checkParse(FastDateParserSDFTest.java:187)
	at org.apache.commons.lang3.time.FastDateParserSDFTest.testOriginal(FastDateParserSDFTest.java:122)

testUpperCasePP[31: KK 23 en_GB](org.apache.commons.lang3.time.FastDateParserSDFTest)  Time elapsed: 0.001 sec  <<< FAILURE!
java.lang.AssertionError: en_GB 23
 expected:<Thu Jan 01 23:00:00 UTC 1970> but was:<Thu Jan 01 00:00:00 UTC 1970>
	at org.junit.Assert.fail(Assert.java:88)
	at org.junit.Assert.failNotEquals(Assert.java:834)
	at org.junit.Assert.assertEquals(Assert.java:118)
	at org.apache.commons.lang3.time.FastDateParserSDFTest.checkParsePosition(FastDateParserSDFTest.java:222)
	at org.apache.commons.lang3.time.FastDateParserSDFTest.testUpperCasePP(FastDateParserSDFTest.java:137)

testUpperCase[31: KK 23 en_GB](org.apache.commons.lang3.time.FastDateParserSDFTest)  Time elapsed: 0 sec  <<< FAILURE!
java.lang.AssertionError: en_GB 23
 expected:<Thu Jan 01 23:00:00 UTC 1970> but was:<Thu Jan 01 00:00:00 UTC 1970>
	at org.junit.Assert.fail(Assert.java:88)
	at org.junit.Assert.failNotEquals(Assert.java:834)
	at org.junit.Assert.assertEquals(Assert.java:118)
	at org.apache.commons.lang3.time.FastDateParserSDFTest.checkParse(FastDateParserSDFTest.java:187)
	at org.apache.commons.lang3.time.FastDateParserSDFTest.testUpperCase(FastDateParserSDFTest.java:132)

testOriginalPP[31: KK 23 en_GB](org.apache.commons.lang3.time.FastDateParserSDFTest)  Time elapsed: 0.001 sec  <<< FAILURE!
java.lang.AssertionError: en_GB 23
 expected:<Thu Jan 01 23:00:00 UTC 1970> but was:<Thu Jan 01 00:00:00 UTC 1970>
	at org.junit.Assert.fail(Assert.java:88)
	at org.junit.Assert.failNotEquals(Assert.java:834)
	at org.junit.Assert.assertEquals(Assert.java:118)
	at org.apache.commons.lang3.time.FastDateParserSDFTest.checkParsePosition(FastDateParserSDFTest.java:222)
	at org.apache.commons.lang3.time.FastDateParserSDFTest.testOriginalPP(FastDateParserSDFTest.java:127)

testOriginal[31: KK 23 en_GB](org.apache.commons.lang3.time.FastDateParserSDFTest)  Time elapsed: 0.001 sec  <<< FAILURE!
java.lang.AssertionError: en_GB 23
 expected:<Thu Jan 01 23:00:00 UTC 1970> but was:<Thu Jan 01 00:00:00 UTC 1970>
	at org.junit.Assert.fail(Assert.java:88)
	at org.junit.Assert.failNotEquals(Assert.java:834)
	at org.junit.Assert.assertEquals(Assert.java:118)
	at org.apache.commons.lang3.time.FastDateParserSDFTest.checkParse(FastDateParserSDFTest.java:187)
	at org.apache.commons.lang3.time.FastDateParserSDFTest.testOriginal(FastDateParserSDFTest.java:122)

testUpperCasePP[32: hh 23 en_GB](org.apache.commons.lang3.time.FastDateParserSDFTest)  Time elapsed: 0 sec  <<< FAILURE!
java.lang.AssertionError: en_GB 23
 expected:<Thu Jan 01 23:00:00 UTC 1970> but was:<Thu Jan 01 00:00:00 UTC 1970>
	at org.junit.Assert.fail(Assert.java:88)
	at org.junit.Assert.failNotEquals(Assert.java:834)
	at org.junit.Assert.assertEquals(Assert.java:118)
	at org.apache.commons.lang3.time.FastDateParserSDFTest.checkParsePosition(FastDateParserSDFTest.java:222)
	at org.apache.commons.lang3.time.FastDateParserSDFTest.testUpperCasePP(FastDateParserSDFTest.java:137)

testUpperCase[32: hh 23 en_GB](org.apache.commons.lang3.time.FastDateParserSDFTest)  Time elapsed: 0.001 sec  <<< FAILURE!
java.lang.AssertionError: en_GB 23
 expected:<Thu Jan 01 23:00:00 UTC 1970> but was:<Thu Jan 01 00:00:00 UTC 1970>
	at org.junit.Assert.fail(Assert.java:88)
	at org.junit.Assert.failNotEquals(Assert.java:834)
	at org.junit.Assert.assertEquals(Assert.java:118)
	at org.apache.commons.lang3.time.FastDateParserSDFTest.checkParse(FastDateParserSDFTest.java:187)
	at org.apache.commons.lang3.time.FastDateParserSDFTest.testUpperCase(FastDateParserSDFTest.java:132)

testOriginalPP[32: hh 23 en_GB](org.apache.commons.lang3.time.FastDateParserSDFTest)  Time elapsed: 0 sec  <<< FAILURE!
java.lang.AssertionError: en_GB 23
 expected:<Thu Jan 01 23:00:00 UTC 1970> but was:<Thu Jan 01 00:00:00 UTC 1970>
	at org.junit.Assert.fail(Assert.java:88)
	at org.junit.Assert.failNotEquals(Assert.java:834)
	at org.junit.Assert.assertEquals(Assert.java:118)
	at org.apache.commons.lang3.time.FastDateParserSDFTest.checkParsePosition(FastDateParserSDFTest.java:222)
	at org.apache.commons.lang3.time.FastDateParserSDFTest.testOriginalPP(FastDateParserSDFTest.java:127)

testOriginal[32: hh 23 en_GB](org.apache.commons.lang3.time.FastDateParserSDFTest)  Time elapsed: 0.001 sec  <<< FAILURE!
java.lang.AssertionError: en_GB 23
 expected:<Thu Jan 01 23:00:00 UTC 1970> but was:<Thu Jan 01 00:00:00 UTC 1970>
	at org.junit.Assert.fail(Assert.java:88)
	at org.junit.Assert.failNotEquals(Assert.java:834)
	at org.junit.Assert.assertEquals(Assert.java:118)
	at org.apache.commons.lang3.time.FastDateParserSDFTest.checkParse(FastDateParserSDFTest.java:187)
	at org.apache.commons.lang3.time.FastDateParserSDFTest.testOriginal(FastDateParserSDFTest.java:122)

testUpperCasePP[33: kk 23 en_GB](org.apache.commons.lang3.time.FastDateParserSDFTest)  Time elapsed: 0 sec  <<< FAILURE!
java.lang.AssertionError: en_GB 23
 expected:<Thu Jan 01 23:00:00 UTC 1970> but was:<Thu Jan 01 00:00:00 UTC 1970>
	at org.junit.Assert.fail(Assert.java:88)
	at org.junit.Assert.failNotEquals(Assert.java:834)
	at org.junit.Assert.assertEquals(Assert.java:118)
	at org.apache.commons.lang3.time.FastDateParserSDFTest.checkParsePosition(FastDateParserSDFTest.java:222)
	at org.apache.commons.lang3.time.FastDateParserSDFTest.testUpperCasePP(FastDateParserSDFTest.java:137)

testUpperCase[33: kk 23 en_GB](org.apache.commons.lang3.time.FastDateParserSDFTest)  Time elapsed: 0.001 sec  <<< FAILURE!
java.lang.AssertionError: en_GB 23
 expected:<Thu Jan 01 23:00:00 UTC 1970> but was:<Thu Jan 01 00:00:00 UTC 1970>
	at org.junit.Assert.fail(Assert.java:88)
	at org.junit.Assert.failNotEquals(Assert.java:834)
	at org.junit.Assert.assertEquals(Assert.java:118)
	at org.apache.commons.lang3.time.FastDateParserSDFTest.checkParse(FastDateParserSDFTest.java:187)
	at org.apache.commons.lang3.time.FastDateParserSDFTest.testUpperCase(FastDateParserSDFTest.java:132)

testOriginalPP[33: kk 23 en_GB](org.apache.commons.lang3.time.FastDateParserSDFTest)  Time elapsed: 0 sec  <<< FAILURE!
java.lang.AssertionError: en_GB 23
 expected:<Thu Jan 01 23:00:00 UTC 1970> but was:<Thu Jan 01 00:00:00 UTC 1970>
	at org.junit.Assert.fail(Assert.java:88)
	at org.junit.Assert.failNotEquals(Assert.java:834)
	at org.junit.Assert.assertEquals(Assert.java:118)
	at org.apache.commons.lang3.time.FastDateParserSDFTest.checkParsePosition(FastDateParserSDFTest.java:222)
	at org.apache.commons.lang3.time.FastDateParserSDFTest.testOriginalPP(FastDateParserSDFTest.java:127)

testOriginal[33: kk 23 en_GB](org.apache.commons.lang3.time.FastDateParserSDFTest)  Time elapsed: 0 sec  <<< FAILURE!
java.lang.AssertionError: en_GB 23
 expected:<Thu Jan 01 23:00:00 UTC 1970> but was:<Thu Jan 01 00:00:00 UTC 1970>
	at org.junit.Assert.fail(Assert.java:88)
	at org.junit.Assert.failNotEquals(Assert.java:834)
	at org.junit.Assert.assertEquals(Assert.java:118)
	at org.apache.commons.lang3.time.FastDateParserSDFTest.checkParse(FastDateParserSDFTest.java:187)
	at org.apache.commons.lang3.time.FastDateParserSDFTest.testOriginal(FastDateParserSDFTest.java:122)

testUpperCasePP[34: HH 24 en_GB](org.apache.commons.lang3.time.FastDateParserSDFTest)  Time elapsed: 0.001 sec  <<< FAILURE!
java.lang.AssertionError: en_GB 24
 expected:<Fri Jan 02 00:00:00 UTC 1970> but was:<Thu Jan 01 00:00:00 UTC 1970>
	at org.junit.Assert.fail(Assert.java:88)
	at org.junit.Assert.failNotEquals(Assert.java:834)
	at org.junit.Assert.assertEquals(Assert.java:118)
	at org.apache.commons.lang3.time.FastDateParserSDFTest.checkParsePosition(FastDateParserSDFTest.java:222)
	at org.apache.commons.lang3.time.FastDateParserSDFTest.testUpperCasePP(FastDateParserSDFTest.java:137)

testUpperCase[34: HH 24 en_GB](org.apache.commons.lang3.time.FastDateParserSDFTest)  Time elapsed: 0 sec  <<< FAILURE!
java.lang.AssertionError: en_GB 24
 expected:<Fri Jan 02 00:00:00 UTC 1970> but was:<Thu Jan 01 00:00:00 UTC 1970>
	at org.junit.Assert.fail(Assert.java:88)
	at org.junit.Assert.failNotEquals(Assert.java:834)
	at org.junit.Assert.assertEquals(Assert.java:118)
	at org.apache.commons.lang3.time.FastDateParserSDFTest.checkParse(FastDateParserSDFTest.java:187)
	at org.apache.commons.lang3.time.FastDateParserSDFTest.testUpperCase(FastDateParserSDFTest.java:132)

testOriginalPP[34: HH 24 en_GB](org.apache.commons.lang3.time.FastDateParserSDFTest)  Time elapsed: 0.001 sec  <<< FAILURE!
java.lang.AssertionError: en_GB 24
 expected:<Fri Jan 02 00:00:00 UTC 1970> but was:<Thu Jan 01 00:00:00 UTC 1970>
	at org.junit.Assert.fail(Assert.java:88)
	at org.junit.Assert.failNotEquals(Assert.java:834)
	at org.junit.Assert.assertEquals(Assert.java:118)
	at org.apache.commons.lang3.time.FastDateParserSDFTest.checkParsePosition(FastDateParserSDFTest.java:222)
	at org.apache.commons.lang3.time.FastDateParserSDFTest.testOriginalPP(FastDateParserSDFTest.java:127)

testOriginal[34: HH 24 en_GB](org.apache.commons.lang3.time.FastDateParserSDFTest)  Time elapsed: 0 sec  <<< FAILURE!
java.lang.AssertionError: en_GB 24
 expected:<Fri Jan 02 00:00:00 UTC 1970> but was:<Thu Jan 01 00:00:00 UTC 1970>
	at org.junit.Assert.fail(Assert.java:88)
	at org.junit.Assert.failNotEquals(Assert.java:834)
	at org.junit.Assert.assertEquals(Assert.java:118)
	at org.apache.commons.lang3.time.FastDateParserSDFTest.checkParse(FastDateParserSDFTest.java:187)
	at org.apache.commons.lang3.time.FastDateParserSDFTest.testOriginal(FastDateParserSDFTest.java:122)

testUpperCasePP[35: KK 24 en_GB](org.apache.commons.lang3.time.FastDateParserSDFTest)  Time elapsed: 0.001 sec  <<< FAILURE!
java.lang.AssertionError: en_GB 24
 expected:<Fri Jan 02 00:00:00 UTC 1970> but was:<Thu Jan 01 00:00:00 UTC 1970>
	at org.junit.Assert.fail(Assert.java:88)
	at org.junit.Assert.failNotEquals(Assert.java:834)
	at org.junit.Assert.assertEquals(Assert.java:118)
	at org.apache.commons.lang3.time.FastDateParserSDFTest.checkParsePosition(FastDateParserSDFTest.java:222)
	at org.apache.commons.lang3.time.FastDateParserSDFTest.testUpperCasePP(FastDateParserSDFTest.java:137)

testUpperCase[35: KK 24 en_GB](org.apache.commons.lang3.time.FastDateParserSDFTest)  Time elapsed: 0 sec  <<< FAILURE!
java.lang.AssertionError: en_GB 24
 expected:<Fri Jan 02 00:00:00 UTC 1970> but was:<Thu Jan 01 00:00:00 UTC 1970>
	at org.junit.Assert.fail(Assert.java:88)
	at org.junit.Assert.failNotEquals(Assert.java:834)
	at org.junit.Assert.assertEquals(Assert.java:118)
	at org.apache.commons.lang3.time.FastDateParserSDFTest.checkParse(FastDateParserSDFTest.java:187)
	at org.apache.commons.lang3.time.FastDateParserSDFTest.testUpperCase(FastDateParserSDFTest.java:132)

testOriginalPP[35: KK 24 en_GB](org.apache.commons.lang3.time.FastDateParserSDFTest)  Time elapsed: 0 sec  <<< FAILURE!
java.lang.AssertionError: en_GB 24
 expected:<Fri Jan 02 00:00:00 UTC 1970> but was:<Thu Jan 01 00:00:00 UTC 1970>
	at org.junit.Assert.fail(Assert.java:88)
	at org.junit.Assert.failNotEquals(Assert.java:834)
	at org.junit.Assert.assertEquals(Assert.java:118)
	at org.apache.commons.lang3.time.FastDateParserSDFTest.checkParsePosition(FastDateParserSDFTest.java:222)
	at org.apache.commons.lang3.time.FastDateParserSDFTest.testOriginalPP(FastDateParserSDFTest.java:127)

testOriginal[35: KK 24 en_GB](org.apache.commons.lang3.time.FastDateParserSDFTest)  Time elapsed: 0.001 sec  <<< FAILURE!
java.lang.AssertionError: en_GB 24
 expected:<Fri Jan 02 00:00:00 UTC 1970> but was:<Thu Jan 01 00:00:00 UTC 1970>
	at org.junit.Assert.fail(Assert.java:88)
	at org.junit.Assert.failNotEquals(Assert.java:834)
	at org.junit.Assert.assertEquals(Assert.java:118)
	at org.apache.commons.lang3.time.FastDateParserSDFTest.checkParse(FastDateParserSDFTest.java:187)
	at org.apache.commons.lang3.time.FastDateParserSDFTest.testOriginal(FastDateParserSDFTest.java:122)

testUpperCasePP[36: hh 24 en_GB](org.apache.commons.lang3.time.FastDateParserSDFTest)  Time elapsed: 0 sec  <<< FAILURE!
java.lang.AssertionError: en_GB 24
 expected:<Fri Jan 02 00:00:00 UTC 1970> but was:<Thu Jan 01 00:00:00 UTC 1970>
	at org.junit.Assert.fail(Assert.java:88)
	at org.junit.Assert.failNotEquals(Assert.java:834)
	at org.junit.Assert.assertEquals(Assert.java:118)
	at org.apache.commons.lang3.time.FastDateParserSDFTest.checkParsePosition(FastDateParserSDFTest.java:222)
	at org.apache.commons.lang3.time.FastDateParserSDFTest.testUpperCasePP(FastDateParserSDFTest.java:137)

testUpperCase[36: hh 24 en_GB](org.apache.commons.lang3.time.FastDateParserSDFTest)  Time elapsed: 0 sec  <<< FAILURE!
java.lang.AssertionError: en_GB 24
 expected:<Fri Jan 02 00:00:00 UTC 1970> but was:<Thu Jan 01 00:00:00 UTC 1970>
	at org.junit.Assert.fail(Assert.java:88)
	at org.junit.Assert.failNotEquals(Assert.java:834)
	at org.junit.Assert.assertEquals(Assert.java:118)
	at org.apache.commons.lang3.time.FastDateParserSDFTest.checkParse(FastDateParserSDFTest.java:187)
	at org.apache.commons.lang3.time.FastDateParserSDFTest.testUpperCase(FastDateParserSDFTest.java:132)

testOriginalPP[36: hh 24 en_GB](org.apache.commons.lang3.time.FastDateParserSDFTest)  Time elapsed: 0 sec  <<< FAILURE!
java.lang.AssertionError: en_GB 24
 expected:<Fri Jan 02 00:00:00 UTC 1970> but was:<Thu Jan 01 00:00:00 UTC 1970>
	at org.junit.Assert.fail(Assert.java:88)
	at org.junit.Assert.failNotEquals(Assert.java:834)
	at org.junit.Assert.assertEquals(Assert.java:118)
	at org.apache.commons.lang3.time.FastDateParserSDFTest.checkParsePosition(FastDateParserSDFTest.java:222)
	at org.apache.commons.lang3.time.FastDateParserSDFTest.testOriginalPP(FastDateParserSDFTest.java:127)

testOriginal[36: hh 24 en_GB](org.apache.commons.lang3.time.FastDateParserSDFTest)  Time elapsed: 0 sec  <<< FAILURE!
java.lang.AssertionError: en_GB 24
 expected:<Fri Jan 02 00:00:00 UTC 1970> but was:<Thu Jan 01 00:00:00 UTC 1970>
	at org.junit.Assert.fail(Assert.java:88)
	at org.junit.Assert.failNotEquals(Assert.java:834)
	at org.junit.Assert.assertEquals(Assert.java:118)
	at org.apache.commons.lang3.time.FastDateParserSDFTest.checkParse(FastDateParserSDFTest.java:187)
	at org.apache.commons.lang3.time.FastDateParserSDFTest.testOriginal(FastDateParserSDFTest.java:122)

testUpperCasePP[38: HH 25 en_GB](org.apache.commons.lang3.time.FastDateParserSDFTest)  Time elapsed: 0.001 sec  <<< FAILURE!
java.lang.AssertionError: en_GB 25
 expected:<Fri Jan 02 01:00:00 UTC 1970> but was:<Thu Jan 01 00:00:00 UTC 1970>
	at org.junit.Assert.fail(Assert.java:88)
	at org.junit.Assert.failNotEquals(Assert.java:834)
	at org.junit.Assert.assertEquals(Assert.java:118)
	at org.apache.commons.lang3.time.FastDateParserSDFTest.checkParsePosition(FastDateParserSDFTest.java:222)
	at org.apache.commons.lang3.time.FastDateParserSDFTest.testUpperCasePP(FastDateParserSDFTest.java:137)

testUpperCase[38: HH 25 en_GB](org.apache.commons.lang3.time.FastDateParserSDFTest)  Time elapsed: 0 sec  <<< FAILURE!
java.lang.AssertionError: en_GB 25
 expected:<Fri Jan 02 01:00:00 UTC 1970> but was:<Thu Jan 01 00:00:00 UTC 1970>
	at org.junit.Assert.fail(Assert.java:88)
	at org.junit.Assert.failNotEquals(Assert.java:834)
	at org.junit.Assert.assertEquals(Assert.java:118)
	at org.apache.commons.lang3.time.FastDateParserSDFTest.checkParse(FastDateParserSDFTest.java:187)
	at org.apache.commons.lang3.time.FastDateParserSDFTest.testUpperCase(FastDateParserSDFTest.java:132)

testOriginalPP[38: HH 25 en_GB](org.apache.commons.lang3.time.FastDateParserSDFTest)  Time elapsed: 0 sec  <<< FAILURE!
java.lang.AssertionError: en_GB 25
 expected:<Fri Jan 02 01:00:00 UTC 1970> but was:<Thu Jan 01 00:00:00 UTC 1970>
	at org.junit.Assert.fail(Assert.java:88)
	at org.junit.Assert.failNotEquals(Assert.java:834)
	at org.junit.Assert.assertEquals(Assert.java:118)
	at org.apache.commons.lang3.time.FastDateParserSDFTest.checkParsePosition(FastDateParserSDFTest.java:222)
	at org.apache.commons.lang3.time.FastDateParserSDFTest.testOriginalPP(FastDateParserSDFTest.java:127)

testOriginal[38: HH 25 en_GB](org.apache.commons.lang3.time.FastDateParserSDFTest)  Time elapsed: 0 sec  <<< FAILURE!
java.lang.AssertionError: en_GB 25
 expected:<Fri Jan 02 01:00:00 UTC 1970> but was:<Thu Jan 01 00:00:00 UTC 1970>
	at org.junit.Assert.fail(Assert.java:88)
	at org.junit.Assert.failNotEquals(Assert.java:834)
	at org.junit.Assert.assertEquals(Assert.java:118)
	at org.apache.commons.lang3.time.FastDateParserSDFTest.checkParse(FastDateParserSDFTest.java:187)
	at org.apache.commons.lang3.time.FastDateParserSDFTest.testOriginal(FastDateParserSDFTest.java:122)

testUpperCasePP[39: KK 25 en_GB](org.apache.commons.lang3.time.FastDateParserSDFTest)  Time elapsed: 0 sec  <<< FAILURE!
java.lang.AssertionError: en_GB 25
 expected:<Fri Jan 02 01:00:00 UTC 1970> but was:<Thu Jan 01 00:00:00 UTC 1970>
	at org.junit.Assert.fail(Assert.java:88)
	at org.junit.Assert.failNotEquals(Assert.java:834)
	at org.junit.Assert.assertEquals(Assert.java:118)
	at org.apache.commons.lang3.time.FastDateParserSDFTest.checkParsePosition(FastDateParserSDFTest.java:222)
	at org.apache.commons.lang3.time.FastDateParserSDFTest.testUpperCasePP(FastDateParserSDFTest.java:137)

testUpperCase[39: KK 25 en_GB](org.apache.commons.lang3.time.FastDateParserSDFTest)  Time elapsed: 0.001 sec  <<< FAILURE!
java.lang.AssertionError: en_GB 25
 expected:<Fri Jan 02 01:00:00 UTC 1970> but was:<Thu Jan 01 00:00:00 UTC 1970>
	at org.junit.Assert.fail(Assert.java:88)
	at org.junit.Assert.failNotEquals(Assert.java:834)
	at org.junit.Assert.assertEquals(Assert.java:118)
	at org.apache.commons.lang3.time.FastDateParserSDFTest.checkParse(FastDateParserSDFTest.java:187)
	at org.apache.commons.lang3.time.FastDateParserSDFTest.testUpperCase(FastDateParserSDFTest.java:132)

testOriginalPP[39: KK 25 en_GB](org.apache.commons.lang3.time.FastDateParserSDFTest)  Time elapsed: 0 sec  <<< FAILURE!
java.lang.AssertionError: en_GB 25
 expected:<Fri Jan 02 01:00:00 UTC 1970> but was:<Thu Jan 01 00:00:00 UTC 1970>
	at org.junit.Assert.fail(Assert.java:88)
	at org.junit.Assert.failNotEquals(Assert.java:834)
	at org.junit.Assert.assertEquals(Assert.java:118)
	at org.apache.commons.lang3.time.FastDateParserSDFTest.checkParsePosition(FastDateParserSDFTest.java:222)
	at org.apache.commons.lang3.time.FastDateParserSDFTest.testOriginalPP(FastDateParserSDFTest.java:127)

testOriginal[39: KK 25 en_GB](org.apache.commons.lang3.time.FastDateParserSDFTest)  Time elapsed: 0.001 sec  <<< FAILURE!
java.lang.AssertionError: en_GB 25
 expected:<Fri Jan 02 01:00:00 UTC 1970> but was:<Thu Jan 01 00:00:00 UTC 1970>
	at org.junit.Assert.fail(Assert.java:88)
	at org.junit.Assert.failNotEquals(Assert.java:834)
	at org.junit.Assert.assertEquals(Assert.java:118)
	at org.apache.commons.lang3.time.FastDateParserSDFTest.checkParse(FastDateParserSDFTest.java:187)
	at org.apache.commons.lang3.time.FastDateParserSDFTest.testOriginal(FastDateParserSDFTest.java:122)

testUpperCasePP[40: hh 25 en_GB](org.apache.commons.lang3.time.FastDateParserSDFTest)  Time elapsed: 0 sec  <<< FAILURE!
java.lang.AssertionError: en_GB 25
 expected:<Fri Jan 02 01:00:00 UTC 1970> but was:<Thu Jan 01 00:00:00 UTC 1970>
	at org.junit.Assert.fail(Assert.java:88)
	at org.junit.Assert.failNotEquals(Assert.java:834)
	at org.junit.Assert.assertEquals(Assert.java:118)
	at org.apache.commons.lang3.time.FastDateParserSDFTest.checkParsePosition(FastDateParserSDFTest.java:222)
	at org.apache.commons.lang3.time.FastDateParserSDFTest.testUpperCasePP(FastDateParserSDFTest.java:137)

testUpperCase[40: hh 25 en_GB](org.apache.commons.lang3.time.FastDateParserSDFTest)  Time elapsed: 0.001 sec  <<< FAILURE!
java.lang.AssertionError: en_GB 25
 expected:<Fri Jan 02 01:00:00 UTC 1970> but was:<Thu Jan 01 00:00:00 UTC 1970>
	at org.junit.Assert.fail(Assert.java:88)
	at org.junit.Assert.failNotEquals(Assert.java:834)
	at org.junit.Assert.assertEquals(Assert.java:118)
	at org.apache.commons.lang3.time.FastDateParserSDFTest.checkParse(FastDateParserSDFTest.java:187)
	at org.apache.commons.lang3.time.FastDateParserSDFTest.testUpperCase(FastDateParserSDFTest.java:132)

testOriginalPP[40: hh 25 en_GB](org.apache.commons.lang3.time.FastDateParserSDFTest)  Time elapsed: 0 sec  <<< FAILURE!
java.lang.AssertionError: en_GB 25
 expected:<Fri Jan 02 01:00:00 UTC 1970> but was:<Thu Jan 01 00:00:00 UTC 1970>
	at org.junit.Assert.fail(Assert.java:88)
	at org.junit.Assert.failNotEquals(Assert.java:834)
	at org.junit.Assert.assertEquals(Assert.java:118)
	at org.apache.commons.lang3.time.FastDateParserSDFTest.checkParsePosition(FastDateParserSDFTest.java:222)
	at org.apache.commons.lang3.time.FastDateParserSDFTest.testOriginalPP(FastDateParserSDFTest.java:127)

testOriginal[40: hh 25 en_GB](org.apache.commons.lang3.time.FastDateParserSDFTest)  Time elapsed: 0.001 sec  <<< FAILURE!
java.lang.AssertionError: en_GB 25
 expected:<Fri Jan 02 01:00:00 UTC 1970> but was:<Thu Jan 01 00:00:00 UTC 1970>
	at org.junit.Assert.fail(Assert.java:88)
	at org.junit.Assert.failNotEquals(Assert.java:834)
	at org.junit.Assert.assertEquals(Assert.java:118)
	at org.apache.commons.lang3.time.FastDateParserSDFTest.checkParse(FastDateParserSDFTest.java:187)
	at org.apache.commons.lang3.time.FastDateParserSDFTest.testOriginal(FastDateParserSDFTest.java:122)

testUpperCasePP[41: kk 25 en_GB](org.apache.commons.lang3.time.FastDateParserSDFTest)  Time elapsed: 0 sec  <<< FAILURE!
java.lang.AssertionError: en_GB 25
 expected:<Fri Jan 02 01:00:00 UTC 1970> but was:<Thu Jan 01 00:00:00 UTC 1970>
	at org.junit.Assert.fail(Assert.java:88)
	at org.junit.Assert.failNotEquals(Assert.java:834)
	at org.junit.Assert.assertEquals(Assert.java:118)
	at org.apache.commons.lang3.time.FastDateParserSDFTest.checkParsePosition(FastDateParserSDFTest.java:222)
	at org.apache.commons.lang3.time.FastDateParserSDFTest.testUpperCasePP(FastDateParserSDFTest.java:137)

testUpperCase[41: kk 25 en_GB](org.apache.commons.lang3.time.FastDateParserSDFTest)  Time elapsed: 0.001 sec  <<< FAILURE!
java.lang.AssertionError: en_GB 25
 expected:<Fri Jan 02 01:00:00 UTC 1970> but was:<Thu Jan 01 00:00:00 UTC 1970>
	at org.junit.Assert.fail(Assert.java:88)
	at org.junit.Assert.failNotEquals(Assert.java:834)
	at org.junit.Assert.assertEquals(Assert.java:118)
	at org.apache.commons.lang3.time.FastDateParserSDFTest.checkParse(FastDateParserSDFTest.java:187)
	at org.apache.commons.lang3.time.FastDateParserSDFTest.testUpperCase(FastDateParserSDFTest.java:132)

testOriginalPP[41: kk 25 en_GB](org.apache.commons.lang3.time.FastDateParserSDFTest)  Time elapsed: 0 sec  <<< FAILURE!
java.lang.AssertionError: en_GB 25
 expected:<Fri Jan 02 01:00:00 UTC 1970> but was:<Thu Jan 01 00:00:00 UTC 1970>
	at org.junit.Assert.fail(Assert.java:88)
	at org.junit.Assert.failNotEquals(Assert.java:834)
	at org.junit.Assert.assertEquals(Assert.java:118)
	at org.apache.commons.lang3.time.FastDateParserSDFTest.checkParsePosition(FastDateParserSDFTest.java:222)
	at org.apache.commons.lang3.time.FastDateParserSDFTest.testOriginalPP(FastDateParserSDFTest.java:127)

testOriginal[41: kk 25 en_GB](org.apache.commons.lang3.time.FastDateParserSDFTest)  Time elapsed: 0 sec  <<< FAILURE!
java.lang.AssertionError: en_GB 25
 expected:<Fri Jan 02 01:00:00 UTC 1970> but was:<Thu Jan 01 00:00:00 UTC 1970>
	at org.junit.Assert.fail(Assert.java:88)
	at org.junit.Assert.failNotEquals(Assert.java:834)
	at org.junit.Assert.assertEquals(Assert.java:118)
	at org.apache.commons.lang3.time.FastDateParserSDFTest.checkParse(FastDateParserSDFTest.java:187)
	at org.apache.commons.lang3.time.FastDateParserSDFTest.testOriginal(FastDateParserSDFTest.java:122)

testUpperCasePP[42: HH 48 en_GB](org.apache.commons.lang3.time.FastDateParserSDFTest)  Time elapsed: 0 sec  <<< FAILURE!
java.lang.AssertionError: en_GB 48
 expected:<Sat Jan 03 00:00:00 UTC 1970> but was:<Thu Jan 01 00:00:00 UTC 1970>
	at org.junit.Assert.fail(Assert.java:88)
	at org.junit.Assert.failNotEquals(Assert.java:834)
	at org.junit.Assert.assertEquals(Assert.java:118)
	at org.apache.commons.lang3.time.FastDateParserSDFTest.checkParsePosition(FastDateParserSDFTest.java:222)
	at org.apache.commons.lang3.time.FastDateParserSDFTest.testUpperCasePP(FastDateParserSDFTest.java:137)

testUpperCase[42: HH 48 en_GB](org.apache.commons.lang3.time.FastDateParserSDFTest)  Time elapsed: 0 sec  <<< FAILURE!
java.lang.AssertionError: en_GB 48
 expected:<Sat Jan 03 00:00:00 UTC 1970> but was:<Thu Jan 01 00:00:00 UTC 1970>
	at org.junit.Assert.fail(Assert.java:88)
	at org.junit.Assert.failNotEquals(Assert.java:834)
	at org.junit.Assert.assertEquals(Assert.java:118)
	at org.apache.commons.lang3.time.FastDateParserSDFTest.checkParse(FastDateParserSDFTest.java:187)
	at org.apache.commons.lang3.time.FastDateParserSDFTest.testUpperCase(FastDateParserSDFTest.java:132)

testOriginalPP[42: HH 48 en_GB](org.apache.commons.lang3.time.FastDateParserSDFTest)  Time elapsed: 0.001 sec  <<< FAILURE!
java.lang.AssertionError: en_GB 48
 expected:<Sat Jan 03 00:00:00 UTC 1970> but was:<Thu Jan 01 00:00:00 UTC 1970>
	at org.junit.Assert.fail(Assert.java:88)
	at org.junit.Assert.failNotEquals(Assert.java:834)
	at org.junit.Assert.assertEquals(Assert.java:118)
	at org.apache.commons.lang3.time.FastDateParserSDFTest.checkParsePosition(FastDateParserSDFTest.java:222)
	at org.apache.commons.lang3.time.FastDateParserSDFTest.testOriginalPP(FastDateParserSDFTest.java:127)

testOriginal[42: HH 48 en_GB](org.apache.commons.lang3.time.FastDateParserSDFTest)  Time elapsed: 0 sec  <<< FAILURE!
java.lang.AssertionError: en_GB 48
 expected:<Sat Jan 03 00:00:00 UTC 1970> but was:<Thu Jan 01 00:00:00 UTC 1970>
	at org.junit.Assert.fail(Assert.java:88)
	at org.junit.Assert.failNotEquals(Assert.java:834)
	at org.junit.Assert.assertEquals(Assert.java:118)
	at org.apache.commons.lang3.time.FastDateParserSDFTest.checkParse(FastDateParserSDFTest.java:187)
	at org.apache.commons.lang3.time.FastDateParserSDFTest.testOriginal(FastDateParserSDFTest.java:122)

testUpperCasePP[43: KK 48 en_GB](org.apache.commons.lang3.time.FastDateParserSDFTest)  Time elapsed: 0 sec  <<< FAILURE!
java.lang.AssertionError: en_GB 48
 expected:<Sat Jan 03 00:00:00 UTC 1970> but was:<Thu Jan 01 00:00:00 UTC 1970>
	at org.junit.Assert.fail(Assert.java:88)
	at org.junit.Assert.failNotEquals(Assert.java:834)
	at org.junit.Assert.assertEquals(Assert.java:118)
	at org.apache.commons.lang3.time.FastDateParserSDFTest.checkParsePosition(FastDateParserSDFTest.java:222)
	at org.apache.commons.lang3.time.FastDateParserSDFTest.testUpperCasePP(FastDateParserSDFTest.java:137)

testUpperCase[43: KK 48 en_GB](org.apache.commons.lang3.time.FastDateParserSDFTest)  Time elapsed: 0.001 sec  <<< FAILURE!
java.lang.AssertionError: en_GB 48
 expected:<Sat Jan 03 00:00:00 UTC 1970> but was:<Thu Jan 01 00:00:00 UTC 1970>
	at org.junit.Assert.fail(Assert.java:88)
	at org.junit.Assert.failNotEquals(Assert.java:834)
	at org.junit.Assert.assertEquals(Assert.java:118)
	at org.apache.commons.lang3.time.FastDateParserSDFTest.checkParse(FastDateParserSDFTest.java:187)
	at org.apache.commons.lang3.time.FastDateParserSDFTest.testUpperCase(FastDateParserSDFTest.java:132)

testOriginalPP[43: KK 48 en_GB](org.apache.commons.lang3.time.FastDateParserSDFTest)  Time elapsed: 0 sec  <<< FAILURE!
java.lang.AssertionError: en_GB 48
 expected:<Sat Jan 03 00:00:00 UTC 1970> but was:<Thu Jan 01 00:00:00 UTC 1970>
	at org.junit.Assert.fail(Assert.java:88)
	at org.junit.Assert.failNotEquals(Assert.java:834)
	at org.junit.Assert.assertEquals(Assert.java:118)
	at org.apache.commons.lang3.time.FastDateParserSDFTest.checkParsePosition(FastDateParserSDFTest.java:222)
	at org.apache.commons.lang3.time.FastDateParserSDFTest.testOriginalPP(FastDateParserSDFTest.java:127)

testOriginal[43: KK 48 en_GB](org.apache.commons.lang3.time.FastDateParserSDFTest)  Time elapsed: 0.001 sec  <<< FAILURE!
java.lang.AssertionError: en_GB 48
 expected:<Sat Jan 03 00:00:00 UTC 1970> but was:<Thu Jan 01 00:00:00 UTC 1970>
	at org.junit.Assert.fail(Assert.java:88)
	at org.junit.Assert.failNotEquals(Assert.java:834)
	at org.junit.Assert.assertEquals(Assert.java:118)
	at org.apache.commons.lang3.time.FastDateParserSDFTest.checkParse(FastDateParserSDFTest.java:187)
	at org.apache.commons.lang3.time.FastDateParserSDFTest.testOriginal(FastDateParserSDFTest.java:122)

testUpperCasePP[44: hh 48 en_GB](org.apache.commons.lang3.time.FastDateParserSDFTest)  Time elapsed: 0 sec  <<< FAILURE!
java.lang.AssertionError: en_GB 48
 expected:<Sat Jan 03 00:00:00 UTC 1970> but was:<Thu Jan 01 00:00:00 UTC 1970>
	at org.junit.Assert.fail(Assert.java:88)
	at org.junit.Assert.failNotEquals(Assert.java:834)
	at org.junit.Assert.assertEquals(Assert.java:118)
	at org.apache.commons.lang3.time.FastDateParserSDFTest.checkParsePosition(FastDateParserSDFTest.java:222)
	at org.apache.commons.lang3.time.FastDateParserSDFTest.testUpperCasePP(FastDateParserSDFTest.java:137)

testUpperCase[44: hh 48 en_GB](org.apache.commons.lang3.time.FastDateParserSDFTest)  Time elapsed: 0.001 sec  <<< FAILURE!
java.lang.AssertionError: en_GB 48
 expected:<Sat Jan 03 00:00:00 UTC 1970> but was:<Thu Jan 01 00:00:00 UTC 1970>
	at org.junit.Assert.fail(Assert.java:88)
	at org.junit.Assert.failNotEquals(Assert.java:834)
	at org.junit.Assert.assertEquals(Assert.java:118)
	at org.apache.commons.lang3.time.FastDateParserSDFTest.checkParse(FastDateParserSDFTest.java:187)
	at org.apache.commons.lang3.time.FastDateParserSDFTest.testUpperCase(FastDateParserSDFTest.java:132)

testOriginalPP[44: hh 48 en_GB](org.apache.commons.lang3.time.FastDateParserSDFTest)  Time elapsed: 0 sec  <<< FAILURE!
java.lang.AssertionError: en_GB 48
 expected:<Sat Jan 03 00:00:00 UTC 1970> but was:<Thu Jan 01 00:00:00 UTC 1970>
	at org.junit.Assert.fail(Assert.java:88)
	at org.junit.Assert.failNotEquals(Assert.java:834)
	at org.junit.Assert.assertEquals(Assert.java:118)
	at org.apache.commons.lang3.time.FastDateParserSDFTest.checkParsePosition(FastDateParserSDFTest.java:222)
	at org.apache.commons.lang3.time.FastDateParserSDFTest.testOriginalPP(FastDateParserSDFTest.java:127)

testOriginal[44: hh 48 en_GB](org.apache.commons.lang3.time.FastDateParserSDFTest)  Time elapsed: 0 sec  <<< FAILURE!
java.lang.AssertionError: en_GB 48
 expected:<Sat Jan 03 00:00:00 UTC 1970> but was:<Thu Jan 01 00:00:00 UTC 1970>
	at org.junit.Assert.fail(Assert.java:88)
	at org.junit.Assert.failNotEquals(Assert.java:834)
	at org.junit.Assert.assertEquals(Assert.java:118)
	at org.apache.commons.lang3.time.FastDateParserSDFTest.checkParse(FastDateParserSDFTest.java:187)
	at org.apache.commons.lang3.time.FastDateParserSDFTest.testOriginal(FastDateParserSDFTest.java:122)

testUpperCasePP[45: kk 48 en_GB](org.apache.commons.lang3.time.FastDateParserSDFTest)  Time elapsed: 0 sec  <<< FAILURE!
java.lang.AssertionError: en_GB 48
 expected:<Sat Jan 03 00:00:00 UTC 1970> but was:<Thu Jan 01 00:00:00 UTC 1970>
	at org.junit.Assert.fail(Assert.java:88)
	at org.junit.Assert.failNotEquals(Assert.java:834)
	at org.junit.Assert.assertEquals(Assert.java:118)
	at org.apache.commons.lang3.time.FastDateParserSDFTest.checkParsePosition(FastDateParserSDFTest.java:222)
	at org.apache.commons.lang3.time.FastDateParserSDFTest.testUpperCasePP(FastDateParserSDFTest.java:137)

testUpperCase[45: kk 48 en_GB](org.apache.commons.lang3.time.FastDateParserSDFTest)  Time elapsed: 0 sec  <<< FAILURE!
java.lang.AssertionError: en_GB 48
 expected:<Sat Jan 03 00:00:00 UTC 1970> but was:<Thu Jan 01 00:00:00 UTC 1970>
	at org.junit.Assert.fail(Assert.java:88)
	at org.junit.Assert.failNotEquals(Assert.java:834)
	at org.junit.Assert.assertEquals(Assert.java:118)
	at org.apache.commons.lang3.time.FastDateParserSDFTest.checkParse(FastDateParserSDFTest.java:187)
	at org.apache.commons.lang3.time.FastDateParserSDFTest.testUpperCase(FastDateParserSDFTest.java:132)

testOriginalPP[45: kk 48 en_GB](org.apache.commons.lang3.time.FastDateParserSDFTest)  Time elapsed: 0 sec  <<< FAILURE!
java.lang.AssertionError: en_GB 48
 expected:<Sat Jan 03 00:00:00 UTC 1970> but was:<Thu Jan 01 00:00:00 UTC 1970>
	at org.junit.Assert.fail(Assert.java:88)
	at org.junit.Assert.failNotEquals(Assert.java:834)
	at org.junit.Assert.assertEquals(Assert.java:118)
	at org.apache.commons.lang3.time.FastDateParserSDFTest.checkParsePosition(FastDateParserSDFTest.java:222)
	at org.apache.commons.lang3.time.FastDateParserSDFTest.testOriginalPP(FastDateParserSDFTest.java:127)

testOriginal[45: kk 48 en_GB](org.apache.commons.lang3.time.FastDateParserSDFTest)  Time elapsed: 0 sec  <<< FAILURE!
java.lang.AssertionError: en_GB 48
 expected:<Sat Jan 03 00:00:00 UTC 1970> but was:<Thu Jan 01 00:00:00 UTC 1970>
	at org.junit.Assert.fail(Assert.java:88)
	at org.junit.Assert.failNotEquals(Assert.java:834)
	at org.junit.Assert.assertEquals(Assert.java:118)
	at org.apache.commons.lang3.time.FastDateParserSDFTest.checkParse(FastDateParserSDFTest.java:187)
	at org.apache.commons.lang3.time.FastDateParserSDFTest.testOriginal(FastDateParserSDFTest.java:122)

Running org.apache.commons.lang3.time.DateUtilsTest
DateUtilsTest: Default Locale=en_US
Tests run: 38, Failures: 0, Errors: 0, Skipped: 0, Time elapsed: 0.012 sec - in org.apache.commons.lang3.time.DateUtilsTest
Running org.apache.commons.lang3.reflect.InheritanceUtilsTest
Tests run: 9, Failures: 0, Errors: 0, Skipped: 0, Time elapsed: 0.003 sec - in org.apache.commons.lang3.reflect.InheritanceUtilsTest
Running org.apache.commons.lang3.reflect.MethodUtilsTest
Tests run: 23, Failures: 0, Errors: 0, Skipped: 0, Time elapsed: 0.029 sec - in org.apache.commons.lang3.reflect.MethodUtilsTest
Running org.apache.commons.lang3.reflect.ConstructorUtilsTest
Tests run: 7, Failures: 0, Errors: 0, Skipped: 0, Time elapsed: 0.003 sec - in org.apache.commons.lang3.reflect.ConstructorUtilsTest
Running org.apache.commons.lang3.reflect.FieldUtilsTest
Tests run: 64, Failures: 0, Errors: 0, Skipped: 0, Time elapsed: 0.045 sec - in org.apache.commons.lang3.reflect.FieldUtilsTest
Running org.apache.commons.lang3.reflect.TypeLiteralTest
Tests run: 4, Failures: 0, Errors: 0, Skipped: 0, Time elapsed: 0.011 sec - in org.apache.commons.lang3.reflect.TypeLiteralTest
Running org.apache.commons.lang3.reflect.TypeUtilsTest
Tests run: 19, Failures: 0, Errors: 0, Skipped: 0, Time elapsed: 0.058 sec - in org.apache.commons.lang3.reflect.TypeUtilsTest
Running org.apache.commons.lang3.mutable.MutableByteTest
Tests run: 17, Failures: 0, Errors: 0, Skipped: 0, Time elapsed: 0.009 sec - in org.apache.commons.lang3.mutable.MutableByteTest
Running org.apache.commons.lang3.mutable.MutableShortTest
Tests run: 14, Failures: 0, Errors: 0, Skipped: 0, Time elapsed: 0.007 sec - in org.apache.commons.lang3.mutable.MutableShortTest
Running org.apache.commons.lang3.mutable.MutableIntTest
Tests run: 17, Failures: 0, Errors: 0, Skipped: 0, Time elapsed: 0.009 sec - in org.apache.commons.lang3.mutable.MutableIntTest
Running org.apache.commons.lang3.mutable.MutableDoubleTest
Tests run: 18, Failures: 0, Errors: 0, Skipped: 0, Time elapsed: 0.006 sec - in org.apache.commons.lang3.mutable.MutableDoubleTest
Running org.apache.commons.lang3.mutable.MutableFloatTest
Tests run: 18, Failures: 0, Errors: 0, Skipped: 0, Time elapsed: 0.002 sec - in org.apache.commons.lang3.mutable.MutableFloatTest
Running org.apache.commons.lang3.mutable.MutableLongTest
Tests run: 17, Failures: 0, Errors: 0, Skipped: 0, Time elapsed: 0.003 sec - in org.apache.commons.lang3.mutable.MutableLongTest
Running org.apache.commons.lang3.mutable.MutableBooleanTest
Tests run: 9, Failures: 0, Errors: 0, Skipped: 0, Time elapsed: 0.002 sec - in org.apache.commons.lang3.mutable.MutableBooleanTest
Running org.apache.commons.lang3.mutable.MutableObjectTest
Tests run: 5, Failures: 0, Errors: 0, Skipped: 0, Time elapsed: 0 sec - in org.apache.commons.lang3.mutable.MutableObjectTest
Running org.apache.commons.lang3.text.translate.UnicodeEscaperTest
Tests run: 3, Failures: 0, Errors: 0, Skipped: 0, Time elapsed: 0 sec - in org.apache.commons.lang3.text.translate.UnicodeEscaperTest
Running org.apache.commons.lang3.text.translate.EntityArraysTest
Tests run: 3, Failures: 0, Errors: 0, Skipped: 0, Time elapsed: 0.001 sec - in org.apache.commons.lang3.text.translate.EntityArraysTest
Running org.apache.commons.lang3.text.translate.UnicodeUnpairedSurrogateRemoverTest
Tests run: 2, Failures: 0, Errors: 0, Skipped: 0, Time elapsed: 0.001 sec - in org.apache.commons.lang3.text.translate.UnicodeUnpairedSurrogateRemoverTest
Running org.apache.commons.lang3.text.translate.NumericEntityUnescaperTest
Tests run: 3, Failures: 0, Errors: 0, Skipped: 0, Time elapsed: 0 sec - in org.apache.commons.lang3.text.translate.NumericEntityUnescaperTest
Running org.apache.commons.lang3.text.translate.NumericEntityEscaperTest
Tests run: 4, Failures: 0, Errors: 0, Skipped: 0, Time elapsed: 0.001 sec - in org.apache.commons.lang3.text.translate.NumericEntityEscaperTest
Running org.apache.commons.lang3.text.translate.LookupTranslatorTest
Tests run: 2, Failures: 0, Errors: 0, Skipped: 0, Time elapsed: 0 sec - in org.apache.commons.lang3.text.translate.LookupTranslatorTest
Running org.apache.commons.lang3.text.translate.UnicodeUnescaperTest
Tests run: 3, Failures: 0, Errors: 0, Skipped: 0, Time elapsed: 0 sec - in org.apache.commons.lang3.text.translate.UnicodeUnescaperTest
Running org.apache.commons.lang3.text.translate.OctalUnescaperTest
Tests run: 1, Failures: 0, Errors: 0, Skipped: 0, Time elapsed: 0.001 sec - in org.apache.commons.lang3.text.translate.OctalUnescaperTest
Running org.apache.commons.lang3.text.StrMatcherTest
Tests run: 14, Failures: 0, Errors: 0, Skipped: 0, Time elapsed: 0.002 sec - in org.apache.commons.lang3.text.StrMatcherTest
Running org.apache.commons.lang3.text.StrTokenizerTest
Tests run: 55, Failures: 0, Errors: 0, Skipped: 0, Time elapsed: 0.016 sec - in org.apache.commons.lang3.text.StrTokenizerTest
Running org.apache.commons.lang3.text.FormattableUtilsTest
Tests run: 5, Failures: 0, Errors: 0, Skipped: 0, Time elapsed: 0 sec - in org.apache.commons.lang3.text.FormattableUtilsTest
Running org.apache.commons.lang3.text.CompositeFormatTest
Tests run: 2, Failures: 0, Errors: 0, Skipped: 0, Time elapsed: 0.001 sec - in org.apache.commons.lang3.text.CompositeFormatTest
Running org.apache.commons.lang3.text.WordUtilsTest
Tests run: 12, Failures: 0, Errors: 0, Skipped: 0, Time elapsed: 0.003 sec - in org.apache.commons.lang3.text.WordUtilsTest
Running org.apache.commons.lang3.text.StrLookupTest
Tests run: 5, Failures: 0, Errors: 0, Skipped: 0, Time elapsed: 0.002 sec - in org.apache.commons.lang3.text.StrLookupTest
Running org.apache.commons.lang3.text.StrBuilderAppendInsertTest
Tests run: 51, Failures: 0, Errors: 0, Skipped: 0, Time elapsed: 0.013 sec - in org.apache.commons.lang3.text.StrBuilderAppendInsertTest
Running org.apache.commons.lang3.text.ExtendedMessageFormatTest
Tests run: 10, Failures: 0, Errors: 0, Skipped: 0, Time elapsed: 1.347 sec - in org.apache.commons.lang3.text.ExtendedMessageFormatTest
Running org.apache.commons.lang3.text.StrSubstitutorTest
Tests run: 40, Failures: 0, Errors: 0, Skipped: 0, Time elapsed: 0.038 sec - in org.apache.commons.lang3.text.StrSubstitutorTest
Running org.apache.commons.lang3.text.StrBuilderTest
Tests run: 90, Failures: 0, Errors: 0, Skipped: 0, Time elapsed: 0.047 sec - in org.apache.commons.lang3.text.StrBuilderTest
Running org.apache.commons.lang3.StringEscapeUtilsTest
Tests run: 28, Failures: 0, Errors: 0, Skipped: 0, Time elapsed: 0.553 sec - in org.apache.commons.lang3.StringEscapeUtilsTest
Running org.apache.commons.lang3.AnnotationUtilsTest
Tests run: 10, Failures: 0, Errors: 0, Skipped: 0, Time elapsed: 0.016 sec - in org.apache.commons.lang3.AnnotationUtilsTest
Running org.apache.commons.lang3.ConversionTest
Tests run: 42, Failures: 0, Errors: 0, Skipped: 0, Time elapsed: 0.011 sec - in org.apache.commons.lang3.ConversionTest
Running org.apache.commons.lang3.StringUtilsTrimEmptyTest
Tests run: 15, Failures: 0, Errors: 0, Skipped: 0, Time elapsed: 0.026 sec - in org.apache.commons.lang3.StringUtilsTrimEmptyTest
Running org.apache.commons.lang3.EnumUtilsTest
Tests run: 34, Failures: 0, Errors: 0, Skipped: 0, Time elapsed: 0.011 sec - in org.apache.commons.lang3.EnumUtilsTest
Running org.apache.commons.lang3.exception.ExceptionUtilsTest
Tests run: 28, Failures: 0, Errors: 0, Skipped: 0, Time elapsed: 0.03 sec - in org.apache.commons.lang3.exception.ExceptionUtilsTest
Running org.apache.commons.lang3.exception.DefaultExceptionContextTest
Tests run: 8, Failures: 0, Errors: 0, Skipped: 0, Time elapsed: 0.006 sec - in org.apache.commons.lang3.exception.DefaultExceptionContextTest
Running org.apache.commons.lang3.exception.ContextedExceptionTest
Tests run: 14, Failures: 0, Errors: 0, Skipped: 0, Time elapsed: 0.011 sec - in org.apache.commons.lang3.exception.ContextedExceptionTest
Running org.apache.commons.lang3.exception.ContextedRuntimeExceptionTest
Tests run: 14, Failures: 0, Errors: 0, Skipped: 0, Time elapsed: 0.011 sec - in org.apache.commons.lang3.exception.ContextedRuntimeExceptionTest
Running org.apache.commons.lang3.BitFieldTest
Tests run: 15, Failures: 0, Errors: 0, Skipped: 0, Time elapsed: 0.002 sec - in org.apache.commons.lang3.BitFieldTest
Running org.apache.commons.lang3.ArrayUtilsRemoveMultipleTest
Tests run: 55, Failures: 0, Errors: 0, Skipped: 0, Time elapsed: 0.02 sec - in org.apache.commons.lang3.ArrayUtilsRemoveMultipleTest
Running org.apache.commons.lang3.HashSetvBitSetTest
Ratio=8% array=100 count=1 extract=23722409 bitset=1932924
Ratio=10% array=100 count=10 extract=18810987 bitset=1974083
Ratio=16% array=100 count=50 extract=10527284 bitset=1742421
Ratio=4% array=100 count=100 extract=10759992 bitset=459923
Ratio=249% array=1000 count=10 extract=6760998 bitset=16845898
Ratio=30% array=1000 count=100 extract=17382661 bitset=5328514
Ratio=7% array=1000 count=500 extract=45821049 bitset=3576498
Ratio=1% array=1000 count=1000 extract=75697815 bitset=779728
Ratio=294% count=0 hash=1226212 bits=3608541
Ratio=14% count=5 hash=1426731 bits=207654
Ratio=18% count=10 hash=1799577 bits=327582
Ratio=21% count=200 hash=20952524 bits=4569401
Ratio=15% count=50 hash=8710139 bits=1370538
Ratio=28% count=100 hash=9327601 bits=2628000
Ratio=22% count=1000 hash=79593107 bits=17657401
Ratio=20% count=2000 hash=169296167 bits=34895456
Tests run: 2, Failures: 0, Errors: 0, Skipped: 0, Time elapsed: 0.71 sec - in org.apache.commons.lang3.HashSetvBitSetTest
Running org.apache.commons.lang3.StringUtilsTest
Tests run: 124, Failures: 0, Errors: 0, Skipped: 0, Time elapsed: 0.203 sec - in org.apache.commons.lang3.StringUtilsTest
Running org.apache.commons.lang3.ArrayUtilsRemoveTest
Tests run: 19, Failures: 0, Errors: 0, Skipped: 0, Time elapsed: 0.01 sec - in org.apache.commons.lang3.ArrayUtilsRemoveTest
Running org.apache.commons.lang3.ObjectUtilsTest
Tests run: 36, Failures: 0, Errors: 0, Skipped: 0, Time elapsed: 0.024 sec - in org.apache.commons.lang3.ObjectUtilsTest
Running org.apache.commons.lang3.ClassPathUtilsTest
Tests run: 13, Failures: 0, Errors: 0, Skipped: 0, Time elapsed: 0.008 sec - in org.apache.commons.lang3.ClassPathUtilsTest
Running org.apache.commons.lang3.math.NumberUtilsTest
Tests run: 91, Failures: 0, Errors: 0, Skipped: 0, Time elapsed: 0.045 sec - in org.apache.commons.lang3.math.NumberUtilsTest
Running org.apache.commons.lang3.math.IEEE754rUtilsTest
Tests run: 3, Failures: 0, Errors: 0, Skipped: 0, Time elapsed: 0.003 sec - in org.apache.commons.lang3.math.IEEE754rUtilsTest
Running org.apache.commons.lang3.math.FractionTest
Tests run: 25, Failures: 0, Errors: 0, Skipped: 0, Time elapsed: 0.107 sec - in org.apache.commons.lang3.math.FractionTest
Running org.apache.commons.lang3.BooleanUtilsTest
Tests run: 72, Failures: 0, Errors: 0, Skipped: 0, Time elapsed: 0.018 sec - in org.apache.commons.lang3.BooleanUtilsTest
Running org.apache.commons.lang3.CharSequenceUtilsTest
Tests run: 2, Failures: 0, Errors: 0, Skipped: 0, Time elapsed: 0.001 sec - in org.apache.commons.lang3.CharSequenceUtilsTest
Running org.apache.commons.lang3.CharSetUtilsTest
Tests run: 11, Failures: 0, Errors: 0, Skipped: 0, Time elapsed: 0.001 sec - in org.apache.commons.lang3.CharSetUtilsTest
Running org.apache.commons.lang3.ArrayUtilsAddTest
Tests run: 13, Failures: 0, Errors: 0, Skipped: 0, Time elapsed: 0.001 sec - in org.apache.commons.lang3.ArrayUtilsAddTest
Running org.apache.commons.lang3.CharEncodingTest
Tests run: 6, Failures: 0, Errors: 0, Skipped: 0, Time elapsed: 0.023 sec - in org.apache.commons.lang3.CharEncodingTest
Running org.apache.commons.lang3.ClassUtilsTest
Tests run: 57, Failures: 0, Errors: 0, Skipped: 0, Time elapsed: 0.03 sec - in org.apache.commons.lang3.ClassUtilsTest
Running org.apache.commons.lang3.RangeTest
Tests run: 24, Failures: 0, Errors: 0, Skipped: 0, Time elapsed: 0.006 sec - in org.apache.commons.lang3.RangeTest
Running org.apache.commons.lang3.event.EventUtilsTest
Tests run: 8, Failures: 0, Errors: 0, Skipped: 0, Time elapsed: 0.014 sec - in org.apache.commons.lang3.event.EventUtilsTest
Running org.apache.commons.lang3.event.EventListenerSupportTest
Tests run: 9, Failures: 0, Errors: 0, Skipped: 0, Time elapsed: 0.029 sec - in org.apache.commons.lang3.event.EventListenerSupportTest
Running org.apache.commons.lang3.ArrayUtilsTest
Tests run: 205, Failures: 0, Errors: 0, Skipped: 0, Time elapsed: 0.052 sec - in org.apache.commons.lang3.ArrayUtilsTest
Running org.apache.commons.lang3.CharUtilsTest
Tests run: 24, Failures: 0, Errors: 0, Skipped: 0, Time elapsed: 0.001 sec - in org.apache.commons.lang3.CharUtilsTest
Running org.apache.commons.lang3.NotImplementedExceptionTest
Tests run: 1, Failures: 0, Errors: 0, Skipped: 0, Time elapsed: 0.002 sec - in org.apache.commons.lang3.NotImplementedExceptionTest
Running org.apache.commons.lang3.StringUtilsEqualsIndexOfTest
Tests run: 50, Failures: 0, Errors: 0, Skipped: 0, Time elapsed: 0.005 sec - in org.apache.commons.lang3.StringUtilsEqualsIndexOfTest
Running org.apache.commons.lang3.RandomUtilsTest
Tests run: 23, Failures: 0, Errors: 0, Skipped: 0, Time elapsed: 0.001 sec - in org.apache.commons.lang3.RandomUtilsTest

Results :

Failed tests: 
  DateFormatUtilsTest.testDateTimeISO:137 expected:<Sat Feb 23 09:11:12 UTC 2002> but was:<Wed Dec 31 23:00:00 UTC 1969>
  FastDateFormatTest.testParseSync:278->measureTime:322 expected:<0> but was:<100000>
  FastDateFormat_ParserTest>FastDateParserTest.test1806:633 India Standard Time;+05 expected:<981268736235> but was:<-21600000>
  FastDateFormat_ParserTest>FastDateParserTest.testAmPm:174 expected:<Sun Aug 01 05:33:20 BST 2010> but was:<Thu Jan 01 06:00:00 GMT 1970>
  FastDateFormat_ParserTest>FastDateParserTest.testDayOf:465 expected:<Mon Feb 10 05:00:00 GMT 2003> but was:<Thu Jan 01 06:00:00 GMT 1970>
  FastDateFormat_ParserTest>FastDateParserTest.testLANG_832:411->FastDateParserTest.testSdfAndFdp:455 Parsed dates should be equal expected:<Sat Jan 03 06:00:00 GMT 1970> but was:<Thu Jan 01 06:00:00 GMT 1970>
  FastDateFormat_ParserTest>FastDateParserTest.testLang538:535 expected:<Fri Oct 16 17:42:16 BST 2009> but was:<Thu Jan 01 01:00:00 GMT 1970>
  FastDateFormat_ParserTest>FastDateParserTest.testLang996:580 expected:<Wed May 14 05:00:00 BST 2014> but was:<Thu Jan 01 06:00:00 GMT 1970>
  FastDateFormat_ParserTest>FastDateParserTest.testLocales_LongNoEra_AD:303->FastDateParserTest.testLocales:338->FastDateParserTest.checkParse:358->FastDateParserTest.checkParse:366 ms_MY 2003/Februari/0010/0012/0000/00/AM/Isnin
 expected:<Mon Feb 10 00:00:00 GMT 2003> but was:<Thu Jan 01 00:00:00 GMT 1970>
  FastDateFormat_ParserTest>FastDateParserTest.testLocales_LongNoEra_BC:308->FastDateParserTest.testLocales:338->FastDateParserTest.checkParse:358->FastDateParserTest.checkParse:366 ms_MY 2003/Februari/0010/0012/0000/00/AM/Sabtu
 expected:<Mon Feb 10 00:00:00 GMT 2003> but was:<Thu Jan 01 00:00:00 GMT 1970>
  FastDateFormat_ParserTest>FastDateParserTest.testLocales_Long_AD:283->FastDateParserTest.testLocales:338->FastDateParserTest.checkParse:358->FastDateParserTest.checkParse:366 ms_MY CE/2003/Februari/0010/0012/0000/00/AM/Isnin
 expected:<Mon Feb 10 00:00:00 GMT 2003> but was:<Thu Jan 01 00:00:00 GMT 1970>
  FastDateFormat_ParserTest>FastDateParserTest.testLocales_Long_BC:288->FastDateParserTest.testLocales:338->FastDateParserTest.checkParse:358->FastDateParserTest.checkParse:366 ms_MY BCE/2003/Februari/0010/0012/0000/00/AM/Sabtu
 expected:<Sat Feb 10 00:00:00 GMT 2003> but was:<Thu Jan 01 00:00:00 GMT 1970>
  FastDateFormat_ParserTest>FastDateParserTest.testLocales_ShortNoEra_AD:313->FastDateParserTest.testLocales:338->FastDateParserTest.checkParse:358->FastDateParserTest.checkParse:366 ms_MY 2003/2/10/12/AM/0/0/Isn
 expected:<Mon Feb 10 00:00:00 GMT 2003> but was:<Thu Jan 01 00:00:00 GMT 1970>
  FastDateFormat_ParserTest>FastDateParserTest.testLocales_ShortNoEra_BC:318->FastDateParserTest.testLocales:338->FastDateParserTest.checkParse:358->FastDateParserTest.checkParse:366 ms_MY 2003/2/10/12/AM/0/0/Sab
 expected:<Mon Feb 10 00:00:00 GMT 2003> but was:<Thu Jan 01 00:00:00 GMT 1970>
  FastDateFormat_ParserTest>FastDateParserTest.testLocales_Short_AD:293->FastDateParserTest.testLocales:338->FastDateParserTest.checkParse:358->FastDateParserTest.checkParse:366 ms_MY CE/2003/2/10/12/AM/0/0/Isn
 expected:<Mon Feb 10 00:00:00 GMT 2003> but was:<Thu Jan 01 00:00:00 GMT 1970>
  FastDateFormat_ParserTest>FastDateParserTest.testLocales_Short_BC:298->FastDateParserTest.testLocales:338->FastDateParserTest.checkParse:358->FastDateParserTest.checkParse:366 ms_MY BCE/2003/2/10/12/AM/0/0/Sab
 expected:<Sat Feb 10 00:00:00 GMT 2003> but was:<Thu Jan 01 00:00:00 GMT 1970>
  FastDateFormat_ParserTest>FastDateParserTest.testLowYearPadding:496 expected:<Sat Jan 01 00:00:00 GMT 1> but was:<Thu Jan 01 00:00:00 GMT 1970>
  FastDateFormat_ParserTest>FastDateParserTest.testMilleniumBug:512 expected:<Mon Jan 01 00:00:00 GMT 1000> but was:<Thu Jan 01 00:00:00 GMT 1970>
  FastDateFormat_ParserTest>FastDateParserTest.testParseLongShort:150 expected:<Mon Feb 10 20:33:20 GMT 2003> but was:<Thu Jan 01 06:00:00 GMT 1970>
  FastDateFormat_ParserTest>FastDateParserTest.testParseNumerics:377 expected:<Mon Feb 10 20:33:20 GMT 2003> but was:<Thu Jan 01 06:00:00 GMT 1970>
  FastDateFormat_ParserTest>FastDateParserTest.testParseZone:124 expected:<Thu Jul 10 21:33:20 BST 2003> but was:<Thu Jan 01 06:00:00 GMT 1970>
  FastDateFormat_ParserTest>FastDateParserTest.testParses:251->FastDateParserTest.validateSdfFormatFdpParseEquality:228 ms_MY Thu Feb 10 05:00:00 GMT 2000 GGGG/yyyy/MMMM/dddd/hhhh/mmmm/ss/aaaa/EEEE America/New_York expected:<Thu Feb 10 05:00:00 GMT 2000> but was:<Thu Jan 01 06:00:00 GMT 1970>
  FastDateFormat_ParserTest>FastDateParserTest.testQuotes:388 expected:<Mon Feb 10 20:33:20 GMT 2003> but was:<Thu Jan 01 06:00:00 GMT 1970>
  FastDateFormat_ParserTest>FastDateParserTest.testShortDateStyleWithLocales:479 expected:<Tue Feb 03 00:00:00 GMT 2004> but was:<Thu Jan 01 00:00:00 GMT 1970>
  FastDateFormat_ParserTest>FastDateParserTest.testTzParses:275 tz:America/New_York locale:Malay (Malaysia) expected:<Thu Feb 10 05:00:00 GMT 2000> but was:<Thu Jan 01 00:00:00 GMT 1970>
  FastDateParserSDFTest.testOriginalPP:127->checkParsePosition:222 en_GB GMT 2010
 expected:<Fri Jan 01 00:00:00 UTC 2010> but was:<Thu Jan 01 00:00:00 UTC 1970>
  FastDateParserSDFTest.testOriginalPP:127->checkParsePosition:222 en_GB 01
 expected:<Thu Jan 01 01:00:00 UTC 1970> but was:<Thu Jan 01 00:00:00 UTC 1970>
  FastDateParserSDFTest.testOriginalPP:127->checkParsePosition:222 en_GB 01
 expected:<Thu Jan 01 01:00:00 UTC 1970> but was:<Thu Jan 01 00:00:00 UTC 1970>
  FastDateParserSDFTest.testOriginalPP:127->checkParsePosition:222 en_GB 01
 expected:<Thu Jan 01 01:00:00 UTC 1970> but was:<Thu Jan 01 00:00:00 UTC 1970>
  FastDateParserSDFTest.testOriginalPP:127->checkParsePosition:222 en_GB 01
 expected:<Thu Jan 01 01:00:00 UTC 1970> but was:<Thu Jan 01 00:00:00 UTC 1970>
  FastDateParserSDFTest.testOriginalPP:127->checkParsePosition:222 en_GB 11
 expected:<Thu Jan 01 11:00:00 UTC 1970> but was:<Thu Jan 01 00:00:00 UTC 1970>
  FastDateParserSDFTest.testOriginalPP:127->checkParsePosition:222 en_GB 11
 expected:<Thu Jan 01 11:00:00 UTC 1970> but was:<Thu Jan 01 00:00:00 UTC 1970>
  FastDateParserSDFTest.testOriginalPP:127->checkParsePosition:222 en_GB 11
 expected:<Thu Jan 01 11:00:00 UTC 1970> but was:<Thu Jan 01 00:00:00 UTC 1970>
  FastDateParserSDFTest.testOriginalPP:127->checkParsePosition:222 en_GB 11
 expected:<Thu Jan 01 11:00:00 UTC 1970> but was:<Thu Jan 01 00:00:00 UTC 1970>
  FastDateParserSDFTest.testOriginalPP:127->checkParsePosition:222 en_GB 12
 expected:<Thu Jan 01 12:00:00 UTC 1970> but was:<Thu Jan 01 00:00:00 UTC 1970>
  FastDateParserSDFTest.testOriginalPP:127->checkParsePosition:222 en_GB 12
 expected:<Thu Jan 01 12:00:00 UTC 1970> but was:<Thu Jan 01 00:00:00 UTC 1970>
  FastDateParserSDFTest.testOriginalPP:127->checkParsePosition:222 en_GB 12
 expected:<Thu Jan 01 12:00:00 UTC 1970> but was:<Thu Jan 01 00:00:00 UTC 1970>
  FastDateParserSDFTest.testOriginalPP:127->checkParsePosition:222 en_GB 13
 expected:<Thu Jan 01 13:00:00 UTC 1970> but was:<Thu Jan 01 00:00:00 UTC 1970>
  FastDateParserSDFTest.testOriginalPP:127->checkParsePosition:222 en_GB 13
 expected:<Thu Jan 01 13:00:00 UTC 1970> but was:<Thu Jan 01 00:00:00 UTC 1970>
  FastDateParserSDFTest.testOriginalPP:127->checkParsePosition:222 en_GB 13
 expected:<Thu Jan 01 13:00:00 UTC 1970> but was:<Thu Jan 01 00:00:00 UTC 1970>
  FastDateParserSDFTest.testOriginalPP:127->checkParsePosition:222 en_GB 13
 expected:<Thu Jan 01 13:00:00 UTC 1970> but was:<Thu Jan 01 00:00:00 UTC 1970>
  FastDateParserSDFTest.testOriginalPP:127->checkParsePosition:222 en_GB 23
 expected:<Thu Jan 01 23:00:00 UTC 1970> but was:<Thu Jan 01 00:00:00 UTC 1970>
  FastDateParserSDFTest.testOriginalPP:127->checkParsePosition:222 en_GB 23
 expected:<Thu Jan 01 23:00:00 UTC 1970> but was:<Thu Jan 01 00:00:00 UTC 1970>
  FastDateParserSDFTest.testOriginalPP:127->checkParsePosition:222 en_GB 23
 expected:<Thu Jan 01 23:00:00 UTC 1970> but was:<Thu Jan 01 00:00:00 UTC 1970>
  FastDateParserSDFTest.testOriginalPP:127->checkParsePosition:222 en_GB 23
 expected:<Thu Jan 01 23:00:00 UTC 1970> but was:<Thu Jan 01 00:00:00 UTC 1970>
  FastDateParserSDFTest.testOriginalPP:127->checkParsePosition:222 en_GB 24
 expected:<Fri Jan 02 00:00:00 UTC 1970> but was:<Thu Jan 01 00:00:00 UTC 1970>
  FastDateParserSDFTest.testOriginalPP:127->checkParsePosition:222 en_GB 24
 expected:<Fri Jan 02 00:00:00 UTC 1970> but was:<Thu Jan 01 00:00:00 UTC 1970>
  FastDateParserSDFTest.testOriginalPP:127->checkParsePosition:222 en_GB 24
 expected:<Fri Jan 02 00:00:00 UTC 1970> but was:<Thu Jan 01 00:00:00 UTC 1970>
  FastDateParserSDFTest.testOriginalPP:127->checkParsePosition:222 en_GB 25
 expected:<Fri Jan 02 01:00:00 UTC 1970> but was:<Thu Jan 01 00:00:00 UTC 1970>
  FastDateParserSDFTest.testOriginalPP:127->checkParsePosition:222 en_GB 25
 expected:<Fri Jan 02 01:00:00 UTC 1970> but was:<Thu Jan 01 00:00:00 UTC 1970>
  FastDateParserSDFTest.testOriginalPP:127->checkParsePosition:222 en_GB GMT-12:34 2010
 expected:<Fri Jan 01 12:34:00 UTC 2010> but was:<Thu Jan 01 00:00:00 UTC 1970>
  FastDateParserSDFTest.testOriginalPP:127->checkParsePosition:222 en_GB 25
 expected:<Fri Jan 02 01:00:00 UTC 1970> but was:<Thu Jan 01 00:00:00 UTC 1970>
  FastDateParserSDFTest.testOriginalPP:127->checkParsePosition:222 en_GB 25
 expected:<Fri Jan 02 01:00:00 UTC 1970> but was:<Thu Jan 01 00:00:00 UTC 1970>
  FastDateParserSDFTest.testOriginalPP:127->checkParsePosition:222 en_GB 48
 expected:<Sat Jan 03 00:00:00 UTC 1970> but was:<Thu Jan 01 00:00:00 UTC 1970>
  FastDateParserSDFTest.testOriginalPP:127->checkParsePosition:222 en_GB 48
 expected:<Sat Jan 03 00:00:00 UTC 1970> but was:<Thu Jan 01 00:00:00 UTC 1970>
  FastDateParserSDFTest.testOriginalPP:127->checkParsePosition:222 en_GB 48
 expected:<Sat Jan 03 00:00:00 UTC 1970> but was:<Thu Jan 01 00:00:00 UTC 1970>
  FastDateParserSDFTest.testOriginalPP:127->checkParsePosition:222 en_GB 48
 expected:<Sat Jan 03 00:00:00 UTC 1970> but was:<Thu Jan 01 00:00:00 UTC 1970>
  FastDateParserSDFTest.testOriginalPP:127->checkParsePosition:222 en_GB GMT-1:23 2010
 expected:<Fri Jan 01 01:23:00 UTC 2010> but was:<Thu Jan 01 00:00:00 UTC 1970>
  FastDateParserSDFTest.testOriginalPP:127->checkParsePosition:222 en_GB -1234 2010
 expected:<Fri Jan 01 12:34:00 UTC 2010> but was:<Thu Jan 01 00:00:00 UTC 1970>
  FastDateParserSDFTest.testOriginalPP:127->checkParsePosition:222 en_GB 01/11/12
 expected:<Mon Jan 11 00:00:00 UTC 12> but was:<Thu Jan 01 00:00:00 UTC 1970>
  FastDateParserSDFTest.testOriginalPP:127->checkParsePosition:222 en_GB 01/11/12
 expected:<Wed Jan 11 00:00:00 UTC 2012> but was:<Thu Jan 01 00:00:00 UTC 1970>
  FastDateParserSDFTest.testOriginal:122->checkParse:187 en_GB GMT 2010
 expected:<Fri Jan 01 00:00:00 UTC 2010> but was:<Thu Jan 01 00:00:00 UTC 1970>
  FastDateParserSDFTest.testOriginal:122->checkParse:187 en_GB 01
 expected:<Thu Jan 01 01:00:00 UTC 1970> but was:<Thu Jan 01 00:00:00 UTC 1970>
  FastDateParserSDFTest.testOriginal:122->checkParse:187 en_GB 01
 expected:<Thu Jan 01 01:00:00 UTC 1970> but was:<Thu Jan 01 00:00:00 UTC 1970>
  FastDateParserSDFTest.testOriginal:122->checkParse:187 en_GB 01
 expected:<Thu Jan 01 01:00:00 UTC 1970> but was:<Thu Jan 01 00:00:00 UTC 1970>
  FastDateParserSDFTest.testOriginal:122->checkParse:187 en_GB 01
 expected:<Thu Jan 01 01:00:00 UTC 1970> but was:<Thu Jan 01 00:00:00 UTC 1970>
  FastDateParserSDFTest.testOriginal:122->checkParse:187 en_GB 11
 expected:<Thu Jan 01 11:00:00 UTC 1970> but was:<Thu Jan 01 00:00:00 UTC 1970>
  FastDateParserSDFTest.testOriginal:122->checkParse:187 en_GB 11
 expected:<Thu Jan 01 11:00:00 UTC 1970> but was:<Thu Jan 01 00:00:00 UTC 1970>
  FastDateParserSDFTest.testOriginal:122->checkParse:187 en_GB 11
 expected:<Thu Jan 01 11:00:00 UTC 1970> but was:<Thu Jan 01 00:00:00 UTC 1970>
  FastDateParserSDFTest.testOriginal:122->checkParse:187 en_GB 11
 expected:<Thu Jan 01 11:00:00 UTC 1970> but was:<Thu Jan 01 00:00:00 UTC 1970>
  FastDateParserSDFTest.testOriginal:122->checkParse:187 en_GB 12
 expected:<Thu Jan 01 12:00:00 UTC 1970> but was:<Thu Jan 01 00:00:00 UTC 1970>
  FastDateParserSDFTest.testOriginal:122->checkParse:187 en_GB 12
 expected:<Thu Jan 01 12:00:00 UTC 1970> but was:<Thu Jan 01 00:00:00 UTC 1970>
  FastDateParserSDFTest.testOriginal:122->checkParse:187 en_GB 12
 expected:<Thu Jan 01 12:00:00 UTC 1970> but was:<Thu Jan 01 00:00:00 UTC 1970>
  FastDateParserSDFTest.testOriginal:122->checkParse:187 en_GB 13
 expected:<Thu Jan 01 13:00:00 UTC 1970> but was:<Thu Jan 01 00:00:00 UTC 1970>
  FastDateParserSDFTest.testOriginal:122->checkParse:187 en_GB 13
 expected:<Thu Jan 01 13:00:00 UTC 1970> but was:<Thu Jan 01 00:00:00 UTC 1970>
  FastDateParserSDFTest.testOriginal:122->checkParse:187 en_GB 13
 expected:<Thu Jan 01 13:00:00 UTC 1970> but was:<Thu Jan 01 00:00:00 UTC 1970>
  FastDateParserSDFTest.testOriginal:122->checkParse:187 en_GB 13
 expected:<Thu Jan 01 13:00:00 UTC 1970> but was:<Thu Jan 01 00:00:00 UTC 1970>
  FastDateParserSDFTest.testOriginal:122->checkParse:187 en_GB 23
 expected:<Thu Jan 01 23:00:00 UTC 1970> but was:<Thu Jan 01 00:00:00 UTC 1970>
  FastDateParserSDFTest.testOriginal:122->checkParse:187 en_GB 23
 expected:<Thu Jan 01 23:00:00 UTC 1970> but was:<Thu Jan 01 00:00:00 UTC 1970>
  FastDateParserSDFTest.testOriginal:122->checkParse:187 en_GB 23
 expected:<Thu Jan 01 23:00:00 UTC 1970> but was:<Thu Jan 01 00:00:00 UTC 1970>
  FastDateParserSDFTest.testOriginal:122->checkParse:187 en_GB 23
 expected:<Thu Jan 01 23:00:00 UTC 1970> but was:<Thu Jan 01 00:00:00 UTC 1970>
  FastDateParserSDFTest.testOriginal:122->checkParse:187 en_GB 24
 expected:<Fri Jan 02 00:00:00 UTC 1970> but was:<Thu Jan 01 00:00:00 UTC 1970>
  FastDateParserSDFTest.testOriginal:122->checkParse:187 en_GB 24
 expected:<Fri Jan 02 00:00:00 UTC 1970> but was:<Thu Jan 01 00:00:00 UTC 1970>
  FastDateParserSDFTest.testOriginal:122->checkParse:187 en_GB 24
 expected:<Fri Jan 02 00:00:00 UTC 1970> but was:<Thu Jan 01 00:00:00 UTC 1970>
  FastDateParserSDFTest.testOriginal:122->checkParse:187 en_GB 25
 expected:<Fri Jan 02 01:00:00 UTC 1970> but was:<Thu Jan 01 00:00:00 UTC 1970>
  FastDateParserSDFTest.testOriginal:122->checkParse:187 en_GB 25
 expected:<Fri Jan 02 01:00:00 UTC 1970> but was:<Thu Jan 01 00:00:00 UTC 1970>
  FastDateParserSDFTest.testOriginal:122->checkParse:187 en_GB GMT-12:34 2010
 expected:<Fri Jan 01 12:34:00 UTC 2010> but was:<Thu Jan 01 00:00:00 UTC 1970>
  FastDateParserSDFTest.testOriginal:122->checkParse:187 en_GB 25
 expected:<Fri Jan 02 01:00:00 UTC 1970> but was:<Thu Jan 01 00:00:00 UTC 1970>
  FastDateParserSDFTest.testOriginal:122->checkParse:187 en_GB 25
 expected:<Fri Jan 02 01:00:00 UTC 1970> but was:<Thu Jan 01 00:00:00 UTC 1970>
  FastDateParserSDFTest.testOriginal:122->checkParse:187 en_GB 48
 expected:<Sat Jan 03 00:00:00 UTC 1970> but was:<Thu Jan 01 00:00:00 UTC 1970>
  FastDateParserSDFTest.testOriginal:122->checkParse:187 en_GB 48
 expected:<Sat Jan 03 00:00:00 UTC 1970> but was:<Thu Jan 01 00:00:00 UTC 1970>
  FastDateParserSDFTest.testOriginal:122->checkParse:187 en_GB 48
 expected:<Sat Jan 03 00:00:00 UTC 1970> but was:<Thu Jan 01 00:00:00 UTC 1970>
  FastDateParserSDFTest.testOriginal:122->checkParse:187 en_GB 48
 expected:<Sat Jan 03 00:00:00 UTC 1970> but was:<Thu Jan 01 00:00:00 UTC 1970>
  FastDateParserSDFTest.testOriginal:122->checkParse:187 en_GB GMT-1:23 2010
 expected:<Fri Jan 01 01:23:00 UTC 2010> but was:<Thu Jan 01 00:00:00 UTC 1970>
  FastDateParserSDFTest.testOriginal:122->checkParse:187 en_GB -1234 2010
 expected:<Fri Jan 01 12:34:00 UTC 2010> but was:<Thu Jan 01 00:00:00 UTC 1970>
  FastDateParserSDFTest.testOriginal:122->checkParse:187 en_GB 01/11/12
 expected:<Mon Jan 11 00:00:00 UTC 12> but was:<Thu Jan 01 00:00:00 UTC 1970>
  FastDateParserSDFTest.testOriginal:122->checkParse:187 en_GB 01/11/12
 expected:<Wed Jan 11 00:00:00 UTC 2012> but was:<Thu Jan 01 00:00:00 UTC 1970>
  FastDateParserSDFTest.testUpperCasePP:137->checkParsePosition:222 en_GB GMT 2010
 expected:<Fri Jan 01 00:00:00 UTC 2010> but was:<Thu Jan 01 00:00:00 UTC 1970>
  FastDateParserSDFTest.testUpperCasePP:137->checkParsePosition:222 en_GB 01
 expected:<Thu Jan 01 01:00:00 UTC 1970> but was:<Thu Jan 01 00:00:00 UTC 1970>
  FastDateParserSDFTest.testUpperCasePP:137->checkParsePosition:222 en_GB 01
 expected:<Thu Jan 01 01:00:00 UTC 1970> but was:<Thu Jan 01 00:00:00 UTC 1970>
  FastDateParserSDFTest.testUpperCasePP:137->checkParsePosition:222 en_GB 01
 expected:<Thu Jan 01 01:00:00 UTC 1970> but was:<Thu Jan 01 00:00:00 UTC 1970>
  FastDateParserSDFTest.testUpperCasePP:137->checkParsePosition:222 en_GB 01
 expected:<Thu Jan 01 01:00:00 UTC 1970> but was:<Thu Jan 01 00:00:00 UTC 1970>
  FastDateParserSDFTest.testUpperCasePP:137->checkParsePosition:222 en_GB 11
 expected:<Thu Jan 01 11:00:00 UTC 1970> but was:<Thu Jan 01 00:00:00 UTC 1970>
  FastDateParserSDFTest.testUpperCasePP:137->checkParsePosition:222 en_GB 11
 expected:<Thu Jan 01 11:00:00 UTC 1970> but was:<Thu Jan 01 00:00:00 UTC 1970>
  FastDateParserSDFTest.testUpperCasePP:137->checkParsePosition:222 en_GB 11
 expected:<Thu Jan 01 11:00:00 UTC 1970> but was:<Thu Jan 01 00:00:00 UTC 1970>
  FastDateParserSDFTest.testUpperCasePP:137->checkParsePosition:222 en_GB 11
 expected:<Thu Jan 01 11:00:00 UTC 1970> but was:<Thu Jan 01 00:00:00 UTC 1970>
  FastDateParserSDFTest.testUpperCasePP:137->checkParsePosition:222 en_GB 12
 expected:<Thu Jan 01 12:00:00 UTC 1970> but was:<Thu Jan 01 00:00:00 UTC 1970>
  FastDateParserSDFTest.testUpperCasePP:137->checkParsePosition:222 en_GB 12
 expected:<Thu Jan 01 12:00:00 UTC 1970> but was:<Thu Jan 01 00:00:00 UTC 1970>
  FastDateParserSDFTest.testUpperCasePP:137->checkParsePosition:222 en_GB 12
 expected:<Thu Jan 01 12:00:00 UTC 1970> but was:<Thu Jan 01 00:00:00 UTC 1970>
  FastDateParserSDFTest.testUpperCasePP:137->checkParsePosition:222 en_GB 13
 expected:<Thu Jan 01 13:00:00 UTC 1970> but was:<Thu Jan 01 00:00:00 UTC 1970>
  FastDateParserSDFTest.testUpperCasePP:137->checkParsePosition:222 en_GB 13
 expected:<Thu Jan 01 13:00:00 UTC 1970> but was:<Thu Jan 01 00:00:00 UTC 1970>
  FastDateParserSDFTest.testUpperCasePP:137->checkParsePosition:222 en_GB 13
 expected:<Thu Jan 01 13:00:00 UTC 1970> but was:<Thu Jan 01 00:00:00 UTC 1970>
  FastDateParserSDFTest.testUpperCasePP:137->checkParsePosition:222 en_GB 13
 expected:<Thu Jan 01 13:00:00 UTC 1970> but was:<Thu Jan 01 00:00:00 UTC 1970>
  FastDateParserSDFTest.testUpperCasePP:137->checkParsePosition:222 en_GB 23
 expected:<Thu Jan 01 23:00:00 UTC 1970> but was:<Thu Jan 01 00:00:00 UTC 1970>
  FastDateParserSDFTest.testUpperCasePP:137->checkParsePosition:222 en_GB 23
 expected:<Thu Jan 01 23:00:00 UTC 1970> but was:<Thu Jan 01 00:00:00 UTC 1970>
  FastDateParserSDFTest.testUpperCasePP:137->checkParsePosition:222 en_GB 23
 expected:<Thu Jan 01 23:00:00 UTC 1970> but was:<Thu Jan 01 00:00:00 UTC 1970>
  FastDateParserSDFTest.testUpperCasePP:137->checkParsePosition:222 en_GB 23
 expected:<Thu Jan 01 23:00:00 UTC 1970> but was:<Thu Jan 01 00:00:00 UTC 1970>
  FastDateParserSDFTest.testUpperCasePP:137->checkParsePosition:222 en_GB 24
 expected:<Fri Jan 02 00:00:00 UTC 1970> but was:<Thu Jan 01 00:00:00 UTC 1970>
  FastDateParserSDFTest.testUpperCasePP:137->checkParsePosition:222 en_GB 24
 expected:<Fri Jan 02 00:00:00 UTC 1970> but was:<Thu Jan 01 00:00:00 UTC 1970>
  FastDateParserSDFTest.testUpperCasePP:137->checkParsePosition:222 en_GB 24
 expected:<Fri Jan 02 00:00:00 UTC 1970> but was:<Thu Jan 01 00:00:00 UTC 1970>
  FastDateParserSDFTest.testUpperCasePP:137->checkParsePosition:222 en_GB 25
 expected:<Fri Jan 02 01:00:00 UTC 1970> but was:<Thu Jan 01 00:00:00 UTC 1970>
  FastDateParserSDFTest.testUpperCasePP:137->checkParsePosition:222 en_GB 25
 expected:<Fri Jan 02 01:00:00 UTC 1970> but was:<Thu Jan 01 00:00:00 UTC 1970>
  FastDateParserSDFTest.testUpperCasePP:137->checkParsePosition:222 en_GB GMT-12:34 2010
 expected:<Fri Jan 01 12:34:00 UTC 2010> but was:<Thu Jan 01 00:00:00 UTC 1970>
  FastDateParserSDFTest.testUpperCasePP:137->checkParsePosition:222 en_GB 25
 expected:<Fri Jan 02 01:00:00 UTC 1970> but was:<Thu Jan 01 00:00:00 UTC 1970>
  FastDateParserSDFTest.testUpperCasePP:137->checkParsePosition:222 en_GB 25
 expected:<Fri Jan 02 01:00:00 UTC 1970> but was:<Thu Jan 01 00:00:00 UTC 1970>
  FastDateParserSDFTest.testUpperCasePP:137->checkParsePosition:222 en_GB 48
 expected:<Sat Jan 03 00:00:00 UTC 1970> but was:<Thu Jan 01 00:00:00 UTC 1970>
  FastDateParserSDFTest.testUpperCasePP:137->checkParsePosition:222 en_GB 48
 expected:<Sat Jan 03 00:00:00 UTC 1970> but was:<Thu Jan 01 00:00:00 UTC 1970>
  FastDateParserSDFTest.testUpperCasePP:137->checkParsePosition:222 en_GB 48
 expected:<Sat Jan 03 00:00:00 UTC 1970> but was:<Thu Jan 01 00:00:00 UTC 1970>
  FastDateParserSDFTest.testUpperCasePP:137->checkParsePosition:222 en_GB 48
 expected:<Sat Jan 03 00:00:00 UTC 1970> but was:<Thu Jan 01 00:00:00 UTC 1970>
  FastDateParserSDFTest.testUpperCasePP:137->checkParsePosition:222 en_GB GMT-1:23 2010
 expected:<Fri Jan 01 01:23:00 UTC 2010> but was:<Thu Jan 01 00:00:00 UTC 1970>
  FastDateParserSDFTest.testUpperCasePP:137->checkParsePosition:222 en_GB -1234 2010
 expected:<Fri Jan 01 12:34:00 UTC 2010> but was:<Thu Jan 01 00:00:00 UTC 1970>
  FastDateParserSDFTest.testUpperCasePP:137->checkParsePosition:222 en_GB 01/11/12
 expected:<Mon Jan 11 00:00:00 UTC 12> but was:<Thu Jan 01 00:00:00 UTC 1970>
  FastDateParserSDFTest.testUpperCasePP:137->checkParsePosition:222 en_GB 01/11/12
 expected:<Wed Jan 11 00:00:00 UTC 2012> but was:<Thu Jan 01 00:00:00 UTC 1970>
  FastDateParserSDFTest.testUpperCase:132->checkParse:187 en_GB GMT 2010
 expected:<Fri Jan 01 00:00:00 UTC 2010> but was:<Thu Jan 01 00:00:00 UTC 1970>
  FastDateParserSDFTest.testUpperCase:132->checkParse:187 en_GB 01
 expected:<Thu Jan 01 01:00:00 UTC 1970> but was:<Thu Jan 01 00:00:00 UTC 1970>
  FastDateParserSDFTest.testUpperCase:132->checkParse:187 en_GB 01
 expected:<Thu Jan 01 01:00:00 UTC 1970> but was:<Thu Jan 01 00:00:00 UTC 1970>
  FastDateParserSDFTest.testUpperCase:132->checkParse:187 en_GB 01
 expected:<Thu Jan 01 01:00:00 UTC 1970> but was:<Thu Jan 01 00:00:00 UTC 1970>
  FastDateParserSDFTest.testUpperCase:132->checkParse:187 en_GB 01
 expected:<Thu Jan 01 01:00:00 UTC 1970> but was:<Thu Jan 01 00:00:00 UTC 1970>
  FastDateParserSDFTest.testUpperCase:132->checkParse:187 en_GB 11
 expected:<Thu Jan 01 11:00:00 UTC 1970> but was:<Thu Jan 01 00:00:00 UTC 1970>
  FastDateParserSDFTest.testUpperCase:132->checkParse:187 en_GB 11
 expected:<Thu Jan 01 11:00:00 UTC 1970> but was:<Thu Jan 01 00:00:00 UTC 1970>
  FastDateParserSDFTest.testUpperCase:132->checkParse:187 en_GB 11
 expected:<Thu Jan 01 11:00:00 UTC 1970> but was:<Thu Jan 01 00:00:00 UTC 1970>
  FastDateParserSDFTest.testUpperCase:132->checkParse:187 en_GB 11
 expected:<Thu Jan 01 11:00:00 UTC 1970> but was:<Thu Jan 01 00:00:00 UTC 1970>
  FastDateParserSDFTest.testUpperCase:132->checkParse:187 en_GB 12
 expected:<Thu Jan 01 12:00:00 UTC 1970> but was:<Thu Jan 01 00:00:00 UTC 1970>
  FastDateParserSDFTest.testUpperCase:132->checkParse:187 en_GB 12
 expected:<Thu Jan 01 12:00:00 UTC 1970> but was:<Thu Jan 01 00:00:00 UTC 1970>
  FastDateParserSDFTest.testUpperCase:132->checkParse:187 en_GB 12
 expected:<Thu Jan 01 12:00:00 UTC 1970> but was:<Thu Jan 01 00:00:00 UTC 1970>
  FastDateParserSDFTest.testUpperCase:132->checkParse:187 en_GB 13
 expected:<Thu Jan 01 13:00:00 UTC 1970> but was:<Thu Jan 01 00:00:00 UTC 1970>
  FastDateParserSDFTest.testUpperCase:132->checkParse:187 en_GB 13
 expected:<Thu Jan 01 13:00:00 UTC 1970> but was:<Thu Jan 01 00:00:00 UTC 1970>
  FastDateParserSDFTest.testUpperCase:132->checkParse:187 en_GB 13
 expected:<Thu Jan 01 13:00:00 UTC 1970> but was:<Thu Jan 01 00:00:00 UTC 1970>
  FastDateParserSDFTest.testUpperCase:132->checkParse:187 en_GB 13
 expected:<Thu Jan 01 13:00:00 UTC 1970> but was:<Thu Jan 01 00:00:00 UTC 1970>
  FastDateParserSDFTest.testUpperCase:132->checkParse:187 en_GB 23
 expected:<Thu Jan 01 23:00:00 UTC 1970> but was:<Thu Jan 01 00:00:00 UTC 1970>
  FastDateParserSDFTest.testUpperCase:132->checkParse:187 en_GB 23
 expected:<Thu Jan 01 23:00:00 UTC 1970> but was:<Thu Jan 01 00:00:00 UTC 1970>
  FastDateParserSDFTest.testUpperCase:132->checkParse:187 en_GB 23
 expected:<Thu Jan 01 23:00:00 UTC 1970> but was:<Thu Jan 01 00:00:00 UTC 1970>
  FastDateParserSDFTest.testUpperCase:132->checkParse:187 en_GB 23
 expected:<Thu Jan 01 23:00:00 UTC 1970> but was:<Thu Jan 01 00:00:00 UTC 1970>
  FastDateParserSDFTest.testUpperCase:132->checkParse:187 en_GB 24
 expected:<Fri Jan 02 00:00:00 UTC 1970> but was:<Thu Jan 01 00:00:00 UTC 1970>
  FastDateParserSDFTest.testUpperCase:132->checkParse:187 en_GB 24
 expected:<Fri Jan 02 00:00:00 UTC 1970> but was:<Thu Jan 01 00:00:00 UTC 1970>
  FastDateParserSDFTest.testUpperCase:132->checkParse:187 en_GB 24
 expected:<Fri Jan 02 00:00:00 UTC 1970> but was:<Thu Jan 01 00:00:00 UTC 1970>
  FastDateParserSDFTest.testUpperCase:132->checkParse:187 en_GB 25
 expected:<Fri Jan 02 01:00:00 UTC 1970> but was:<Thu Jan 01 00:00:00 UTC 1970>
  FastDateParserSDFTest.testUpperCase:132->checkParse:187 en_GB 25
 expected:<Fri Jan 02 01:00:00 UTC 1970> but was:<Thu Jan 01 00:00:00 UTC 1970>
  FastDateParserSDFTest.testUpperCase:132->checkParse:187 en_GB GMT-12:34 2010
 expected:<Fri Jan 01 12:34:00 UTC 2010> but was:<Thu Jan 01 00:00:00 UTC 1970>
  FastDateParserSDFTest.testUpperCase:132->checkParse:187 en_GB 25
 expected:<Fri Jan 02 01:00:00 UTC 1970> but was:<Thu Jan 01 00:00:00 UTC 1970>
  FastDateParserSDFTest.testUpperCase:132->checkParse:187 en_GB 25
 expected:<Fri Jan 02 01:00:00 UTC 1970> but was:<Thu Jan 01 00:00:00 UTC 1970>
  FastDateParserSDFTest.testUpperCase:132->checkParse:187 en_GB 48
 expected:<Sat Jan 03 00:00:00 UTC 1970> but was:<Thu Jan 01 00:00:00 UTC 1970>
  FastDateParserSDFTest.testUpperCase:132->checkParse:187 en_GB 48
 expected:<Sat Jan 03 00:00:00 UTC 1970> but was:<Thu Jan 01 00:00:00 UTC 1970>
  FastDateParserSDFTest.testUpperCase:132->checkParse:187 en_GB 48
 expected:<Sat Jan 03 00:00:00 UTC 1970> but was:<Thu Jan 01 00:00:00 UTC 1970>
  FastDateParserSDFTest.testUpperCase:132->checkParse:187 en_GB 48
 expected:<Sat Jan 03 00:00:00 UTC 1970> but was:<Thu Jan 01 00:00:00 UTC 1970>
  FastDateParserSDFTest.testUpperCase:132->checkParse:187 en_GB GMT-1:23 2010
 expected:<Fri Jan 01 01:23:00 UTC 2010> but was:<Thu Jan 01 00:00:00 UTC 1970>
  FastDateParserSDFTest.testUpperCase:132->checkParse:187 en_GB -1234 2010
 expected:<Fri Jan 01 12:34:00 UTC 2010> but was:<Thu Jan 01 00:00:00 UTC 1970>
  FastDateParserSDFTest.testUpperCase:132->checkParse:187 en_GB 01/11/12
 expected:<Mon Jan 11 00:00:00 UTC 12> but was:<Thu Jan 01 00:00:00 UTC 1970>
  FastDateParserSDFTest.testUpperCase:132->checkParse:187 en_GB 01/11/12
 expected:<Wed Jan 11 00:00:00 UTC 2012> but was:<Thu Jan 01 00:00:00 UTC 1970>
  FastDateParserTest.test1806:633 India Standard Time;+05 expected:<981268736235> but was:<-21600000>
  FastDateParserTest.testAmPm:174 expected:<Sun Aug 01 05:33:20 BST 2010> but was:<Thu Jan 01 06:00:00 GMT 1970>
  FastDateParserTest.testDayOf:465 expected:<Mon Feb 10 05:00:00 GMT 2003> but was:<Thu Jan 01 06:00:00 GMT 1970>
  FastDateParserTest.testLANG_832:411->testSdfAndFdp:455 Parsed dates should be equal expected:<Sat Jan 03 06:00:00 GMT 1970> but was:<Thu Jan 01 06:00:00 GMT 1970>
  FastDateParserTest.testLang538:535 expected:<Fri Oct 16 17:42:16 BST 2009> but was:<Thu Jan 01 01:00:00 GMT 1970>
  FastDateParserTest.testLang996:580 expected:<Wed May 14 05:00:00 BST 2014> but was:<Thu Jan 01 06:00:00 GMT 1970>
  FastDateParserTest.testLocales_LongNoEra_AD:303->testLocales:338->checkParse:358->checkParse:366 ms_MY 2003/Februari/0010/0012/0000/00/AM/Isnin
 expected:<Mon Feb 10 00:00:00 GMT 2003> but was:<Thu Jan 01 00:00:00 GMT 1970>
  FastDateParserTest.testLocales_LongNoEra_BC:308->testLocales:338->checkParse:358->checkParse:366 ms_MY 2003/Februari/0010/0012/0000/00/AM/Sabtu
 expected:<Mon Feb 10 00:00:00 GMT 2003> but was:<Thu Jan 01 00:00:00 GMT 1970>
  FastDateParserTest.testLocales_Long_AD:283->testLocales:338->checkParse:358->checkParse:366 ms_MY CE/2003/Februari/0010/0012/0000/00/AM/Isnin
 expected:<Mon Feb 10 00:00:00 GMT 2003> but was:<Thu Jan 01 00:00:00 GMT 1970>
  FastDateParserTest.testLocales_Long_BC:288->testLocales:338->checkParse:358->checkParse:366 ms_MY BCE/2003/Februari/0010/0012/0000/00/AM/Sabtu
 expected:<Sat Feb 10 00:00:00 GMT 2003> but was:<Thu Jan 01 00:00:00 GMT 1970>
  FastDateParserTest.testLocales_ShortNoEra_AD:313->testLocales:338->checkParse:358->checkParse:366 ms_MY 2003/2/10/12/AM/0/0/Isn
 expected:<Mon Feb 10 00:00:00 GMT 2003> but was:<Thu Jan 01 00:00:00 GMT 1970>
  FastDateParserTest.testLocales_ShortNoEra_BC:318->testLocales:338->checkParse:358->checkParse:366 ms_MY 2003/2/10/12/AM/0/0/Sab
 expected:<Mon Feb 10 00:00:00 GMT 2003> but was:<Thu Jan 01 00:00:00 GMT 1970>
  FastDateParserTest.testLocales_Short_AD:293->testLocales:338->checkParse:358->checkParse:366 ms_MY CE/2003/2/10/12/AM/0/0/Isn
 expected:<Mon Feb 10 00:00:00 GMT 2003> but was:<Thu Jan 01 00:00:00 GMT 1970>
  FastDateParserTest.testLocales_Short_BC:298->testLocales:338->checkParse:358->checkParse:366 ms_MY BCE/2003/2/10/12/AM/0/0/Sab
 expected:<Sat Feb 10 00:00:00 GMT 2003> but was:<Thu Jan 01 00:00:00 GMT 1970>
  FastDateParserTest.testLowYearPadding:496 expected:<Sat Jan 01 00:00:00 GMT 1> but was:<Thu Jan 01 00:00:00 GMT 1970>
  FastDateParserTest.testMilleniumBug:512 expected:<Mon Jan 01 00:00:00 GMT 1000> but was:<Thu Jan 01 00:00:00 GMT 1970>
  FastDateParserTest.testParseLongShort:150 expected:<Mon Feb 10 20:33:20 GMT 2003> but was:<Thu Jan 01 06:00:00 GMT 1970>
  FastDateParserTest.testParseNumerics:377 expected:<Mon Feb 10 20:33:20 GMT 2003> but was:<Thu Jan 01 06:00:00 GMT 1970>
  FastDateParserTest.testParseZone:124 expected:<Thu Jul 10 21:33:20 BST 2003> but was:<Thu Jan 01 06:00:00 GMT 1970>
  FastDateParserTest.testParses:251->validateSdfFormatFdpParseEquality:228 ms_MY Thu Feb 10 05:00:00 GMT 2000 GGGG/yyyy/MMMM/dddd/hhhh/mmmm/ss/aaaa/EEEE America/New_York expected:<Thu Feb 10 05:00:00 GMT 2000> but was:<Thu Jan 01 06:00:00 GMT 1970>
  FastDateParserTest.testQuotes:388 expected:<Mon Feb 10 20:33:20 GMT 2003> but was:<Thu Jan 01 06:00:00 GMT 1970>
  FastDateParserTest.testShortDateStyleWithLocales:479 expected:<Tue Feb 03 00:00:00 GMT 2004> but was:<Thu Jan 01 00:00:00 GMT 1970>
  FastDateParserTest.testTzParses:275 tz:America/New_York locale:Malay (Malaysia) expected:<Thu Feb 10 05:00:00 GMT 2000> but was:<Thu Jan 01 00:00:00 GMT 1970>

Tests in error: 
  FastDateFormat_ParserTest>FastDateParserTest.testSpecialCharacters:395->FastDateParserTest.testSdfAndFdp:443 » ArrayIndexOutOfBounds
  FastDateParserTest.testSpecialCharacters:395->testSdfAndFdp:443 » ArrayIndexOutOfBounds


Tests run: 3526, Failures: 192, Errors: 2, Skipped: 97

[INFO] ------------------------------------------------------------------------
[INFO] BUILD FAILURE
[INFO] ------------------------------------------------------------------------
[INFO] Total time: 34.039s
[INFO] Finished at: Wed Aug 05 09:35:21 BST 2015
[INFO] Final Memory: 28M/498M
[INFO] ------------------------------------------------------------------------
[ERROR] Failed to execute goal org.apache.maven.plugins:maven-surefire-plugin:2.18:test (default-test) on project commons-lang3: There are test failures.
[ERROR] 
[ERROR] Please refer to /home/perham/Study/LittleDarwin/Cases/commons-lang3-3.4-src/target/surefire-reports for the individual test results.
[ERROR] -> [Help 1]
[ERROR] 
[ERROR] To see the full stack trace of the errors, re-run Maven with the -e switch.
[ERROR] Re-run Maven using the -X switch to enable full debug logging.
[ERROR] 
[ERROR] For more information about the errors and possible solutions, please read the following articles:
[ERROR] [Help 1] http://cwiki.apache.org/confluence/display/MAVEN/MojoFailureException
