[INFO] Scanning for projects...
[INFO]                                                                         
[INFO] ------------------------------------------------------------------------
[INFO] Building Apache Commons Lang 3.4
[INFO] ------------------------------------------------------------------------
[INFO] 
[INFO] --- maven-enforcer-plugin:1.3.1:enforce (enforce-maven-3) @ commons-lang3 ---
[INFO] 
[INFO] --- build-helper-maven-plugin:1.8:parse-version (parse-version) @ commons-lang3 ---
[INFO] 
[INFO] --- maven-antrun-plugin:1.8:run (javadoc.resources) @ commons-lang3 ---
[INFO] Executing tasks

main:
[INFO] Executed tasks
[INFO] 
[INFO] --- maven-remote-resources-plugin:1.5:process (default) @ commons-lang3 ---
[INFO] 
[INFO] --- buildnumber-maven-plugin:1.3:create (default) @ commons-lang3 ---
[INFO] Executing: /bin/sh -c cd /home/perham/Study/LittleDarwin/Cases/commons-lang3-3.4-src && svn --non-interactive info
[INFO] Working directory: /home/perham/Study/LittleDarwin/Cases/commons-lang3-3.4-src
[INFO] Storing buildNumber: ?????? at timestamp: 1438754060266
[INFO] Executing: /bin/sh -c cd /home/perham/Study/LittleDarwin/Cases/commons-lang3-3.4-src && svn --non-interactive info
[INFO] Working directory: /home/perham/Study/LittleDarwin/Cases/commons-lang3-3.4-src
[INFO] Storing buildScmBranch: UNKNOWN_BRANCH
[INFO] 
[INFO] --- maven-resources-plugin:2.7:resources (default-resources) @ commons-lang3 ---
[INFO] Using 'ISO-8859-1' encoding to copy filtered resources.
[INFO] Copying 0 resource
[INFO] Copying 2 resources to META-INF
[INFO] 
[INFO] --- maven-compiler-plugin:3.2:compile (default-compile) @ commons-lang3 ---
[INFO] Changes detected - recompiling the module!
[INFO] Compiling 133 source files to /home/perham/Study/LittleDarwin/Cases/commons-lang3-3.4-src/target/classes
[INFO] /home/perham/Study/LittleDarwin/Cases/commons-lang3-3.4-src/src/main/java/org/apache/commons/lang3/SerializationUtils.java: /home/perham/Study/LittleDarwin/Cases/commons-lang3-3.4-src/src/main/java/org/apache/commons/lang3/SerializationUtils.java uses unchecked or unsafe operations.
[INFO] /home/perham/Study/LittleDarwin/Cases/commons-lang3-3.4-src/src/main/java/org/apache/commons/lang3/SerializationUtils.java: Recompile with -Xlint:unchecked for details.
[INFO] 
[INFO] --- maven-bundle-plugin:2.5.3:manifest (bundle-manifest) @ commons-lang3 ---
[INFO] 
[INFO] --- animal-sniffer-maven-plugin:1.13:check (checkAPIcompatibility) @ commons-lang3 ---
[INFO] Checking unresolved references to org.codehaus.mojo.signature:java16:1.0
[INFO] 
[INFO] --- maven-resources-plugin:2.7:testResources (default-testResources) @ commons-lang3 ---
[INFO] Using 'ISO-8859-1' encoding to copy filtered resources.
[INFO] Copying 2 resources
[INFO] Copying 2 resources to META-INF
[INFO] 
[INFO] --- maven-compiler-plugin:3.2:testCompile (default-testCompile) @ commons-lang3 ---
[INFO] Nothing to compile - all classes are up to date
[INFO] 
[INFO] --- maven-surefire-plugin:2.18:test (default-test) @ commons-lang3 ---
[INFO] Surefire report directory: /home/perham/Study/LittleDarwin/Cases/commons-lang3-3.4-src/target/surefire-reports

-------------------------------------------------------
 T E S T S
-------------------------------------------------------
Running org.apache.commons.lang3.ValidateTest
Tests run: 63, Failures: 0, Errors: 0, Skipped: 0, Time elapsed: 0.038 sec - in org.apache.commons.lang3.ValidateTest
Running org.apache.commons.lang3.LocaleUtilsTest
Tests run: 15, Failures: 0, Errors: 0, Skipped: 0, Time elapsed: 0.022 sec - in org.apache.commons.lang3.LocaleUtilsTest
Running org.apache.commons.lang3.tuple.MutableTripleTest
Tests run: 8, Failures: 0, Errors: 0, Skipped: 0, Time elapsed: 0.035 sec - in org.apache.commons.lang3.tuple.MutableTripleTest
Running org.apache.commons.lang3.tuple.TripleTest
Tests run: 10, Failures: 0, Errors: 0, Skipped: 0, Time elapsed: 0.01 sec - in org.apache.commons.lang3.tuple.TripleTest
Running org.apache.commons.lang3.tuple.ImmutablePairTest
Tests run: 6, Failures: 0, Errors: 0, Skipped: 0, Time elapsed: 0.003 sec - in org.apache.commons.lang3.tuple.ImmutablePairTest
Running org.apache.commons.lang3.tuple.MutablePairTest
Tests run: 8, Failures: 0, Errors: 0, Skipped: 0, Time elapsed: 0.001 sec - in org.apache.commons.lang3.tuple.MutablePairTest
Running org.apache.commons.lang3.tuple.ImmutableTripleTest
Tests run: 6, Failures: 0, Errors: 0, Skipped: 0, Time elapsed: 0.001 sec - in org.apache.commons.lang3.tuple.ImmutableTripleTest
Running org.apache.commons.lang3.tuple.PairTest
Tests run: 9, Failures: 0, Errors: 0, Skipped: 0, Time elapsed: 0.001 sec - in org.apache.commons.lang3.tuple.PairTest
Running org.apache.commons.lang3.StringUtilsIsTest
Tests run: 8, Failures: 0, Errors: 0, Skipped: 0, Time elapsed: 0.004 sec - in org.apache.commons.lang3.StringUtilsIsTest
Running org.apache.commons.lang3.JavaVersionTest
Tests run: 3, Failures: 0, Errors: 0, Skipped: 0, Time elapsed: 0.002 sec - in org.apache.commons.lang3.JavaVersionTest
Running org.apache.commons.lang3.builder.NoFieldNamesToStringStyleTest
Tests run: 8, Failures: 0, Errors: 0, Skipped: 0, Time elapsed: 0.002 sec - in org.apache.commons.lang3.builder.NoFieldNamesToStringStyleTest
Running org.apache.commons.lang3.builder.ShortPrefixToStringStyleTest
Tests run: 8, Failures: 0, Errors: 0, Skipped: 0, Time elapsed: 0.001 sec - in org.apache.commons.lang3.builder.ShortPrefixToStringStyleTest
Running org.apache.commons.lang3.builder.DiffResultTest
Tests run: 9, Failures: 0, Errors: 0, Skipped: 0, Time elapsed: 0.001 sec - in org.apache.commons.lang3.builder.DiffResultTest
Running org.apache.commons.lang3.builder.CompareToBuilderTest
Tests run: 48, Failures: 0, Errors: 0, Skipped: 0, Time elapsed: 0.01 sec - in org.apache.commons.lang3.builder.CompareToBuilderTest
Running org.apache.commons.lang3.builder.MultilineRecursiveToStringStyleTest
Tests run: 10, Failures: 0, Errors: 0, Skipped: 0, Time elapsed: 0.001 sec - in org.apache.commons.lang3.builder.MultilineRecursiveToStringStyleTest
Running org.apache.commons.lang3.builder.RecursiveToStringStyleTest
Tests run: 8, Failures: 0, Errors: 0, Skipped: 0, Time elapsed: 0.003 sec - in org.apache.commons.lang3.builder.RecursiveToStringStyleTest
Running org.apache.commons.lang3.builder.DefaultToStringStyleTest
Tests run: 8, Failures: 0, Errors: 0, Skipped: 0, Time elapsed: 0.002 sec - in org.apache.commons.lang3.builder.DefaultToStringStyleTest
Running org.apache.commons.lang3.builder.ReflectionToStringBuilderExcludeTest
Tests run: 11, Failures: 0, Errors: 0, Skipped: 0, Time elapsed: 0.001 sec - in org.apache.commons.lang3.builder.ReflectionToStringBuilderExcludeTest
Running org.apache.commons.lang3.builder.StandardToStringStyleTest
Tests run: 8, Failures: 0, Errors: 0, Skipped: 0, Time elapsed: 0 sec - in org.apache.commons.lang3.builder.StandardToStringStyleTest
Running org.apache.commons.lang3.builder.ToStringStyleTest
Tests run: 12, Failures: 0, Errors: 0, Skipped: 0, Time elapsed: 0 sec - in org.apache.commons.lang3.builder.ToStringStyleTest
Running org.apache.commons.lang3.builder.DiffTest
Tests run: 4, Failures: 0, Errors: 0, Skipped: 0, Time elapsed: 0.001 sec - in org.apache.commons.lang3.builder.DiffTest
Running org.apache.commons.lang3.builder.SimpleToStringStyleTest
Tests run: 8, Failures: 0, Errors: 0, Skipped: 0, Time elapsed: 0.001 sec - in org.apache.commons.lang3.builder.SimpleToStringStyleTest
Running org.apache.commons.lang3.builder.MultiLineToStringStyleTest
Tests run: 8, Failures: 0, Errors: 0, Skipped: 0, Time elapsed: 0.001 sec - in org.apache.commons.lang3.builder.MultiLineToStringStyleTest
Running org.apache.commons.lang3.builder.ToStringStyleConcurrencyTest
Tests run: 3, Failures: 0, Errors: 0, Skipped: 0, Time elapsed: 5.155 sec - in org.apache.commons.lang3.builder.ToStringStyleConcurrencyTest
Running org.apache.commons.lang3.builder.ReflectionToStringBuilderMutateInspectConcurrencyTest
Tests run: 1, Failures: 0, Errors: 0, Skipped: 1, Time elapsed: 0.007 sec - in org.apache.commons.lang3.builder.ReflectionToStringBuilderMutateInspectConcurrencyTest
Running org.apache.commons.lang3.builder.ToStringBuilderTest
Tests run: 74, Failures: 0, Errors: 0, Skipped: 1, Time elapsed: 0.051 sec - in org.apache.commons.lang3.builder.ToStringBuilderTest
Running org.apache.commons.lang3.builder.EqualsBuilderTest
Tests run: 48, Failures: 0, Errors: 0, Skipped: 0, Time elapsed: 0.02 sec - in org.apache.commons.lang3.builder.EqualsBuilderTest
Running org.apache.commons.lang3.builder.HashCodeBuilderAndEqualsBuilderTest
Tests run: 4, Failures: 0, Errors: 0, Skipped: 0, Time elapsed: 0.007 sec - in org.apache.commons.lang3.builder.HashCodeBuilderAndEqualsBuilderTest
Running org.apache.commons.lang3.builder.ReflectionToStringBuilderConcurrencyTest
Tests run: 3, Failures: 0, Errors: 0, Skipped: 3, Time elapsed: 0.001 sec - in org.apache.commons.lang3.builder.ReflectionToStringBuilderConcurrencyTest
Running org.apache.commons.lang3.builder.JsonToStringStyleTest
Tests run: 9, Failures: 0, Errors: 0, Skipped: 0, Time elapsed: 0.001 sec - in org.apache.commons.lang3.builder.JsonToStringStyleTest
Running org.apache.commons.lang3.builder.NoClassNameToStringStyleTest
Tests run: 8, Failures: 0, Errors: 0, Skipped: 0, Time elapsed: 0.004 sec - in org.apache.commons.lang3.builder.NoClassNameToStringStyleTest
Running org.apache.commons.lang3.builder.DiffBuilderTest
Tests run: 30, Failures: 0, Errors: 0, Skipped: 0, Time elapsed: 0.034 sec - in org.apache.commons.lang3.builder.DiffBuilderTest
Running org.apache.commons.lang3.builder.HashCodeBuilderTest
Tests run: 44, Failures: 0, Errors: 0, Skipped: 0, Time elapsed: 0.015 sec - in org.apache.commons.lang3.builder.HashCodeBuilderTest
Running org.apache.commons.lang3.concurrent.AtomicInitializerTest
Tests run: 3, Failures: 0, Errors: 0, Skipped: 0, Time elapsed: 0.011 sec - in org.apache.commons.lang3.concurrent.AtomicInitializerTest
Running org.apache.commons.lang3.concurrent.CallableBackgroundInitializerTest
Tests run: 4, Failures: 0, Errors: 0, Skipped: 0, Time elapsed: 0.001 sec - in org.apache.commons.lang3.concurrent.CallableBackgroundInitializerTest
Running org.apache.commons.lang3.concurrent.BackgroundInitializerTest
Tests run: 15, Failures: 0, Errors: 0, Skipped: 0, Time elapsed: 0.019 sec - in org.apache.commons.lang3.concurrent.BackgroundInitializerTest
Running org.apache.commons.lang3.concurrent.LazyInitializerTest
Tests run: 3, Failures: 0, Errors: 0, Skipped: 0, Time elapsed: 0.005 sec - in org.apache.commons.lang3.concurrent.LazyInitializerTest
Running org.apache.commons.lang3.concurrent.BasicThreadFactoryTest
Tests run: 15, Failures: 0, Errors: 0, Skipped: 0, Time elapsed: 0.032 sec - in org.apache.commons.lang3.concurrent.BasicThreadFactoryTest
Running org.apache.commons.lang3.concurrent.ConstantInitializerTest
Tests run: 7, Failures: 0, Errors: 0, Skipped: 0, Time elapsed: 0 sec - in org.apache.commons.lang3.concurrent.ConstantInitializerTest
Running org.apache.commons.lang3.concurrent.MultiBackgroundInitializerTest
Tests run: 17, Failures: 0, Errors: 0, Skipped: 0, Time elapsed: 0.09 sec - in org.apache.commons.lang3.concurrent.MultiBackgroundInitializerTest
Running org.apache.commons.lang3.concurrent.AtomicSafeInitializerTest
Tests run: 4, Failures: 0, Errors: 0, Skipped: 0, Time elapsed: 0.01 sec - in org.apache.commons.lang3.concurrent.AtomicSafeInitializerTest
Running org.apache.commons.lang3.concurrent.ConcurrentUtilsTest
Tests run: 40, Failures: 0, Errors: 0, Skipped: 0, Time elapsed: 0.009 sec - in org.apache.commons.lang3.concurrent.ConcurrentUtilsTest
Running org.apache.commons.lang3.concurrent.TimedSemaphoreTest
Tests run: 15, Failures: 0, Errors: 0, Skipped: 0, Time elapsed: 1.177 sec - in org.apache.commons.lang3.concurrent.TimedSemaphoreTest
Running org.apache.commons.lang3.StringUtilsSubstringTest
Tests run: 14, Failures: 0, Errors: 0, Skipped: 0, Time elapsed: 0.004 sec - in org.apache.commons.lang3.StringUtilsSubstringTest
Running org.apache.commons.lang3.SystemUtilsTest
Tests run: 12, Failures: 0, Errors: 0, Skipped: 0, Time elapsed: 0.003 sec - in org.apache.commons.lang3.SystemUtilsTest
Running org.apache.commons.lang3.CharRangeTest
Tests run: 16, Failures: 0, Errors: 0, Skipped: 0, Time elapsed: 0.035 sec - in org.apache.commons.lang3.CharRangeTest
Running org.apache.commons.lang3.CharSetTest
Tests run: 14, Failures: 0, Errors: 0, Skipped: 0, Time elapsed: 0.011 sec - in org.apache.commons.lang3.CharSetTest
Running org.apache.commons.lang3.StringUtilsStartsEndsWithTest
Tests run: 6, Failures: 0, Errors: 0, Skipped: 0, Time elapsed: 0.003 sec - in org.apache.commons.lang3.StringUtilsStartsEndsWithTest
Running org.apache.commons.lang3.RandomStringUtilsTest
Tests run: 11, Failures: 0, Errors: 0, Skipped: 0, Time elapsed: 0.035 sec - in org.apache.commons.lang3.RandomStringUtilsTest
Running org.apache.commons.lang3.SerializationUtilsTest
Tests run: 26, Failures: 0, Errors: 0, Skipped: 0, Time elapsed: 0.05 sec - in org.apache.commons.lang3.SerializationUtilsTest
Running org.apache.commons.lang3.time.StopWatchTest
Tests run: 8, Failures: 0, Errors: 0, Skipped: 0, Time elapsed: 4.763 sec - in org.apache.commons.lang3.time.StopWatchTest
Running org.apache.commons.lang3.time.DateUtilsRoundingTest
Tests run: 22, Failures: 20, Errors: 0, Skipped: 0, Time elapsed: 0.12 sec <<< FAILURE! - in org.apache.commons.lang3.time.DateUtilsRoundingTest
testRoundDayOfMonth(org.apache.commons.lang3.time.DateUtilsRoundingTest)  Time elapsed: 0.008 sec  <<< FAILURE!
java.lang.AssertionError: expected:<Sun Jun 01 00:00:00 BST 2008> but was:<Mon Jun 02 00:00:00 BST 2008>
	at org.junit.Assert.fail(Assert.java:88)
	at org.junit.Assert.failNotEquals(Assert.java:834)
	at org.junit.Assert.assertEquals(Assert.java:118)
	at org.junit.Assert.assertEquals(Assert.java:144)
	at org.apache.commons.lang3.time.DateUtilsRoundingTest.baseRoundTest(DateUtilsRoundingTest.java:617)
	at org.apache.commons.lang3.time.DateUtilsRoundingTest.testRoundDayOfMonth(DateUtilsRoundingTest.java:247)

testRoundMinute(org.apache.commons.lang3.time.DateUtilsRoundingTest)  Time elapsed: 0 sec  <<< FAILURE!
java.lang.AssertionError: expected:<Sun Jun 01 08:15:00 BST 2008> but was:<Sun Jun 01 08:16:00 BST 2008>
	at org.junit.Assert.fail(Assert.java:88)
	at org.junit.Assert.failNotEquals(Assert.java:834)
	at org.junit.Assert.assertEquals(Assert.java:118)
	at org.junit.Assert.assertEquals(Assert.java:144)
	at org.apache.commons.lang3.time.DateUtilsRoundingTest.baseRoundTest(DateUtilsRoundingTest.java:617)
	at org.apache.commons.lang3.time.DateUtilsRoundingTest.testRoundMinute(DateUtilsRoundingTest.java:354)

testRoundSecond(org.apache.commons.lang3.time.DateUtilsRoundingTest)  Time elapsed: 0.003 sec  <<< FAILURE!
java.lang.AssertionError: expected:<Sun Jun 01 08:15:14 BST 2008> but was:<Sun Jun 01 08:15:15 BST 2008>
	at org.junit.Assert.fail(Assert.java:88)
	at org.junit.Assert.failNotEquals(Assert.java:834)
	at org.junit.Assert.assertEquals(Assert.java:118)
	at org.junit.Assert.assertEquals(Assert.java:144)
	at org.apache.commons.lang3.time.DateUtilsRoundingTest.baseRoundTest(DateUtilsRoundingTest.java:617)
	at org.apache.commons.lang3.time.DateUtilsRoundingTest.testRoundSecond(DateUtilsRoundingTest.java:379)

testRoundMonth(org.apache.commons.lang3.time.DateUtilsRoundingTest)  Time elapsed: 0.002 sec  <<< FAILURE!
java.lang.AssertionError: expected:<Thu Feb 01 00:00:00 GMT 2007> but was:<Thu Mar 01 00:00:00 GMT 2007>
	at org.junit.Assert.fail(Assert.java:88)
	at org.junit.Assert.failNotEquals(Assert.java:834)
	at org.junit.Assert.assertEquals(Assert.java:118)
	at org.junit.Assert.assertEquals(Assert.java:144)
	at org.apache.commons.lang3.time.DateUtilsRoundingTest.baseRoundTest(DateUtilsRoundingTest.java:617)
	at org.apache.commons.lang3.time.DateUtilsRoundingTest.testRoundMonth(DateUtilsRoundingTest.java:111)

testTruncateSemiMonth(org.apache.commons.lang3.time.DateUtilsRoundingTest)  Time elapsed: 0.002 sec  <<< FAILURE!
java.lang.AssertionError: Truncating 2007-02-01T00:00:00 as Date with CalendarField-value 1001 must return itself expected:<Thu Feb 01 00:00:00 GMT 2007> but was:<Fri Feb 16 00:00:00 GMT 2007>
	at org.junit.Assert.fail(Assert.java:88)
	at org.junit.Assert.failNotEquals(Assert.java:834)
	at org.junit.Assert.assertEquals(Assert.java:118)
	at org.apache.commons.lang3.time.DateUtilsRoundingTest.baseTruncateTest(DateUtilsRoundingTest.java:665)
	at org.apache.commons.lang3.time.DateUtilsRoundingTest.testTruncateSemiMonth(DateUtilsRoundingTest.java:452)

testTruncateMinute(org.apache.commons.lang3.time.DateUtilsRoundingTest)  Time elapsed: 0.002 sec  <<< FAILURE!
java.lang.AssertionError: Truncating 2008-06-01T08:15:00 as Date with CalendarField-value 12 must return itself expected:<Sun Jun 01 08:15:00 BST 2008> but was:<Sun Jun 01 08:16:00 BST 2008>
	at org.junit.Assert.fail(Assert.java:88)
	at org.junit.Assert.failNotEquals(Assert.java:834)
	at org.junit.Assert.assertEquals(Assert.java:118)
	at org.apache.commons.lang3.time.DateUtilsRoundingTest.baseTruncateTest(DateUtilsRoundingTest.java:665)
	at org.apache.commons.lang3.time.DateUtilsRoundingTest.testTruncateMinute(DateUtilsRoundingTest.java:573)

testRoundSemiMonth(org.apache.commons.lang3.time.DateUtilsRoundingTest)  Time elapsed: 0.002 sec  <<< FAILURE!
java.lang.AssertionError: expected:<Thu Feb 01 00:00:00 GMT 2007> but was:<Fri Feb 16 00:00:00 GMT 2007>
	at org.junit.Assert.fail(Assert.java:88)
	at org.junit.Assert.failNotEquals(Assert.java:834)
	at org.junit.Assert.assertEquals(Assert.java:118)
	at org.junit.Assert.assertEquals(Assert.java:144)
	at org.apache.commons.lang3.time.DateUtilsRoundingTest.baseRoundTest(DateUtilsRoundingTest.java:617)
	at org.apache.commons.lang3.time.DateUtilsRoundingTest.testRoundSemiMonth(DateUtilsRoundingTest.java:155)

testTruncateSecond(org.apache.commons.lang3.time.DateUtilsRoundingTest)  Time elapsed: 0.002 sec  <<< FAILURE!
java.lang.AssertionError: Truncating 2008-06-01T08:15:14 as Date with CalendarField-value 13 must return itself expected:<Sun Jun 01 08:15:14 BST 2008> but was:<Sun Jun 01 08:15:15 BST 2008>
	at org.junit.Assert.fail(Assert.java:88)
	at org.junit.Assert.failNotEquals(Assert.java:834)
	at org.junit.Assert.assertEquals(Assert.java:118)
	at org.apache.commons.lang3.time.DateUtilsRoundingTest.baseTruncateTest(DateUtilsRoundingTest.java:665)
	at org.apache.commons.lang3.time.DateUtilsRoundingTest.testTruncateSecond(DateUtilsRoundingTest.java:586)

testRoundAmPm(org.apache.commons.lang3.time.DateUtilsRoundingTest)  Time elapsed: 0.003 sec  <<< FAILURE!
java.lang.AssertionError: expected:<Sun Jun 01 00:00:00 BST 2008> but was:<Sun Jun 01 12:00:00 BST 2008>
	at org.junit.Assert.fail(Assert.java:88)
	at org.junit.Assert.failNotEquals(Assert.java:834)
	at org.junit.Assert.assertEquals(Assert.java:118)
	at org.junit.Assert.assertEquals(Assert.java:144)
	at org.apache.commons.lang3.time.DateUtilsRoundingTest.baseRoundTest(DateUtilsRoundingTest.java:617)
	at org.apache.commons.lang3.time.DateUtilsRoundingTest.testRoundAmPm(DateUtilsRoundingTest.java:273)

testRoundDate(org.apache.commons.lang3.time.DateUtilsRoundingTest)  Time elapsed: 0.003 sec  <<< FAILURE!
java.lang.AssertionError: expected:<Sun Jun 01 00:00:00 BST 2008> but was:<Mon Jun 02 00:00:00 BST 2008>
	at org.junit.Assert.fail(Assert.java:88)
	at org.junit.Assert.failNotEquals(Assert.java:834)
	at org.junit.Assert.assertEquals(Assert.java:118)
	at org.junit.Assert.assertEquals(Assert.java:144)
	at org.apache.commons.lang3.time.DateUtilsRoundingTest.baseRoundTest(DateUtilsRoundingTest.java:617)
	at org.apache.commons.lang3.time.DateUtilsRoundingTest.testRoundDate(DateUtilsRoundingTest.java:222)

testRoundHour(org.apache.commons.lang3.time.DateUtilsRoundingTest)  Time elapsed: 0.003 sec  <<< FAILURE!
java.lang.AssertionError: expected:<Sun Jun 01 08:00:00 BST 2008> but was:<Sun Jun 01 09:00:00 BST 2008>
	at org.junit.Assert.fail(Assert.java:88)
	at org.junit.Assert.failNotEquals(Assert.java:834)
	at org.junit.Assert.assertEquals(Assert.java:118)
	at org.junit.Assert.assertEquals(Assert.java:144)
	at org.apache.commons.lang3.time.DateUtilsRoundingTest.baseRoundTest(DateUtilsRoundingTest.java:617)
	at org.apache.commons.lang3.time.DateUtilsRoundingTest.testRoundHour(DateUtilsRoundingTest.java:329)

testRoundYear(org.apache.commons.lang3.time.DateUtilsRoundingTest)  Time elapsed: 0.002 sec  <<< FAILURE!
java.lang.AssertionError: expected:<Mon Jan 01 00:00:00 GMT 2007> but was:<Tue Jan 01 00:00:00 GMT 2008>
	at org.junit.Assert.fail(Assert.java:88)
	at org.junit.Assert.failNotEquals(Assert.java:834)
	at org.junit.Assert.assertEquals(Assert.java:118)
	at org.junit.Assert.assertEquals(Assert.java:144)
	at org.apache.commons.lang3.time.DateUtilsRoundingTest.baseRoundTest(DateUtilsRoundingTest.java:617)
	at org.apache.commons.lang3.time.DateUtilsRoundingTest.testRoundYear(DateUtilsRoundingTest.java:90)

testTruncateHourOfDay(org.apache.commons.lang3.time.DateUtilsRoundingTest)  Time elapsed: 0.002 sec  <<< FAILURE!
java.lang.AssertionError: Truncating 2008-06-01T08:00:00 as Date with CalendarField-value 11 must return itself expected:<Sun Jun 01 08:00:00 BST 2008> but was:<Sun Jun 01 09:00:00 BST 2008>
	at org.junit.Assert.fail(Assert.java:88)
	at org.junit.Assert.failNotEquals(Assert.java:834)
	at org.junit.Assert.assertEquals(Assert.java:118)
	at org.apache.commons.lang3.time.DateUtilsRoundingTest.baseTruncateTest(DateUtilsRoundingTest.java:665)
	at org.apache.commons.lang3.time.DateUtilsRoundingTest.testTruncateHourOfDay(DateUtilsRoundingTest.java:560)

testTruncateMonth(org.apache.commons.lang3.time.DateUtilsRoundingTest)  Time elapsed: 0.002 sec  <<< FAILURE!
java.lang.AssertionError: Truncating 2008-03-01T00:00:00 as Date with CalendarField-value 2 must return itself expected:<Sat Mar 01 00:00:00 GMT 2008> but was:<Tue Apr 01 00:00:00 BST 2008>
	at org.junit.Assert.fail(Assert.java:88)
	at org.junit.Assert.failNotEquals(Assert.java:834)
	at org.junit.Assert.assertEquals(Assert.java:118)
	at org.apache.commons.lang3.time.DateUtilsRoundingTest.baseTruncateTest(DateUtilsRoundingTest.java:665)
	at org.apache.commons.lang3.time.DateUtilsRoundingTest.testTruncateMonth(DateUtilsRoundingTest.java:434)

testRoundHourOfDay(org.apache.commons.lang3.time.DateUtilsRoundingTest)  Time elapsed: 0.002 sec  <<< FAILURE!
java.lang.AssertionError: expected:<Sun Jun 01 08:00:00 BST 2008> but was:<Sun Jun 01 09:00:00 BST 2008>
	at org.junit.Assert.fail(Assert.java:88)
	at org.junit.Assert.failNotEquals(Assert.java:834)
	at org.junit.Assert.assertEquals(Assert.java:118)
	at org.junit.Assert.assertEquals(Assert.java:144)
	at org.apache.commons.lang3.time.DateUtilsRoundingTest.baseRoundTest(DateUtilsRoundingTest.java:617)
	at org.apache.commons.lang3.time.DateUtilsRoundingTest.testRoundHourOfDay(DateUtilsRoundingTest.java:304)

testTruncateAmPm(org.apache.commons.lang3.time.DateUtilsRoundingTest)  Time elapsed: 0.002 sec  <<< FAILURE!
java.lang.AssertionError: Truncating 2008-06-01T00:00:00 as Date with CalendarField-value 9 must return itself expected:<Sun Jun 01 00:00:00 BST 2008> but was:<Sun Jun 01 12:00:00 BST 2008>
	at org.junit.Assert.fail(Assert.java:88)
	at org.junit.Assert.failNotEquals(Assert.java:834)
	at org.junit.Assert.assertEquals(Assert.java:118)
	at org.apache.commons.lang3.time.DateUtilsRoundingTest.baseTruncateTest(DateUtilsRoundingTest.java:665)
	at org.apache.commons.lang3.time.DateUtilsRoundingTest.testTruncateAmPm(DateUtilsRoundingTest.java:530)

testTruncateDate(org.apache.commons.lang3.time.DateUtilsRoundingTest)  Time elapsed: 0.002 sec  <<< FAILURE!
java.lang.AssertionError: Truncating 2008-06-01T00:00:00 as Date with CalendarField-value 5 must return itself expected:<Sun Jun 01 00:00:00 BST 2008> but was:<Mon Jun 02 00:00:00 BST 2008>
	at org.junit.Assert.fail(Assert.java:88)
	at org.junit.Assert.failNotEquals(Assert.java:834)
	at org.junit.Assert.assertEquals(Assert.java:118)
	at org.apache.commons.lang3.time.DateUtilsRoundingTest.baseTruncateTest(DateUtilsRoundingTest.java:665)
	at org.apache.commons.lang3.time.DateUtilsRoundingTest.testTruncateDate(DateUtilsRoundingTest.java:501)

testTruncateHour(org.apache.commons.lang3.time.DateUtilsRoundingTest)  Time elapsed: 0.002 sec  <<< FAILURE!
java.lang.AssertionError: Truncating 2008-06-01T08:00:00 as Date with CalendarField-value 10 must return itself expected:<Sun Jun 01 08:00:00 BST 2008> but was:<Sun Jun 01 09:00:00 BST 2008>
	at org.junit.Assert.fail(Assert.java:88)
	at org.junit.Assert.failNotEquals(Assert.java:834)
	at org.junit.Assert.assertEquals(Assert.java:118)
	at org.apache.commons.lang3.time.DateUtilsRoundingTest.baseTruncateTest(DateUtilsRoundingTest.java:665)
	at org.apache.commons.lang3.time.DateUtilsRoundingTest.testTruncateHour(DateUtilsRoundingTest.java:547)

testTruncateYear(org.apache.commons.lang3.time.DateUtilsRoundingTest)  Time elapsed: 0.002 sec  <<< FAILURE!
java.lang.AssertionError: Truncating 2007-01-01T00:00:00 as Date with CalendarField-value 1 must return itself expected:<Mon Jan 01 00:00:00 GMT 2007> but was:<Tue Jan 01 00:00:00 GMT 2008>
	at org.junit.Assert.fail(Assert.java:88)
	at org.junit.Assert.failNotEquals(Assert.java:834)
	at org.junit.Assert.assertEquals(Assert.java:118)
	at org.apache.commons.lang3.time.DateUtilsRoundingTest.baseTruncateTest(DateUtilsRoundingTest.java:665)
	at org.apache.commons.lang3.time.DateUtilsRoundingTest.testTruncateYear(DateUtilsRoundingTest.java:420)

testTruncateDayOfMonth(org.apache.commons.lang3.time.DateUtilsRoundingTest)  Time elapsed: 0.002 sec  <<< FAILURE!
java.lang.AssertionError: Truncating 2008-06-01T00:00:00 as Date with CalendarField-value 5 must return itself expected:<Sun Jun 01 00:00:00 BST 2008> but was:<Mon Jun 02 00:00:00 BST 2008>
	at org.junit.Assert.fail(Assert.java:88)
	at org.junit.Assert.failNotEquals(Assert.java:834)
	at org.junit.Assert.assertEquals(Assert.java:118)
	at org.apache.commons.lang3.time.DateUtilsRoundingTest.baseTruncateTest(DateUtilsRoundingTest.java:665)
	at org.apache.commons.lang3.time.DateUtilsRoundingTest.testTruncateDayOfMonth(DateUtilsRoundingTest.java:514)

Running org.apache.commons.lang3.time.FastDateParserTest
Tests run: 33, Failures: 0, Errors: 0, Skipped: 0, Time elapsed: 2.389 sec - in org.apache.commons.lang3.time.FastDateParserTest
Running org.apache.commons.lang3.time.FastDateFormat_ParserTest
Tests run: 33, Failures: 0, Errors: 0, Skipped: 0, Time elapsed: 0.806 sec - in org.apache.commons.lang3.time.FastDateFormat_ParserTest
Running org.apache.commons.lang3.time.DurationFormatUtilsTest
Tests run: 25, Failures: 0, Errors: 0, Skipped: 0, Time elapsed: 0.626 sec - in org.apache.commons.lang3.time.DurationFormatUtilsTest
Running org.apache.commons.lang3.time.DateFormatUtilsTest
Tests run: 10, Failures: 0, Errors: 0, Skipped: 0, Time elapsed: 0.002 sec - in org.apache.commons.lang3.time.DateFormatUtilsTest
Running org.apache.commons.lang3.time.DateUtilsFragmentTest
Tests run: 57, Failures: 0, Errors: 0, Skipped: 0, Time elapsed: 0.013 sec - in org.apache.commons.lang3.time.DateUtilsFragmentTest
Running org.apache.commons.lang3.time.FastDatePrinterTimeZonesTest
Tests run: 617, Failures: 0, Errors: 0, Skipped: 0, Time elapsed: 0.255 sec - in org.apache.commons.lang3.time.FastDatePrinterTimeZonesTest
Running org.apache.commons.lang3.time.FastDateFormatTest
>>FastDateFormatTest: FastDateParser:19845  SimpleDateFormat:3514
Tests run: 14, Failures: 0, Errors: 0, Skipped: 0, Time elapsed: 2.594 sec - in org.apache.commons.lang3.time.FastDateFormatTest
Running org.apache.commons.lang3.time.FastDateFormat_PrinterTest
Tests run: 17, Failures: 0, Errors: 0, Skipped: 0, Time elapsed: 0.017 sec - in org.apache.commons.lang3.time.FastDateFormat_PrinterTest
Running org.apache.commons.lang3.time.FastDatePrinterTest
Tests run: 17, Failures: 0, Errors: 0, Skipped: 0, Time elapsed: 0.007 sec - in org.apache.commons.lang3.time.FastDatePrinterTest
Running org.apache.commons.lang3.time.FastDateParserSDFTest
Tests run: 276, Failures: 0, Errors: 0, Skipped: 92, Time elapsed: 0.08 sec - in org.apache.commons.lang3.time.FastDateParserSDFTest
Running org.apache.commons.lang3.time.DateUtilsTest
DateUtilsTest: Default Locale=en_US
Tests run: 38, Failures: 14, Errors: 0, Skipped: 0, Time elapsed: 0.014 sec <<< FAILURE! - in org.apache.commons.lang3.time.DateUtilsTest
testMonthIterator(org.apache.commons.lang3.time.DateUtilsTest)  Time elapsed: 0 sec  <<< FAILURE!
junit.framework.AssertionFailedError:  expected Sun Jan 27 00:00:00 UTC 2002 but got Sun Feb 24 00:00:00 UTC 2002
	at org.apache.commons.lang3.time.DateUtilsTest.assertCalendarsEquals(DateUtilsTest.java:1702)
	at org.apache.commons.lang3.time.DateUtilsTest.assertWeekIterator(DateUtilsTest.java:1675)
	at org.apache.commons.lang3.time.DateUtilsTest.assertWeekIterator(DateUtilsTest.java:1665)
	at org.apache.commons.lang3.time.DateUtilsTest.testMonthIterator(DateUtilsTest.java:1565)

testRoundLang346(org.apache.commons.lang3.time.DateUtilsTest)  Time elapsed: 0 sec  <<< FAILURE!
java.lang.AssertionError: Minute No Round Failed expected:<Mon Jul 02 08:08:00 UTC 2007> but was:<Mon Jul 02 08:09:00 UTC 2007>
	at org.junit.Assert.fail(Assert.java:88)
	at org.junit.Assert.failNotEquals(Assert.java:834)
	at org.junit.Assert.assertEquals(Assert.java:118)
	at org.apache.commons.lang3.time.DateUtilsTest.testRoundLang346(DateUtilsTest.java:896)

testTruncate(org.apache.commons.lang3.time.DateUtilsTest)  Time elapsed: 0 sec  <<< FAILURE!
java.lang.AssertionError: truncate year-1 failed expected:<Tue Jan 01 00:00:00 UTC 2002> but was:<Wed Jan 01 00:00:00 UTC 2003>
	at org.junit.Assert.fail(Assert.java:88)
	at org.junit.Assert.failNotEquals(Assert.java:834)
	at org.junit.Assert.assertEquals(Assert.java:118)
	at org.apache.commons.lang3.time.DateUtilsTest.testTruncate(DateUtilsTest.java:950)

testRound(org.apache.commons.lang3.time.DateUtilsTest)  Time elapsed: 0 sec  <<< FAILURE!
java.lang.AssertionError: round year-1 failed expected:<Tue Jan 01 00:00:00 UTC 2002> but was:<Wed Jan 01 00:00:00 UTC 2003>
	at org.junit.Assert.fail(Assert.java:88)
	at org.junit.Assert.failNotEquals(Assert.java:834)
	at org.junit.Assert.assertEquals(Assert.java:118)
	at org.apache.commons.lang3.time.DateUtilsTest.testRound(DateUtilsTest.java:659)

testCeil(org.apache.commons.lang3.time.DateUtilsTest)  Time elapsed: 0.001 sec  <<< FAILURE!
java.lang.AssertionError: ceiling javadoc-1 failed expected:<Thu Mar 28 14:00:00 UTC 2002> but was:<Thu Mar 28 13:00:00 UTC 2002>
	at org.junit.Assert.fail(Assert.java:88)
	at org.junit.Assert.failNotEquals(Assert.java:834)
	at org.junit.Assert.assertEquals(Assert.java:118)
	at org.apache.commons.lang3.time.DateUtilsTest.testCeil(DateUtilsTest.java:1236)

testTruncateLang59(org.apache.commons.lang3.time.DateUtilsTest)  Time elapsed: 0.001 sec  <<< FAILURE!
java.lang.AssertionError: Truncate Calendar.SECOND expected:<Sun Oct 31 01:02:03 MDT 2004> but was:<Sun Oct 31 01:02:04 MDT 2004>
	at org.junit.Assert.fail(Assert.java:88)
	at org.junit.Assert.failNotEquals(Assert.java:834)
	at org.junit.Assert.assertEquals(Assert.java:118)
	at org.apache.commons.lang3.time.DateUtilsTest.testTruncateLang59(DateUtilsTest.java:1179)

testSetSeconds(org.apache.commons.lang3.time.DateUtilsTest)  Time elapsed: 0 sec  <<< FAILURE!
java.lang.AssertionError: expected:<5> but was:<4>
	at org.junit.Assert.fail(Assert.java:88)
	at org.junit.Assert.failNotEquals(Assert.java:834)
	at org.junit.Assert.assertEquals(Assert.java:645)
	at org.junit.Assert.assertEquals(Assert.java:631)
	at org.apache.commons.lang3.time.DateUtilsTest.assertDate(DateUtilsTest.java:631)
	at org.apache.commons.lang3.time.DateUtilsTest.testSetSeconds(DateUtilsTest.java:587)

testAddMonths(org.apache.commons.lang3.time.DateUtilsTest)  Time elapsed: 0.001 sec  <<< FAILURE!
java.lang.AssertionError: expected:<5> but was:<4>
	at org.junit.Assert.fail(Assert.java:88)
	at org.junit.Assert.failNotEquals(Assert.java:834)
	at org.junit.Assert.assertEquals(Assert.java:645)
	at org.junit.Assert.assertEquals(Assert.java:631)
	at org.apache.commons.lang3.time.DateUtilsTest.assertDate(DateUtilsTest.java:631)
	at org.apache.commons.lang3.time.DateUtilsTest.testAddMonths(DateUtilsTest.java:339)

testWeekIterator(org.apache.commons.lang3.time.DateUtilsTest)  Time elapsed: 0.001 sec  <<< FAILURE!
junit.framework.AssertionFailedError:  expected Sun Aug 02 00:00:00 MDT 2015 but got Mon Aug 03 00:00:00 MDT 2015
	at org.apache.commons.lang3.time.DateUtilsTest.assertCalendarsEquals(DateUtilsTest.java:1702)
	at org.apache.commons.lang3.time.DateUtilsTest.assertWeekIterator(DateUtilsTest.java:1680)
	at org.apache.commons.lang3.time.DateUtilsTest.assertWeekIterator(DateUtilsTest.java:1653)
	at org.apache.commons.lang3.time.DateUtilsTest.testWeekIterator(DateUtilsTest.java:1531)

testSetMonths(org.apache.commons.lang3.time.DateUtilsTest)  Time elapsed: 0 sec  <<< FAILURE!
java.lang.AssertionError: expected:<5> but was:<4>
	at org.junit.Assert.fail(Assert.java:88)
	at org.junit.Assert.failNotEquals(Assert.java:834)
	at org.junit.Assert.assertEquals(Assert.java:645)
	at org.junit.Assert.assertEquals(Assert.java:631)
	at org.apache.commons.lang3.time.DateUtilsTest.assertDate(DateUtilsTest.java:631)
	at org.apache.commons.lang3.time.DateUtilsTest.testSetMonths(DateUtilsTest.java:499)

testSetDays(org.apache.commons.lang3.time.DateUtilsTest)  Time elapsed: 0.001 sec  <<< FAILURE!
java.lang.AssertionError: expected:<5> but was:<4>
	at org.junit.Assert.fail(Assert.java:88)
	at org.junit.Assert.failNotEquals(Assert.java:834)
	at org.junit.Assert.assertEquals(Assert.java:645)
	at org.junit.Assert.assertEquals(Assert.java:631)
	at org.apache.commons.lang3.time.DateUtilsTest.assertDate(DateUtilsTest.java:631)
	at org.apache.commons.lang3.time.DateUtilsTest.testSetDays(DateUtilsTest.java:521)

testAddMilliseconds(org.apache.commons.lang3.time.DateUtilsTest)  Time elapsed: 0 sec  <<< FAILURE!
java.lang.AssertionError: expected:<5> but was:<4>
	at org.junit.Assert.fail(Assert.java:88)
	at org.junit.Assert.failNotEquals(Assert.java:834)
	at org.junit.Assert.assertEquals(Assert.java:645)
	at org.junit.Assert.assertEquals(Assert.java:631)
	at org.apache.commons.lang3.time.DateUtilsTest.assertDate(DateUtilsTest.java:631)
	at org.apache.commons.lang3.time.DateUtilsTest.testAddMilliseconds(DateUtilsTest.java:459)

testSetHours(org.apache.commons.lang3.time.DateUtilsTest)  Time elapsed: 0 sec  <<< FAILURE!
java.lang.AssertionError: expected:<5> but was:<4>
	at org.junit.Assert.fail(Assert.java:88)
	at org.junit.Assert.failNotEquals(Assert.java:834)
	at org.junit.Assert.assertEquals(Assert.java:645)
	at org.junit.Assert.assertEquals(Assert.java:631)
	at org.apache.commons.lang3.time.DateUtilsTest.assertDate(DateUtilsTest.java:631)
	at org.apache.commons.lang3.time.DateUtilsTest.testSetHours(DateUtilsTest.java:543)

testSetYears(org.apache.commons.lang3.time.DateUtilsTest)  Time elapsed: 0 sec  <<< FAILURE!
java.lang.AssertionError: expected:<5> but was:<4>
	at org.junit.Assert.fail(Assert.java:88)
	at org.junit.Assert.failNotEquals(Assert.java:834)
	at org.junit.Assert.assertEquals(Assert.java:645)
	at org.junit.Assert.assertEquals(Assert.java:631)
	at org.apache.commons.lang3.time.DateUtilsTest.assertDate(DateUtilsTest.java:631)
	at org.apache.commons.lang3.time.DateUtilsTest.testSetYears(DateUtilsTest.java:479)

Running org.apache.commons.lang3.reflect.InheritanceUtilsTest
Tests run: 9, Failures: 0, Errors: 0, Skipped: 0, Time elapsed: 0.001 sec - in org.apache.commons.lang3.reflect.InheritanceUtilsTest
Running org.apache.commons.lang3.reflect.MethodUtilsTest
Tests run: 23, Failures: 0, Errors: 0, Skipped: 0, Time elapsed: 0.031 sec - in org.apache.commons.lang3.reflect.MethodUtilsTest
Running org.apache.commons.lang3.reflect.ConstructorUtilsTest
Tests run: 7, Failures: 0, Errors: 0, Skipped: 0, Time elapsed: 0.004 sec - in org.apache.commons.lang3.reflect.ConstructorUtilsTest
Running org.apache.commons.lang3.reflect.FieldUtilsTest
Tests run: 64, Failures: 0, Errors: 0, Skipped: 0, Time elapsed: 0.027 sec - in org.apache.commons.lang3.reflect.FieldUtilsTest
Running org.apache.commons.lang3.reflect.TypeLiteralTest
Tests run: 4, Failures: 0, Errors: 0, Skipped: 0, Time elapsed: 0.01 sec - in org.apache.commons.lang3.reflect.TypeLiteralTest
Running org.apache.commons.lang3.reflect.TypeUtilsTest
Tests run: 19, Failures: 0, Errors: 0, Skipped: 0, Time elapsed: 0.041 sec - in org.apache.commons.lang3.reflect.TypeUtilsTest
Running org.apache.commons.lang3.mutable.MutableByteTest
Tests run: 17, Failures: 0, Errors: 0, Skipped: 0, Time elapsed: 0.003 sec - in org.apache.commons.lang3.mutable.MutableByteTest
Running org.apache.commons.lang3.mutable.MutableShortTest
Tests run: 14, Failures: 0, Errors: 0, Skipped: 0, Time elapsed: 0.001 sec - in org.apache.commons.lang3.mutable.MutableShortTest
Running org.apache.commons.lang3.mutable.MutableIntTest
Tests run: 17, Failures: 0, Errors: 0, Skipped: 0, Time elapsed: 0.002 sec - in org.apache.commons.lang3.mutable.MutableIntTest
Running org.apache.commons.lang3.mutable.MutableDoubleTest
Tests run: 18, Failures: 0, Errors: 0, Skipped: 0, Time elapsed: 0.003 sec - in org.apache.commons.lang3.mutable.MutableDoubleTest
Running org.apache.commons.lang3.mutable.MutableFloatTest
Tests run: 18, Failures: 0, Errors: 0, Skipped: 0, Time elapsed: 0.003 sec - in org.apache.commons.lang3.mutable.MutableFloatTest
Running org.apache.commons.lang3.mutable.MutableLongTest
Tests run: 17, Failures: 0, Errors: 0, Skipped: 0, Time elapsed: 0.003 sec - in org.apache.commons.lang3.mutable.MutableLongTest
Running org.apache.commons.lang3.mutable.MutableBooleanTest
Tests run: 9, Failures: 0, Errors: 0, Skipped: 0, Time elapsed: 0 sec - in org.apache.commons.lang3.mutable.MutableBooleanTest
Running org.apache.commons.lang3.mutable.MutableObjectTest
Tests run: 5, Failures: 0, Errors: 0, Skipped: 0, Time elapsed: 0 sec - in org.apache.commons.lang3.mutable.MutableObjectTest
Running org.apache.commons.lang3.text.translate.UnicodeEscaperTest
Tests run: 3, Failures: 0, Errors: 0, Skipped: 0, Time elapsed: 0.001 sec - in org.apache.commons.lang3.text.translate.UnicodeEscaperTest
Running org.apache.commons.lang3.text.translate.EntityArraysTest
Tests run: 3, Failures: 0, Errors: 0, Skipped: 0, Time elapsed: 0.002 sec - in org.apache.commons.lang3.text.translate.EntityArraysTest
Running org.apache.commons.lang3.text.translate.UnicodeUnpairedSurrogateRemoverTest
Tests run: 2, Failures: 0, Errors: 0, Skipped: 0, Time elapsed: 0 sec - in org.apache.commons.lang3.text.translate.UnicodeUnpairedSurrogateRemoverTest
Running org.apache.commons.lang3.text.translate.NumericEntityUnescaperTest
Tests run: 3, Failures: 0, Errors: 0, Skipped: 0, Time elapsed: 0.001 sec - in org.apache.commons.lang3.text.translate.NumericEntityUnescaperTest
Running org.apache.commons.lang3.text.translate.NumericEntityEscaperTest
Tests run: 4, Failures: 0, Errors: 0, Skipped: 0, Time elapsed: 0.001 sec - in org.apache.commons.lang3.text.translate.NumericEntityEscaperTest
Running org.apache.commons.lang3.text.translate.LookupTranslatorTest
Tests run: 2, Failures: 0, Errors: 0, Skipped: 0, Time elapsed: 0 sec - in org.apache.commons.lang3.text.translate.LookupTranslatorTest
Running org.apache.commons.lang3.text.translate.UnicodeUnescaperTest
Tests run: 3, Failures: 0, Errors: 0, Skipped: 0, Time elapsed: 0 sec - in org.apache.commons.lang3.text.translate.UnicodeUnescaperTest
Running org.apache.commons.lang3.text.translate.OctalUnescaperTest
Tests run: 1, Failures: 0, Errors: 0, Skipped: 0, Time elapsed: 0 sec - in org.apache.commons.lang3.text.translate.OctalUnescaperTest
Running org.apache.commons.lang3.text.StrMatcherTest
Tests run: 14, Failures: 0, Errors: 0, Skipped: 0, Time elapsed: 0.002 sec - in org.apache.commons.lang3.text.StrMatcherTest
Running org.apache.commons.lang3.text.StrTokenizerTest
Tests run: 55, Failures: 0, Errors: 0, Skipped: 0, Time elapsed: 0.004 sec - in org.apache.commons.lang3.text.StrTokenizerTest
Running org.apache.commons.lang3.text.FormattableUtilsTest
Tests run: 5, Failures: 0, Errors: 0, Skipped: 0, Time elapsed: 0 sec - in org.apache.commons.lang3.text.FormattableUtilsTest
Running org.apache.commons.lang3.text.CompositeFormatTest
Tests run: 2, Failures: 0, Errors: 0, Skipped: 0, Time elapsed: 0 sec - in org.apache.commons.lang3.text.CompositeFormatTest
Running org.apache.commons.lang3.text.WordUtilsTest
Tests run: 12, Failures: 0, Errors: 0, Skipped: 0, Time elapsed: 0.006 sec - in org.apache.commons.lang3.text.WordUtilsTest
Running org.apache.commons.lang3.text.StrLookupTest
Tests run: 5, Failures: 0, Errors: 0, Skipped: 0, Time elapsed: 0.004 sec - in org.apache.commons.lang3.text.StrLookupTest
Running org.apache.commons.lang3.text.StrBuilderAppendInsertTest
Tests run: 51, Failures: 0, Errors: 0, Skipped: 0, Time elapsed: 0.016 sec - in org.apache.commons.lang3.text.StrBuilderAppendInsertTest
Running org.apache.commons.lang3.text.ExtendedMessageFormatTest
Tests run: 10, Failures: 0, Errors: 0, Skipped: 0, Time elapsed: 0.916 sec - in org.apache.commons.lang3.text.ExtendedMessageFormatTest
Running org.apache.commons.lang3.text.StrSubstitutorTest
Tests run: 40, Failures: 0, Errors: 0, Skipped: 0, Time elapsed: 0.037 sec - in org.apache.commons.lang3.text.StrSubstitutorTest
Running org.apache.commons.lang3.text.StrBuilderTest
Tests run: 90, Failures: 0, Errors: 0, Skipped: 0, Time elapsed: 0.069 sec - in org.apache.commons.lang3.text.StrBuilderTest
Running org.apache.commons.lang3.StringEscapeUtilsTest
Tests run: 28, Failures: 0, Errors: 0, Skipped: 0, Time elapsed: 0.365 sec - in org.apache.commons.lang3.StringEscapeUtilsTest
Running org.apache.commons.lang3.AnnotationUtilsTest
Tests run: 10, Failures: 0, Errors: 0, Skipped: 0, Time elapsed: 0.018 sec - in org.apache.commons.lang3.AnnotationUtilsTest
Running org.apache.commons.lang3.ConversionTest
Tests run: 42, Failures: 0, Errors: 0, Skipped: 0, Time elapsed: 0.011 sec - in org.apache.commons.lang3.ConversionTest
Running org.apache.commons.lang3.StringUtilsTrimEmptyTest
Tests run: 15, Failures: 0, Errors: 0, Skipped: 0, Time elapsed: 0.008 sec - in org.apache.commons.lang3.StringUtilsTrimEmptyTest
Running org.apache.commons.lang3.EnumUtilsTest
Tests run: 34, Failures: 0, Errors: 0, Skipped: 0, Time elapsed: 0.012 sec - in org.apache.commons.lang3.EnumUtilsTest
Running org.apache.commons.lang3.exception.ExceptionUtilsTest
Tests run: 28, Failures: 0, Errors: 0, Skipped: 0, Time elapsed: 0.03 sec - in org.apache.commons.lang3.exception.ExceptionUtilsTest
Running org.apache.commons.lang3.exception.DefaultExceptionContextTest
Tests run: 8, Failures: 0, Errors: 0, Skipped: 0, Time elapsed: 0.005 sec - in org.apache.commons.lang3.exception.DefaultExceptionContextTest
Running org.apache.commons.lang3.exception.ContextedExceptionTest
Tests run: 14, Failures: 0, Errors: 0, Skipped: 0, Time elapsed: 0.013 sec - in org.apache.commons.lang3.exception.ContextedExceptionTest
Running org.apache.commons.lang3.exception.ContextedRuntimeExceptionTest
Tests run: 14, Failures: 0, Errors: 0, Skipped: 0, Time elapsed: 0.013 sec - in org.apache.commons.lang3.exception.ContextedRuntimeExceptionTest
Running org.apache.commons.lang3.BitFieldTest
Tests run: 15, Failures: 0, Errors: 0, Skipped: 0, Time elapsed: 0.003 sec - in org.apache.commons.lang3.BitFieldTest
Running org.apache.commons.lang3.ArrayUtilsRemoveMultipleTest
Tests run: 55, Failures: 0, Errors: 0, Skipped: 0, Time elapsed: 0.014 sec - in org.apache.commons.lang3.ArrayUtilsRemoveMultipleTest
Running org.apache.commons.lang3.HashSetvBitSetTest
Ratio=8% array=100 count=1 extract=19156673 bitset=1688566
Ratio=7% array=100 count=10 extract=21806678 bitset=1621873
Ratio=12% array=100 count=50 extract=11014510 bitset=1373487
Ratio=4% array=100 count=100 extract=12530565 bitset=570649
Ratio=42% array=1000 count=10 extract=14781149 bitset=6323730
Ratio=28% array=1000 count=100 extract=18341391 bitset=5260753
Ratio=7% array=1000 count=500 extract=49531949 bitset=3653255
Ratio=1% array=1000 count=1000 extract=78416884 bitset=869973
Ratio=43% count=0 hash=4522211 bits=1952855
Ratio=9% count=5 hash=2544006 bits=242426
Ratio=26% count=10 hash=1289784 bits=335982
Ratio=18% count=200 hash=28835855 bits=5372512
Ratio=15% count=50 hash=8273972 bits=1289847
Ratio=21% count=100 hash=12945150 bits=2820152
Ratio=16% count=1000 hash=116612259 bits=19221803
Ratio=15% count=2000 hash=239924602 bits=38097574
Tests run: 2, Failures: 0, Errors: 0, Skipped: 0, Time elapsed: 0.845 sec - in org.apache.commons.lang3.HashSetvBitSetTest
Running org.apache.commons.lang3.StringUtilsTest
Tests run: 124, Failures: 0, Errors: 0, Skipped: 0, Time elapsed: 0.164 sec - in org.apache.commons.lang3.StringUtilsTest
Running org.apache.commons.lang3.ArrayUtilsRemoveTest
Tests run: 19, Failures: 0, Errors: 0, Skipped: 0, Time elapsed: 0.006 sec - in org.apache.commons.lang3.ArrayUtilsRemoveTest
Running org.apache.commons.lang3.ObjectUtilsTest
Tests run: 36, Failures: 0, Errors: 0, Skipped: 0, Time elapsed: 0.034 sec - in org.apache.commons.lang3.ObjectUtilsTest
Running org.apache.commons.lang3.ClassPathUtilsTest
Tests run: 13, Failures: 0, Errors: 0, Skipped: 0, Time elapsed: 0.001 sec - in org.apache.commons.lang3.ClassPathUtilsTest
Running org.apache.commons.lang3.math.NumberUtilsTest
Tests run: 91, Failures: 0, Errors: 0, Skipped: 0, Time elapsed: 0.02 sec - in org.apache.commons.lang3.math.NumberUtilsTest
Running org.apache.commons.lang3.math.IEEE754rUtilsTest
Tests run: 3, Failures: 0, Errors: 0, Skipped: 0, Time elapsed: 0 sec - in org.apache.commons.lang3.math.IEEE754rUtilsTest
Running org.apache.commons.lang3.math.FractionTest
Tests run: 25, Failures: 0, Errors: 0, Skipped: 0, Time elapsed: 0.104 sec - in org.apache.commons.lang3.math.FractionTest
Running org.apache.commons.lang3.BooleanUtilsTest
Tests run: 72, Failures: 0, Errors: 0, Skipped: 0, Time elapsed: 0.021 sec - in org.apache.commons.lang3.BooleanUtilsTest
Running org.apache.commons.lang3.CharSequenceUtilsTest
Tests run: 2, Failures: 0, Errors: 0, Skipped: 0, Time elapsed: 0 sec - in org.apache.commons.lang3.CharSequenceUtilsTest
Running org.apache.commons.lang3.CharSetUtilsTest
Tests run: 11, Failures: 0, Errors: 0, Skipped: 0, Time elapsed: 0.002 sec - in org.apache.commons.lang3.CharSetUtilsTest
Running org.apache.commons.lang3.ArrayUtilsAddTest
Tests run: 13, Failures: 0, Errors: 0, Skipped: 0, Time elapsed: 0.008 sec - in org.apache.commons.lang3.ArrayUtilsAddTest
Running org.apache.commons.lang3.CharEncodingTest
Tests run: 6, Failures: 0, Errors: 0, Skipped: 0, Time elapsed: 0.035 sec - in org.apache.commons.lang3.CharEncodingTest
Running org.apache.commons.lang3.ClassUtilsTest
Tests run: 57, Failures: 0, Errors: 0, Skipped: 0, Time elapsed: 0.043 sec - in org.apache.commons.lang3.ClassUtilsTest
Running org.apache.commons.lang3.RangeTest
Tests run: 24, Failures: 0, Errors: 0, Skipped: 0, Time elapsed: 0.019 sec - in org.apache.commons.lang3.RangeTest
Running org.apache.commons.lang3.event.EventUtilsTest
Tests run: 8, Failures: 0, Errors: 0, Skipped: 0, Time elapsed: 0.023 sec - in org.apache.commons.lang3.event.EventUtilsTest
Running org.apache.commons.lang3.event.EventListenerSupportTest
Tests run: 9, Failures: 0, Errors: 0, Skipped: 0, Time elapsed: 0.027 sec - in org.apache.commons.lang3.event.EventListenerSupportTest
Running org.apache.commons.lang3.ArrayUtilsTest
Tests run: 205, Failures: 0, Errors: 0, Skipped: 0, Time elapsed: 0.083 sec - in org.apache.commons.lang3.ArrayUtilsTest
Running org.apache.commons.lang3.CharUtilsTest
Tests run: 24, Failures: 0, Errors: 0, Skipped: 0, Time elapsed: 0.012 sec - in org.apache.commons.lang3.CharUtilsTest
Running org.apache.commons.lang3.NotImplementedExceptionTest
Tests run: 1, Failures: 0, Errors: 0, Skipped: 0, Time elapsed: 0.001 sec - in org.apache.commons.lang3.NotImplementedExceptionTest
Running org.apache.commons.lang3.StringUtilsEqualsIndexOfTest
Tests run: 50, Failures: 0, Errors: 0, Skipped: 0, Time elapsed: 0.032 sec - in org.apache.commons.lang3.StringUtilsEqualsIndexOfTest
Running org.apache.commons.lang3.RandomUtilsTest
Tests run: 23, Failures: 0, Errors: 0, Skipped: 0, Time elapsed: 0.015 sec - in org.apache.commons.lang3.RandomUtilsTest

Results :

Failed tests: 
  DateUtilsRoundingTest.testRoundAmPm:273->baseRoundTest:617 expected:<Sun Jun 01 00:00:00 BST 2008> but was:<Sun Jun 01 12:00:00 BST 2008>
  DateUtilsRoundingTest.testRoundDate:222->baseRoundTest:617 expected:<Sun Jun 01 00:00:00 BST 2008> but was:<Mon Jun 02 00:00:00 BST 2008>
  DateUtilsRoundingTest.testRoundDayOfMonth:247->baseRoundTest:617 expected:<Sun Jun 01 00:00:00 BST 2008> but was:<Mon Jun 02 00:00:00 BST 2008>
  DateUtilsRoundingTest.testRoundHour:329->baseRoundTest:617 expected:<Sun Jun 01 08:00:00 BST 2008> but was:<Sun Jun 01 09:00:00 BST 2008>
  DateUtilsRoundingTest.testRoundHourOfDay:304->baseRoundTest:617 expected:<Sun Jun 01 08:00:00 BST 2008> but was:<Sun Jun 01 09:00:00 BST 2008>
  DateUtilsRoundingTest.testRoundMinute:354->baseRoundTest:617 expected:<Sun Jun 01 08:15:00 BST 2008> but was:<Sun Jun 01 08:16:00 BST 2008>
  DateUtilsRoundingTest.testRoundMonth:111->baseRoundTest:617 expected:<Thu Feb 01 00:00:00 GMT 2007> but was:<Thu Mar 01 00:00:00 GMT 2007>
  DateUtilsRoundingTest.testRoundSecond:379->baseRoundTest:617 expected:<Sun Jun 01 08:15:14 BST 2008> but was:<Sun Jun 01 08:15:15 BST 2008>
  DateUtilsRoundingTest.testRoundSemiMonth:155->baseRoundTest:617 expected:<Thu Feb 01 00:00:00 GMT 2007> but was:<Fri Feb 16 00:00:00 GMT 2007>
  DateUtilsRoundingTest.testRoundYear:90->baseRoundTest:617 expected:<Mon Jan 01 00:00:00 GMT 2007> but was:<Tue Jan 01 00:00:00 GMT 2008>
  DateUtilsRoundingTest.testTruncateAmPm:530->baseTruncateTest:665 Truncating 2008-06-01T00:00:00 as Date with CalendarField-value 9 must return itself expected:<Sun Jun 01 00:00:00 BST 2008> but was:<Sun Jun 01 12:00:00 BST 2008>
  DateUtilsRoundingTest.testTruncateDate:501->baseTruncateTest:665 Truncating 2008-06-01T00:00:00 as Date with CalendarField-value 5 must return itself expected:<Sun Jun 01 00:00:00 BST 2008> but was:<Mon Jun 02 00:00:00 BST 2008>
  DateUtilsRoundingTest.testTruncateDayOfMonth:514->baseTruncateTest:665 Truncating 2008-06-01T00:00:00 as Date with CalendarField-value 5 must return itself expected:<Sun Jun 01 00:00:00 BST 2008> but was:<Mon Jun 02 00:00:00 BST 2008>
  DateUtilsRoundingTest.testTruncateHour:547->baseTruncateTest:665 Truncating 2008-06-01T08:00:00 as Date with CalendarField-value 10 must return itself expected:<Sun Jun 01 08:00:00 BST 2008> but was:<Sun Jun 01 09:00:00 BST 2008>
  DateUtilsRoundingTest.testTruncateHourOfDay:560->baseTruncateTest:665 Truncating 2008-06-01T08:00:00 as Date with CalendarField-value 11 must return itself expected:<Sun Jun 01 08:00:00 BST 2008> but was:<Sun Jun 01 09:00:00 BST 2008>
  DateUtilsRoundingTest.testTruncateMinute:573->baseTruncateTest:665 Truncating 2008-06-01T08:15:00 as Date with CalendarField-value 12 must return itself expected:<Sun Jun 01 08:15:00 BST 2008> but was:<Sun Jun 01 08:16:00 BST 2008>
  DateUtilsRoundingTest.testTruncateMonth:434->baseTruncateTest:665 Truncating 2008-03-01T00:00:00 as Date with CalendarField-value 2 must return itself expected:<Sat Mar 01 00:00:00 GMT 2008> but was:<Tue Apr 01 00:00:00 BST 2008>
  DateUtilsRoundingTest.testTruncateSecond:586->baseTruncateTest:665 Truncating 2008-06-01T08:15:14 as Date with CalendarField-value 13 must return itself expected:<Sun Jun 01 08:15:14 BST 2008> but was:<Sun Jun 01 08:15:15 BST 2008>
  DateUtilsRoundingTest.testTruncateSemiMonth:452->baseTruncateTest:665 Truncating 2007-02-01T00:00:00 as Date with CalendarField-value 1001 must return itself expected:<Thu Feb 01 00:00:00 GMT 2007> but was:<Fri Feb 16 00:00:00 GMT 2007>
  DateUtilsRoundingTest.testTruncateYear:420->baseTruncateTest:665 Truncating 2007-01-01T00:00:00 as Date with CalendarField-value 1 must return itself expected:<Mon Jan 01 00:00:00 GMT 2007> but was:<Tue Jan 01 00:00:00 GMT 2008>
  DateUtilsTest.testAddMilliseconds:459->assertDate:631 expected:<5> but was:<4>
  DateUtilsTest.testAddMonths:339->assertDate:631 expected:<5> but was:<4>
  DateUtilsTest.testCeil:1236 ceiling javadoc-1 failed expected:<Thu Mar 28 14:00:00 UTC 2002> but was:<Thu Mar 28 13:00:00 UTC 2002>
  DateUtilsTest.testMonthIterator:1565->assertWeekIterator:1665->assertWeekIterator:1675->assertCalendarsEquals:1702  expected Sun Jan 27 00:00:00 UTC 2002 but got Sun Feb 24 00:00:00 UTC 2002
  DateUtilsTest.testRound:659 round year-1 failed expected:<Tue Jan 01 00:00:00 UTC 2002> but was:<Wed Jan 01 00:00:00 UTC 2003>
  DateUtilsTest.testRoundLang346:896 Minute No Round Failed expected:<Mon Jul 02 08:08:00 UTC 2007> but was:<Mon Jul 02 08:09:00 UTC 2007>
  DateUtilsTest.testSetDays:521->assertDate:631 expected:<5> but was:<4>
  DateUtilsTest.testSetHours:543->assertDate:631 expected:<5> but was:<4>
  DateUtilsTest.testSetMonths:499->assertDate:631 expected:<5> but was:<4>
  DateUtilsTest.testSetSeconds:587->assertDate:631 expected:<5> but was:<4>
  DateUtilsTest.testSetYears:479->assertDate:631 expected:<5> but was:<4>
  DateUtilsTest.testTruncate:950 truncate year-1 failed expected:<Tue Jan 01 00:00:00 UTC 2002> but was:<Wed Jan 01 00:00:00 UTC 2003>
  DateUtilsTest.testTruncateLang59:1179 Truncate Calendar.SECOND expected:<Sun Oct 31 01:02:03 MDT 2004> but was:<Sun Oct 31 01:02:04 MDT 2004>
  DateUtilsTest.testWeekIterator:1531->assertWeekIterator:1653->assertWeekIterator:1680->assertCalendarsEquals:1702  expected Sun Aug 02 00:00:00 MDT 2015 but got Mon Aug 03 00:00:00 MDT 2015



Tests run: 3526, Failures: 34, Errors: 0, Skipped: 97

[INFO] ------------------------------------------------------------------------
[INFO] BUILD FAILURE
[INFO] ------------------------------------------------------------------------
[INFO] Total time: 37.514s
[INFO] Finished at: Wed Aug 05 06:54:54 BST 2015
[INFO] Final Memory: 25M/497M
[INFO] ------------------------------------------------------------------------
[ERROR] Failed to execute goal org.apache.maven.plugins:maven-surefire-plugin:2.18:test (default-test) on project commons-lang3: There are test failures.
[ERROR] 
[ERROR] Please refer to /home/perham/Study/LittleDarwin/Cases/commons-lang3-3.4-src/target/surefire-reports for the individual test results.
[ERROR] -> [Help 1]
[ERROR] 
[ERROR] To see the full stack trace of the errors, re-run Maven with the -e switch.
[ERROR] Re-run Maven using the -X switch to enable full debug logging.
[ERROR] 
[ERROR] For more information about the errors and possible solutions, please read the following articles:
[ERROR] [Help 1] http://cwiki.apache.org/confluence/display/MAVEN/MojoFailureException
