[INFO] Scanning for projects...
[INFO]                                                                         
[INFO] ------------------------------------------------------------------------
[INFO] Building Apache Commons Lang 3.4
[INFO] ------------------------------------------------------------------------
[INFO] 
[INFO] --- maven-enforcer-plugin:1.3.1:enforce (enforce-maven-3) @ commons-lang3 ---
[INFO] 
[INFO] --- build-helper-maven-plugin:1.8:parse-version (parse-version) @ commons-lang3 ---
[INFO] 
[INFO] --- maven-antrun-plugin:1.8:run (javadoc.resources) @ commons-lang3 ---
[INFO] Executing tasks

main:
[INFO] Executed tasks
[INFO] 
[INFO] --- maven-remote-resources-plugin:1.5:process (default) @ commons-lang3 ---
[INFO] 
[INFO] --- buildnumber-maven-plugin:1.3:create (default) @ commons-lang3 ---
[INFO] Executing: /bin/sh -c cd /home/perham/Study/LittleDarwin/Cases/commons-lang3-3.4-src && svn --non-interactive info
[INFO] Working directory: /home/perham/Study/LittleDarwin/Cases/commons-lang3-3.4-src
[INFO] Storing buildNumber: ?????? at timestamp: 1438747202875
[INFO] Executing: /bin/sh -c cd /home/perham/Study/LittleDarwin/Cases/commons-lang3-3.4-src && svn --non-interactive info
[INFO] Working directory: /home/perham/Study/LittleDarwin/Cases/commons-lang3-3.4-src
[INFO] Storing buildScmBranch: UNKNOWN_BRANCH
[INFO] 
[INFO] --- maven-resources-plugin:2.7:resources (default-resources) @ commons-lang3 ---
[INFO] Using 'ISO-8859-1' encoding to copy filtered resources.
[INFO] Copying 0 resource
[INFO] Copying 2 resources to META-INF
[INFO] 
[INFO] --- maven-compiler-plugin:3.2:compile (default-compile) @ commons-lang3 ---
[INFO] Changes detected - recompiling the module!
[INFO] Compiling 133 source files to /home/perham/Study/LittleDarwin/Cases/commons-lang3-3.4-src/target/classes
[INFO] /home/perham/Study/LittleDarwin/Cases/commons-lang3-3.4-src/src/main/java/org/apache/commons/lang3/SerializationUtils.java: /home/perham/Study/LittleDarwin/Cases/commons-lang3-3.4-src/src/main/java/org/apache/commons/lang3/SerializationUtils.java uses unchecked or unsafe operations.
[INFO] /home/perham/Study/LittleDarwin/Cases/commons-lang3-3.4-src/src/main/java/org/apache/commons/lang3/SerializationUtils.java: Recompile with -Xlint:unchecked for details.
[INFO] 
[INFO] --- maven-bundle-plugin:2.5.3:manifest (bundle-manifest) @ commons-lang3 ---
[INFO] 
[INFO] --- animal-sniffer-maven-plugin:1.13:check (checkAPIcompatibility) @ commons-lang3 ---
[INFO] Checking unresolved references to org.codehaus.mojo.signature:java16:1.0
[INFO] 
[INFO] --- maven-resources-plugin:2.7:testResources (default-testResources) @ commons-lang3 ---
[INFO] Using 'ISO-8859-1' encoding to copy filtered resources.
[INFO] Copying 2 resources
[INFO] Copying 2 resources to META-INF
[INFO] 
[INFO] --- maven-compiler-plugin:3.2:testCompile (default-testCompile) @ commons-lang3 ---
[INFO] Nothing to compile - all classes are up to date
[INFO] 
[INFO] --- maven-surefire-plugin:2.18:test (default-test) @ commons-lang3 ---
[INFO] Surefire report directory: /home/perham/Study/LittleDarwin/Cases/commons-lang3-3.4-src/target/surefire-reports

-------------------------------------------------------
 T E S T S
-------------------------------------------------------
Running org.apache.commons.lang3.ValidateTest
Tests run: 63, Failures: 0, Errors: 0, Skipped: 0, Time elapsed: 0.044 sec - in org.apache.commons.lang3.ValidateTest
Running org.apache.commons.lang3.LocaleUtilsTest
Tests run: 15, Failures: 0, Errors: 0, Skipped: 0, Time elapsed: 0.022 sec - in org.apache.commons.lang3.LocaleUtilsTest
Running org.apache.commons.lang3.tuple.MutableTripleTest
Tests run: 8, Failures: 0, Errors: 0, Skipped: 0, Time elapsed: 0.012 sec - in org.apache.commons.lang3.tuple.MutableTripleTest
Running org.apache.commons.lang3.tuple.TripleTest
Tests run: 10, Failures: 0, Errors: 0, Skipped: 0, Time elapsed: 0.006 sec - in org.apache.commons.lang3.tuple.TripleTest
Running org.apache.commons.lang3.tuple.ImmutablePairTest
Tests run: 6, Failures: 0, Errors: 0, Skipped: 0, Time elapsed: 0 sec - in org.apache.commons.lang3.tuple.ImmutablePairTest
Running org.apache.commons.lang3.tuple.MutablePairTest
Tests run: 8, Failures: 0, Errors: 0, Skipped: 0, Time elapsed: 0.002 sec - in org.apache.commons.lang3.tuple.MutablePairTest
Running org.apache.commons.lang3.tuple.ImmutableTripleTest
Tests run: 6, Failures: 0, Errors: 0, Skipped: 0, Time elapsed: 0.003 sec - in org.apache.commons.lang3.tuple.ImmutableTripleTest
Running org.apache.commons.lang3.tuple.PairTest
Tests run: 9, Failures: 0, Errors: 0, Skipped: 0, Time elapsed: 0.001 sec - in org.apache.commons.lang3.tuple.PairTest
Running org.apache.commons.lang3.StringUtilsIsTest
Tests run: 8, Failures: 0, Errors: 0, Skipped: 0, Time elapsed: 0.024 sec - in org.apache.commons.lang3.StringUtilsIsTest
Running org.apache.commons.lang3.JavaVersionTest
Tests run: 3, Failures: 0, Errors: 0, Skipped: 0, Time elapsed: 0.001 sec - in org.apache.commons.lang3.JavaVersionTest
Running org.apache.commons.lang3.builder.NoFieldNamesToStringStyleTest
Tests run: 8, Failures: 0, Errors: 0, Skipped: 0, Time elapsed: 0.007 sec - in org.apache.commons.lang3.builder.NoFieldNamesToStringStyleTest
Running org.apache.commons.lang3.builder.ShortPrefixToStringStyleTest
Tests run: 8, Failures: 0, Errors: 0, Skipped: 0, Time elapsed: 0.004 sec - in org.apache.commons.lang3.builder.ShortPrefixToStringStyleTest
Running org.apache.commons.lang3.builder.DiffResultTest
Tests run: 9, Failures: 0, Errors: 0, Skipped: 0, Time elapsed: 0.003 sec - in org.apache.commons.lang3.builder.DiffResultTest
Running org.apache.commons.lang3.builder.CompareToBuilderTest
Tests run: 48, Failures: 0, Errors: 0, Skipped: 0, Time elapsed: 0.044 sec - in org.apache.commons.lang3.builder.CompareToBuilderTest
Running org.apache.commons.lang3.builder.MultilineRecursiveToStringStyleTest
Tests run: 10, Failures: 0, Errors: 0, Skipped: 0, Time elapsed: 0.005 sec - in org.apache.commons.lang3.builder.MultilineRecursiveToStringStyleTest
Running org.apache.commons.lang3.builder.RecursiveToStringStyleTest
Tests run: 8, Failures: 0, Errors: 0, Skipped: 0, Time elapsed: 0.017 sec - in org.apache.commons.lang3.builder.RecursiveToStringStyleTest
Running org.apache.commons.lang3.builder.DefaultToStringStyleTest
Tests run: 8, Failures: 0, Errors: 0, Skipped: 0, Time elapsed: 0.003 sec - in org.apache.commons.lang3.builder.DefaultToStringStyleTest
Running org.apache.commons.lang3.builder.ReflectionToStringBuilderExcludeTest
Tests run: 11, Failures: 0, Errors: 0, Skipped: 0, Time elapsed: 0.004 sec - in org.apache.commons.lang3.builder.ReflectionToStringBuilderExcludeTest
Running org.apache.commons.lang3.builder.StandardToStringStyleTest
Tests run: 8, Failures: 0, Errors: 0, Skipped: 0, Time elapsed: 0.001 sec - in org.apache.commons.lang3.builder.StandardToStringStyleTest
Running org.apache.commons.lang3.builder.ToStringStyleTest
Tests run: 12, Failures: 0, Errors: 0, Skipped: 0, Time elapsed: 0.002 sec - in org.apache.commons.lang3.builder.ToStringStyleTest
Running org.apache.commons.lang3.builder.DiffTest
Tests run: 4, Failures: 0, Errors: 0, Skipped: 0, Time elapsed: 0.001 sec - in org.apache.commons.lang3.builder.DiffTest
Running org.apache.commons.lang3.builder.SimpleToStringStyleTest
Tests run: 8, Failures: 0, Errors: 0, Skipped: 0, Time elapsed: 0 sec - in org.apache.commons.lang3.builder.SimpleToStringStyleTest
Running org.apache.commons.lang3.builder.MultiLineToStringStyleTest
Tests run: 8, Failures: 0, Errors: 0, Skipped: 0, Time elapsed: 0.001 sec - in org.apache.commons.lang3.builder.MultiLineToStringStyleTest
Running org.apache.commons.lang3.builder.ToStringStyleConcurrencyTest
Tests run: 3, Failures: 0, Errors: 0, Skipped: 0, Time elapsed: 4.996 sec - in org.apache.commons.lang3.builder.ToStringStyleConcurrencyTest
Running org.apache.commons.lang3.builder.ReflectionToStringBuilderMutateInspectConcurrencyTest
Tests run: 1, Failures: 0, Errors: 0, Skipped: 1, Time elapsed: 0.002 sec - in org.apache.commons.lang3.builder.ReflectionToStringBuilderMutateInspectConcurrencyTest
Running org.apache.commons.lang3.builder.ToStringBuilderTest
Tests run: 74, Failures: 0, Errors: 0, Skipped: 1, Time elapsed: 0.058 sec - in org.apache.commons.lang3.builder.ToStringBuilderTest
Running org.apache.commons.lang3.builder.EqualsBuilderTest
Tests run: 48, Failures: 0, Errors: 0, Skipped: 0, Time elapsed: 0.006 sec - in org.apache.commons.lang3.builder.EqualsBuilderTest
Running org.apache.commons.lang3.builder.HashCodeBuilderAndEqualsBuilderTest
Tests run: 4, Failures: 0, Errors: 0, Skipped: 0, Time elapsed: 0 sec - in org.apache.commons.lang3.builder.HashCodeBuilderAndEqualsBuilderTest
Running org.apache.commons.lang3.builder.ReflectionToStringBuilderConcurrencyTest
Tests run: 3, Failures: 0, Errors: 0, Skipped: 3, Time elapsed: 0 sec - in org.apache.commons.lang3.builder.ReflectionToStringBuilderConcurrencyTest
Running org.apache.commons.lang3.builder.JsonToStringStyleTest
Tests run: 9, Failures: 0, Errors: 0, Skipped: 0, Time elapsed: 0 sec - in org.apache.commons.lang3.builder.JsonToStringStyleTest
Running org.apache.commons.lang3.builder.NoClassNameToStringStyleTest
Tests run: 8, Failures: 0, Errors: 0, Skipped: 0, Time elapsed: 0.002 sec - in org.apache.commons.lang3.builder.NoClassNameToStringStyleTest
Running org.apache.commons.lang3.builder.DiffBuilderTest
Tests run: 30, Failures: 0, Errors: 0, Skipped: 0, Time elapsed: 0.017 sec - in org.apache.commons.lang3.builder.DiffBuilderTest
Running org.apache.commons.lang3.builder.HashCodeBuilderTest
Tests run: 44, Failures: 0, Errors: 0, Skipped: 0, Time elapsed: 0.016 sec - in org.apache.commons.lang3.builder.HashCodeBuilderTest
Running org.apache.commons.lang3.concurrent.AtomicInitializerTest
Tests run: 3, Failures: 0, Errors: 0, Skipped: 0, Time elapsed: 0 sec - in org.apache.commons.lang3.concurrent.AtomicInitializerTest
Running org.apache.commons.lang3.concurrent.CallableBackgroundInitializerTest
Tests run: 4, Failures: 0, Errors: 0, Skipped: 0, Time elapsed: 0.001 sec - in org.apache.commons.lang3.concurrent.CallableBackgroundInitializerTest
Running org.apache.commons.lang3.concurrent.BackgroundInitializerTest
Tests run: 15, Failures: 0, Errors: 0, Skipped: 0, Time elapsed: 0.019 sec - in org.apache.commons.lang3.concurrent.BackgroundInitializerTest
Running org.apache.commons.lang3.concurrent.LazyInitializerTest
Tests run: 3, Failures: 0, Errors: 0, Skipped: 0, Time elapsed: 0.008 sec - in org.apache.commons.lang3.concurrent.LazyInitializerTest
Running org.apache.commons.lang3.concurrent.BasicThreadFactoryTest
Tests run: 15, Failures: 0, Errors: 0, Skipped: 0, Time elapsed: 0.03 sec - in org.apache.commons.lang3.concurrent.BasicThreadFactoryTest
Running org.apache.commons.lang3.concurrent.ConstantInitializerTest
Tests run: 7, Failures: 0, Errors: 0, Skipped: 0, Time elapsed: 0.001 sec - in org.apache.commons.lang3.concurrent.ConstantInitializerTest
Running org.apache.commons.lang3.concurrent.MultiBackgroundInitializerTest
Tests run: 17, Failures: 0, Errors: 0, Skipped: 0, Time elapsed: 0.113 sec - in org.apache.commons.lang3.concurrent.MultiBackgroundInitializerTest
Running org.apache.commons.lang3.concurrent.AtomicSafeInitializerTest
Tests run: 4, Failures: 0, Errors: 0, Skipped: 0, Time elapsed: 0.005 sec - in org.apache.commons.lang3.concurrent.AtomicSafeInitializerTest
Running org.apache.commons.lang3.concurrent.ConcurrentUtilsTest
Tests run: 40, Failures: 0, Errors: 0, Skipped: 0, Time elapsed: 0.012 sec - in org.apache.commons.lang3.concurrent.ConcurrentUtilsTest
Running org.apache.commons.lang3.concurrent.TimedSemaphoreTest
Tests run: 15, Failures: 0, Errors: 0, Skipped: 0, Time elapsed: 1.188 sec - in org.apache.commons.lang3.concurrent.TimedSemaphoreTest
Running org.apache.commons.lang3.StringUtilsSubstringTest
Tests run: 14, Failures: 0, Errors: 0, Skipped: 0, Time elapsed: 0.002 sec - in org.apache.commons.lang3.StringUtilsSubstringTest
Running org.apache.commons.lang3.SystemUtilsTest
Tests run: 12, Failures: 0, Errors: 0, Skipped: 0, Time elapsed: 0.003 sec - in org.apache.commons.lang3.SystemUtilsTest
Running org.apache.commons.lang3.CharRangeTest
Tests run: 16, Failures: 0, Errors: 0, Skipped: 0, Time elapsed: 0.035 sec - in org.apache.commons.lang3.CharRangeTest
Running org.apache.commons.lang3.CharSetTest
Tests run: 14, Failures: 0, Errors: 0, Skipped: 0, Time elapsed: 0.01 sec - in org.apache.commons.lang3.CharSetTest
Running org.apache.commons.lang3.StringUtilsStartsEndsWithTest
Tests run: 6, Failures: 0, Errors: 0, Skipped: 0, Time elapsed: 0.003 sec - in org.apache.commons.lang3.StringUtilsStartsEndsWithTest
Running org.apache.commons.lang3.RandomStringUtilsTest
Tests run: 11, Failures: 0, Errors: 0, Skipped: 0, Time elapsed: 0.036 sec - in org.apache.commons.lang3.RandomStringUtilsTest
Running org.apache.commons.lang3.SerializationUtilsTest
Tests run: 26, Failures: 0, Errors: 0, Skipped: 0, Time elapsed: 0.056 sec - in org.apache.commons.lang3.SerializationUtilsTest
Running org.apache.commons.lang3.time.StopWatchTest
Tests run: 8, Failures: 0, Errors: 0, Skipped: 0, Time elapsed: 4.759 sec - in org.apache.commons.lang3.time.StopWatchTest
Running org.apache.commons.lang3.time.DateUtilsRoundingTest
Tests run: 22, Failures: 0, Errors: 0, Skipped: 0, Time elapsed: 0.172 sec - in org.apache.commons.lang3.time.DateUtilsRoundingTest
Running org.apache.commons.lang3.time.FastDateParserTest
Tests run: 33, Failures: 0, Errors: 0, Skipped: 0, Time elapsed: 2.399 sec - in org.apache.commons.lang3.time.FastDateParserTest
Running org.apache.commons.lang3.time.FastDateFormat_ParserTest
Tests run: 33, Failures: 0, Errors: 0, Skipped: 0, Time elapsed: 0.753 sec - in org.apache.commons.lang3.time.FastDateFormat_ParserTest
Running org.apache.commons.lang3.time.DurationFormatUtilsTest
Tests run: 25, Failures: 0, Errors: 0, Skipped: 0, Time elapsed: 0.974 sec - in org.apache.commons.lang3.time.DurationFormatUtilsTest
Running org.apache.commons.lang3.time.DateFormatUtilsTest
Tests run: 10, Failures: 0, Errors: 0, Skipped: 0, Time elapsed: 0.002 sec - in org.apache.commons.lang3.time.DateFormatUtilsTest
Running org.apache.commons.lang3.time.DateUtilsFragmentTest
Tests run: 57, Failures: 0, Errors: 0, Skipped: 0, Time elapsed: 0.01 sec - in org.apache.commons.lang3.time.DateUtilsFragmentTest
Running org.apache.commons.lang3.time.FastDatePrinterTimeZonesTest
Tests run: 617, Failures: 0, Errors: 0, Skipped: 0, Time elapsed: 0.231 sec - in org.apache.commons.lang3.time.FastDatePrinterTimeZonesTest
Running org.apache.commons.lang3.time.FastDateFormatTest
>>FastDateFormatTest: FastDateParser:20649  SimpleDateFormat:3249
Tests run: 14, Failures: 0, Errors: 0, Skipped: 0, Time elapsed: 2.652 sec - in org.apache.commons.lang3.time.FastDateFormatTest
Running org.apache.commons.lang3.time.FastDateFormat_PrinterTest
Tests run: 17, Failures: 0, Errors: 0, Skipped: 0, Time elapsed: 0.012 sec - in org.apache.commons.lang3.time.FastDateFormat_PrinterTest
Running org.apache.commons.lang3.time.FastDatePrinterTest
Tests run: 17, Failures: 0, Errors: 0, Skipped: 0, Time elapsed: 0.008 sec - in org.apache.commons.lang3.time.FastDatePrinterTest
Running org.apache.commons.lang3.time.FastDateParserSDFTest
Tests run: 276, Failures: 0, Errors: 0, Skipped: 92, Time elapsed: 0.076 sec - in org.apache.commons.lang3.time.FastDateParserSDFTest
Running org.apache.commons.lang3.time.DateUtilsTest
DateUtilsTest: Default Locale=en_US
Tests run: 38, Failures: 0, Errors: 0, Skipped: 0, Time elapsed: 0.025 sec - in org.apache.commons.lang3.time.DateUtilsTest
Running org.apache.commons.lang3.reflect.InheritanceUtilsTest
Tests run: 9, Failures: 0, Errors: 0, Skipped: 0, Time elapsed: 0.007 sec - in org.apache.commons.lang3.reflect.InheritanceUtilsTest
Running org.apache.commons.lang3.reflect.MethodUtilsTest
Tests run: 23, Failures: 0, Errors: 0, Skipped: 0, Time elapsed: 0.04 sec - in org.apache.commons.lang3.reflect.MethodUtilsTest
Running org.apache.commons.lang3.reflect.ConstructorUtilsTest
Tests run: 7, Failures: 0, Errors: 0, Skipped: 0, Time elapsed: 0.01 sec - in org.apache.commons.lang3.reflect.ConstructorUtilsTest
Running org.apache.commons.lang3.reflect.FieldUtilsTest
Tests run: 64, Failures: 0, Errors: 0, Skipped: 0, Time elapsed: 0.031 sec - in org.apache.commons.lang3.reflect.FieldUtilsTest
Running org.apache.commons.lang3.reflect.TypeLiteralTest
Tests run: 4, Failures: 0, Errors: 0, Skipped: 0, Time elapsed: 0.006 sec - in org.apache.commons.lang3.reflect.TypeLiteralTest
Running org.apache.commons.lang3.reflect.TypeUtilsTest
Tests run: 19, Failures: 0, Errors: 0, Skipped: 0, Time elapsed: 0.052 sec - in org.apache.commons.lang3.reflect.TypeUtilsTest
Running org.apache.commons.lang3.mutable.MutableByteTest
Tests run: 17, Failures: 0, Errors: 0, Skipped: 0, Time elapsed: 0.004 sec - in org.apache.commons.lang3.mutable.MutableByteTest
Running org.apache.commons.lang3.mutable.MutableShortTest
Tests run: 14, Failures: 0, Errors: 0, Skipped: 0, Time elapsed: 0.004 sec - in org.apache.commons.lang3.mutable.MutableShortTest
Running org.apache.commons.lang3.mutable.MutableIntTest
Tests run: 17, Failures: 0, Errors: 0, Skipped: 0, Time elapsed: 0.006 sec - in org.apache.commons.lang3.mutable.MutableIntTest
Running org.apache.commons.lang3.mutable.MutableDoubleTest
Tests run: 18, Failures: 0, Errors: 0, Skipped: 0, Time elapsed: 0.009 sec - in org.apache.commons.lang3.mutable.MutableDoubleTest
Running org.apache.commons.lang3.mutable.MutableFloatTest
Tests run: 18, Failures: 0, Errors: 0, Skipped: 0, Time elapsed: 0.009 sec - in org.apache.commons.lang3.mutable.MutableFloatTest
Running org.apache.commons.lang3.mutable.MutableLongTest
Tests run: 17, Failures: 0, Errors: 0, Skipped: 0, Time elapsed: 0.01 sec - in org.apache.commons.lang3.mutable.MutableLongTest
Running org.apache.commons.lang3.mutable.MutableBooleanTest
Tests run: 9, Failures: 0, Errors: 0, Skipped: 0, Time elapsed: 0.005 sec - in org.apache.commons.lang3.mutable.MutableBooleanTest
Running org.apache.commons.lang3.mutable.MutableObjectTest
Tests run: 5, Failures: 0, Errors: 0, Skipped: 0, Time elapsed: 0.003 sec - in org.apache.commons.lang3.mutable.MutableObjectTest
Running org.apache.commons.lang3.text.translate.UnicodeEscaperTest
Tests run: 3, Failures: 0, Errors: 0, Skipped: 0, Time elapsed: 0.002 sec - in org.apache.commons.lang3.text.translate.UnicodeEscaperTest
Running org.apache.commons.lang3.text.translate.EntityArraysTest
Tests run: 3, Failures: 0, Errors: 0, Skipped: 0, Time elapsed: 0.001 sec - in org.apache.commons.lang3.text.translate.EntityArraysTest
Running org.apache.commons.lang3.text.translate.UnicodeUnpairedSurrogateRemoverTest
Tests run: 2, Failures: 0, Errors: 0, Skipped: 0, Time elapsed: 0.001 sec - in org.apache.commons.lang3.text.translate.UnicodeUnpairedSurrogateRemoverTest
Running org.apache.commons.lang3.text.translate.NumericEntityUnescaperTest
Tests run: 3, Failures: 0, Errors: 0, Skipped: 0, Time elapsed: 0.001 sec - in org.apache.commons.lang3.text.translate.NumericEntityUnescaperTest
Running org.apache.commons.lang3.text.translate.NumericEntityEscaperTest
Tests run: 4, Failures: 0, Errors: 0, Skipped: 0, Time elapsed: 0.001 sec - in org.apache.commons.lang3.text.translate.NumericEntityEscaperTest
Running org.apache.commons.lang3.text.translate.LookupTranslatorTest
Tests run: 2, Failures: 2, Errors: 0, Skipped: 0, Time elapsed: 0.004 sec <<< FAILURE! - in org.apache.commons.lang3.text.translate.LookupTranslatorTest
testBasicLookup(org.apache.commons.lang3.text.translate.LookupTranslatorTest)  Time elapsed: 0.004 sec  <<< FAILURE!
java.lang.AssertionError: Incorrect codepoint consumption expected:<3> but was:<0>
	at org.junit.Assert.fail(Assert.java:88)
	at org.junit.Assert.failNotEquals(Assert.java:834)
	at org.junit.Assert.assertEquals(Assert.java:645)
	at org.apache.commons.lang3.text.translate.LookupTranslatorTest.testBasicLookup(LookupTranslatorTest.java:38)

testLang882(org.apache.commons.lang3.text.translate.LookupTranslatorTest)  Time elapsed: 0 sec  <<< FAILURE!
java.lang.AssertionError: Incorrect codepoint consumption expected:<3> but was:<0>
	at org.junit.Assert.fail(Assert.java:88)
	at org.junit.Assert.failNotEquals(Assert.java:834)
	at org.junit.Assert.assertEquals(Assert.java:645)
	at org.apache.commons.lang3.text.translate.LookupTranslatorTest.testLang882(LookupTranslatorTest.java:48)

Running org.apache.commons.lang3.text.translate.UnicodeUnescaperTest
Tests run: 3, Failures: 0, Errors: 0, Skipped: 0, Time elapsed: 0 sec - in org.apache.commons.lang3.text.translate.UnicodeUnescaperTest
Running org.apache.commons.lang3.text.translate.OctalUnescaperTest
Tests run: 1, Failures: 0, Errors: 0, Skipped: 0, Time elapsed: 0 sec - in org.apache.commons.lang3.text.translate.OctalUnescaperTest
Running org.apache.commons.lang3.text.StrMatcherTest
Tests run: 14, Failures: 0, Errors: 0, Skipped: 0, Time elapsed: 0.003 sec - in org.apache.commons.lang3.text.StrMatcherTest
Running org.apache.commons.lang3.text.StrTokenizerTest
Tests run: 55, Failures: 0, Errors: 0, Skipped: 0, Time elapsed: 0.015 sec - in org.apache.commons.lang3.text.StrTokenizerTest
Running org.apache.commons.lang3.text.FormattableUtilsTest
Tests run: 5, Failures: 0, Errors: 0, Skipped: 0, Time elapsed: 0 sec - in org.apache.commons.lang3.text.FormattableUtilsTest
Running org.apache.commons.lang3.text.CompositeFormatTest
Tests run: 2, Failures: 0, Errors: 0, Skipped: 0, Time elapsed: 0.001 sec - in org.apache.commons.lang3.text.CompositeFormatTest
Running org.apache.commons.lang3.text.WordUtilsTest
Tests run: 12, Failures: 0, Errors: 0, Skipped: 0, Time elapsed: 0.004 sec - in org.apache.commons.lang3.text.WordUtilsTest
Running org.apache.commons.lang3.text.StrLookupTest
Tests run: 5, Failures: 0, Errors: 0, Skipped: 0, Time elapsed: 0.003 sec - in org.apache.commons.lang3.text.StrLookupTest
Running org.apache.commons.lang3.text.StrBuilderAppendInsertTest
Tests run: 51, Failures: 0, Errors: 0, Skipped: 0, Time elapsed: 0.013 sec - in org.apache.commons.lang3.text.StrBuilderAppendInsertTest
Running org.apache.commons.lang3.text.ExtendedMessageFormatTest
Tests run: 10, Failures: 0, Errors: 0, Skipped: 0, Time elapsed: 0.869 sec - in org.apache.commons.lang3.text.ExtendedMessageFormatTest
Running org.apache.commons.lang3.text.StrSubstitutorTest
Tests run: 40, Failures: 0, Errors: 0, Skipped: 0, Time elapsed: 0.037 sec - in org.apache.commons.lang3.text.StrSubstitutorTest
Running org.apache.commons.lang3.text.StrBuilderTest
Tests run: 90, Failures: 0, Errors: 0, Skipped: 0, Time elapsed: 0.068 sec - in org.apache.commons.lang3.text.StrBuilderTest
Running org.apache.commons.lang3.StringEscapeUtilsTest
Tests run: 28, Failures: 13, Errors: 1, Skipped: 0, Time elapsed: 0.492 sec <<< FAILURE! - in org.apache.commons.lang3.StringEscapeUtilsTest
testEscapeXmlAllCharacters(org.apache.commons.lang3.StringEscapeUtilsTest)  Time elapsed: 0.004 sec  <<< FAILURE!
org.junit.ComparisonFailure: expected:<Hello World! Ain[&apos;]t this great?> but was:<Hello World! Ain[']t this great?>
	at org.junit.Assert.assertEquals(Assert.java:115)
	at org.junit.Assert.assertEquals(Assert.java:144)
	at org.apache.commons.lang3.StringEscapeUtilsTest.testEscapeXmlAllCharacters(StringEscapeUtilsTest.java:407)

testUnescapeJava(org.apache.commons.lang3.StringEscapeUtilsTest)  Time elapsed: 0.001 sec  <<< FAILURE!
org.junit.ComparisonFailure: unescape(String) failed: expected '\u000Atest\u0008' actual '\ntest\b' expected:<[
test]> but was:<[\ntest\b]>
	at org.junit.Assert.assertEquals(Assert.java:115)
	at org.apache.commons.lang3.StringEscapeUtilsTest.assertUnescapeJava(StringEscapeUtilsTest.java:167)
	at org.apache.commons.lang3.StringEscapeUtilsTest.assertUnescapeJava(StringEscapeUtilsTest.java:160)
	at org.apache.commons.lang3.StringEscapeUtilsTest.testUnescapeJava(StringEscapeUtilsTest.java:149)

testStandaloneAmphersand(org.apache.commons.lang3.StringEscapeUtilsTest)  Time elapsed: 0.004 sec  <<< ERROR!
java.lang.StringIndexOutOfBoundsException: String index out of range: -1
	at java.lang.String.substring(String.java:1911)
	at java.lang.String.subSequence(String.java:1946)
	at org.apache.commons.lang3.text.translate.LookupTranslator.translate(LookupTranslator.java:32)
	at org.apache.commons.lang3.text.translate.AggregateTranslator.translate(AggregateTranslator.java:52)
	at org.apache.commons.lang3.text.translate.CharSequenceTranslator.translate(CharSequenceTranslator.java:87)
	at org.apache.commons.lang3.text.translate.CharSequenceTranslator.translate(CharSequenceTranslator.java:61)
	at org.apache.commons.lang3.StringEscapeUtils.unescapeHtml4(StringEscapeUtils.java:627)
	at org.apache.commons.lang3.StringEscapeUtilsTest.testStandaloneAmphersand(StringEscapeUtilsTest.java:429)

testUnescapeHtml4(org.apache.commons.lang3.StringEscapeUtilsTest)  Time elapsed: 0.001 sec  <<< FAILURE!
org.junit.ComparisonFailure: ampersand expected:<bread &[] butter> but was:<bread &[amp;] butter>
	at org.junit.Assert.assertEquals(Assert.java:115)
	at org.apache.commons.lang3.StringEscapeUtilsTest.testUnescapeHtml4(StringEscapeUtilsTest.java:244)

testEscapeHtml(org.apache.commons.lang3.StringEscapeUtilsTest)  Time elapsed: 0.001 sec  <<< FAILURE!
org.junit.ComparisonFailure: ampersand expected:<bread &[amp;] butter> but was:<bread &[] butter>
	at org.junit.Assert.assertEquals(Assert.java:115)
	at org.apache.commons.lang3.StringEscapeUtilsTest.testEscapeHtml(StringEscapeUtilsTest.java:227)

testEscapeJava(org.apache.commons.lang3.StringEscapeUtilsTest)  Time elapsed: 0.001 sec  <<< FAILURE!
org.junit.ComparisonFailure: escapeJava(String) failed: tab expected:<\[t]> but was:<\[u0009]>
	at org.junit.Assert.assertEquals(Assert.java:115)
	at org.apache.commons.lang3.StringEscapeUtilsTest.assertEscapeJava(StringEscapeUtilsTest.java:117)
	at org.apache.commons.lang3.StringEscapeUtilsTest.testEscapeJava(StringEscapeUtilsTest.java:75)

testEscapeJson(org.apache.commons.lang3.StringEscapeUtilsTest)  Time elapsed: 0.001 sec  <<< FAILURE!
org.junit.ComparisonFailure: expected:<He didn't say, [\"stop!\]"> but was:<He didn't say, ["stop!]">
	at org.junit.Assert.assertEquals(Assert.java:115)
	at org.junit.Assert.assertEquals(Assert.java:144)
	at org.apache.commons.lang3.StringEscapeUtilsTest.testEscapeJson(StringEscapeUtilsTest.java:610)

testEscapeXml10(org.apache.commons.lang3.StringEscapeUtilsTest)  Time elapsed: 0.001 sec  <<< FAILURE!
org.junit.ComparisonFailure: expected:<a[&lt;b&gt;c&quot;d&apos;e&amp;]f> but was:<a[<b>c"d'e&]f>
	at org.junit.Assert.assertEquals(Assert.java:115)
	at org.junit.Assert.assertEquals(Assert.java:144)
	at org.apache.commons.lang3.StringEscapeUtilsTest.testEscapeXml10(StringEscapeUtilsTest.java:334)

testEscapeXml11(org.apache.commons.lang3.StringEscapeUtilsTest)  Time elapsed: 0.001 sec  <<< FAILURE!
org.junit.ComparisonFailure: expected:<a[&lt;b&gt;c&quot;d&apos;e&amp;]f> but was:<a[<b>c"d'e&]f>
	at org.junit.Assert.assertEquals(Assert.java:115)
	at org.junit.Assert.assertEquals(Assert.java:144)
	at org.apache.commons.lang3.StringEscapeUtilsTest.testEscapeXml11(StringEscapeUtilsTest.java:349)

testLang313(org.apache.commons.lang3.StringEscapeUtilsTest)  Time elapsed: 0.001 sec  <<< FAILURE!
org.junit.ComparisonFailure: expected:<& &[]> but was:<& &[amp;]>
	at org.junit.Assert.assertEquals(Assert.java:115)
	at org.junit.Assert.assertEquals(Assert.java:144)
	at org.apache.commons.lang3.StringEscapeUtilsTest.testLang313(StringEscapeUtilsTest.java:437)

testLang708(org.apache.commons.lang3.StringEscapeUtilsTest)  Time elapsed: 0.033 sec  <<< FAILURE!
java.lang.AssertionError: [{"geonameFeatureClass":"L","values":{"eu":"Mundua","ro":"Pam\u00E2nt","it":"Globo","ca":"el m\u00F3n","tr":"Yery\u00FCz\u00FC","no":"Jorden","hu":"F\u00F6ld","lv":"Zeme","de":"Welt","el":"\u03A5\u03B4\u03C1\u03CC\u03B3\u03B5\u03B9\u03BF\u03C2","fi":"Maa","la":"Terra","fr":"Monde","eo":"Mondo","en":"World","ru":"\u0417\u0435\u043C\u043B\u044F","es":"el planeta","nl":"Aarde"},"geonameFeatureCode":"AREA","_id":32,"name":"","auto":true,"type":"GEO","geonameId":6295630,"valueCode":""},{"geonameFeatureClass":"L","values":{"ro":"Europa","zh":"\u6B27\u6D32","ca":"Europa","vi":"Ch\u00E2u \u00C2u","tr":"Avrupa","no":"Europa","hu":"Eur\u00F3pa","lv":"Eiropa","hi":"\u092F\u0942\u0930\u094B\u092A","lt":"Europa","bs":"Evropa","ga":"an Eoraip","th":"\u0E22\u0E38\u0E42\u0E23\u0E1B","id":"Eropa","de":"Europa","fi":"Eurooppa","fr":"Europe","sv":"Europa","bg":"\u0415\u0432\u0440\u043E\u043F\u0430","da":"Europa","eu":"Europa","is":"Evr\u00F3pa","it":"Europa","cy":"Ewrop","ar":"\u0623\u0648\u0631\u0648\u0628\u0627","se":"Eurohp\u00E1","he":"\u05D0\u05D9\u05E8\u05D5\u05E4\u05D4","cs":"Evropa","el":"\u0395\u03C5\u03C1\u03CE\u03C0\u03B7","nb":"Europa","pl":"Europa","la":"Europa","pt":"Europa","eo":"E\u016Dropo","en":"Europe","ru":"\u0415\u0432\u0440\u043E\u043F\u0430","es":"Europa","ja":"\u30E8\u30FC\u30ED\u30C3\u30D1","nl":"Europa"},"geonameFeatureCode":"CONT","_id":33,"name":"","auto":true,"type":"GEO","geonameId":6255148,"valueCode":""},{"geonameFeatureClass":"A","values":{"no":"Spania","nn":"Spania","fy":"Spanje","gd":"An Sp\u00E0inn","ga":"An Sp\u00E1inn","oc":"Espanha","arc":"\u0710\u0723\u0726\u0722\u071D\u0710","fi":"Espanja","fr":"Espagne","fo":"Spania","udm":"\u0418\u0441\u043F\u0430\u043D\u0438\u044F","os":"\u0418\u0441\u043F\u0430\u043D\u0438","he":"\u05E1\u05E4\u05E8\u05D3","gn":"Epa\u00F1a","gl":"Espa\u00F1a","gv":"Yn Spaainey","pl":"Hiszpania","gu":"\u0AB8\u0ACD\u0AAA\u0AC7\u0A87\u0AA8","lo":"\u0EAA\u0EB0\u0EC0\u0E9B\u0E99","ln":"Espania","vi":"T\u00E2y Ban Nha","dz":"Spain","pms":"Spagna","lv":"Sp\u0101nija","lt":"Ispanija","vo":"Spany\u00E4n","de":"Spanien","mg":"Espaina","fur":"Spagne","mk":"\u0428\u043F\u0430\u043D\u0438\u0458\u0430","ml":"\u0D38\u0D4D\u0D2A\u0D46\u0D2F\u0D4D\u0D28\u0D4D\u200D","ceb":"Espanya","mi":"P\u0101niora","uk":"\u0406\u0441\u043F\u0430\u043D\u0456\u044F","eu":"Espainia","mr":"\u0938\u094D\u092A\u0947\u0928","ug":"\u0626\u0649\u0633\u067E\u0627\u0646\u0649\u064A\u06D5","mt":"Spanja","ms":"Sepanyol","ur":"\u0633\u067E\u06CC\u0646","fa":"\u0627\u0633\u067E\u0627\u0646\u06CC\u0627","ty":"Paniora","new":"\u0938\u094D\u092A\u0947\u0928","na":"Pain","el":"\u0399\u03C3\u03C0\u03B1\u03BD\u03AF\u03B1","nb":"Spania","ne":"\u0938\u094D\u092A\u0947\u0928","vls":"Spanje","eo":"Hispanio","en":"Kingdom of Spain","et":"Hispaania","es":"la Madre Patria","nl":"Spanje","vec":"Spagna","to":"Sepeni","ca":"Espanya","tl":"Espanya","tr":"\u0130spanya","tg":"\u0418\u0441\u043F\u043E\u043D\u0438\u0451","haw":"Sepania","bs":"\u0160panija","br":"Spagn","th":"\u0E1B\u0E23\u0E30\u0E40\u0E17\u0E28\u0E2A\u0E40\u0E1B\u0E19","bn":"\u09B8\u09CD\u09AA\u09C7\u09A8","bo":"\u0F66\u0F72\u0F0B\u0F54\u0F53\u0F0D","ta":"\u0BB8\u0BCD\u0BAA\u0BC6\u0BAF\u0BBF\u0BA9\u0BCD","sv":"Spanien","bg":"\u0418\u0441\u043F\u0430\u043D\u0438\u044F","ka":"\u10D4\u10E1\u10DE\u10D0\u10DC\u10D4\u10D7\u10D8","st":"Spain","sw":"Hispania","be":"\u0406\u0441\u043F\u0430\u043D\u0456\u044F","kw":"Spayn","sl":"\u0160panija","sk":"\u0160panielsko","da":"Spanien","ang":"Sp\u0113onland","nds":"Spanien","ks":"Sp\u0113na","so":"Isbeyn","ku":"Spanya","sr":"\u0428\u043F\u0430\u043D\u0438\u0458\u0430","sq":"Spanja","ko":"\uC5D0\uC2A4\uD30C\uB0D0","sc":"Ispagna","cy":"Sbaen","se":"Esp\u00E1njja","sh":"\u0160panija","cv":"\u0418\u0441\u043F\u0430\u043D\u0438","km":"\u17A2\u17C1\u179F\u17D2\u1794\u17C9\u17B6\u1789","cs":"\u0160pan\u011Blsko","li":"Spanje","co":"Spagna","default":"Spain","jbo":"sangu'e","la":"Hesperia","ru":"\u0418\u0441\u043F\u0430\u043D\u0438\u044F","lb":"Spuenien","sco":"Spain","tet":"Espa\u00F1a","scn":"Spagna","hr":"\u0160panjolska","zh":"\u897F\u73ED\u7259","ro":"Spania","rm":"Spagna","ht":"Espay","hu":"Spanyolorsz\u00E1g","ast":"Espa\u00F1a","hi":"\u0938\u094D\u092A\u0947\u0928","hsb":"\u0160paniska","nah":"Caxtill\u0101n","war":"Espanya","lad":"Espanya","id":"Spanyol","ia":"Espania","nrm":"Espangne","hy":"\u053B\u057D\u057A\u0561\u0576\u056B\u0561","qu":"Ispa\u00F1a","ilo":"Espania","az":"\u0130spaniya","is":"Sp\u00E1nn","it":"Spagna","tpi":"Spen","ar":"\u0623\u0633\u0628\u0627\u0646\u064A\u0627","io":"Hispania","pam":"Espanya","frp":"\u00C8spagne","am":"\u12A5\u1235\u1353\u1295\u12EB","an":"Espa\u00F1a","csb":"Szpa\u0144sk\u00F4","pt":"Espanha","ja":"\u30B9\u30DA\u30A4\u30F3","ps":"\u0627\u0633\u067E\u0627\u0646\u064A\u0627","yi":"\u05E9\u05E4\u05D0\u05E0\u05D9\u05E2","af":"Spanje"},"geonameFeatureCode":"PCLI","_id":260,"name":"","auto":true,"type":"GEO","geonameId":2510769,"valueCode":""},{"geonameFeatureClass":"A","values":{"ca":"Andalusia","tr":"End\u00FCl\u00FCs","krc":"\u0410\u043D\u0434\u0430\u043B\u0443\u0441\u0438\u044F","no":"Andaluc\u00EDa","fy":"Andal\u00FBsje","bs":"Andaluzija","br":"Andalouzia","ext":"Andaluzia","ga":"An Andal\u00FAis","th":"\u0E41\u0E04\u0E27\u0E49\u0E19\u0E2D\u0E31\u0E19\u0E14\u0E32\u0E25\u0E39\u0E0B\u0E35\u0E2D\u0E32","bn":"\u0986\u09A8\u09CD\u09A6\u09BE\u09B2\u09C1\u09B8\u09BF\u09AF\u09BC\u09BE","oc":"Andalosia","ka":"\u10D0\u10DC\u10D3\u10D0\u10DA\u10E3\u10E1\u10D8\u10D0","sv":"Andalusien","fr":"Andalousie","bg":"\u0410\u043D\u0434\u0430\u043B\u0443\u0441\u0438\u044F","glk":"\u0622\u0646\u062F\u0627\u0644\u0648\u0633\u06CC\u0627","be":"\u0410\u043D\u0434\u0430\u043B\u0443\u0441\u0456\u044F","kw":"Andalousi","sk":"Andal\u00FAzia","os":"\u0410\u043D\u0434\u0430\u043B\u0443\u0441\u0438","da":"Andalusien","sr":"\u0410\u043D\u0434\u0430\u043B\u0443\u0437\u0438\u0458\u0430","ku":"Endulus","ko":"\uC548\uB2EC\uB8E8\uC2DC\uC544 \uC9C0\uBC29","he":"\u05D0\u05E0\u05D3\u05DC\u05D5\u05E1\u05D9\u05D4","sh":"Andaluzija","arz":"\u0627\u0646\u062F\u0644\u0648\u0633\u064A\u0627","cs":"Andalusie","default":"Andalusia","stq":"Andalusien","la":"Vandalitia","pl":"Andaluzja","ru":"\u0410\u043D\u0434\u0430\u043B\u0443\u0441\u0438\u044F","lb":"Andalusien","tet":"Andaluzia","got":"\uD800\uDF45\uD800\uDF30\uD800\uDF3D\uD800\uDF33\uD800\uDF30\uD800\uDF3B\uD800\uDF39\uD800\uDF44\uD800\uDF3E\uD800\uDF30","hr":"Andaluzija","zh":"\u5B89\u9054\u9B6F\u897F\u4E9E","ro":"Andaluzia","hu":"Andal\u00FAzia","pms":"Andalus\u00ECa","lv":"Andal\u016Bzija","lt":"Andal\u016Bzija","nah":"Andalucia","lad":"Andaluziya","de":"Andalusien","als":"Andalusien","qu":"Andalusiya","hy":"\u0531\u0576\u0564\u0561\u056C\u0578\u0582\u0566\u056B\u0561","eu":"Andaluzia","is":"Andal\u00FAs\u00EDa","uk":"\u0410\u043D\u0434\u0430\u043B\u0443\u0441\u0456\u044F","az":"Andalusiya","mr":"\u0906\u0902\u0926\u093E\u0932\u0941\u0938\u093F\u092F\u093E","ug":"Andalusiye","fa":"\u0627\u0646\u062F\u0644\u0633","ar":"\u0623\u0646\u062F\u0644\u0648\u0633\u064A\u0627","rmy":"Andalusiya","io":"Andaluzia","el":"\u0391\u03BD\u03B4\u03B1\u03BB\u03BF\u03C5\u03C3\u03AF\u03B1","frp":"Andalosie","pt":"Andaluzia","eo":"Andaluzio","en":"Andalusia","et":"Andaluusia","es":"Andaluc\u00EDa","ja":"\u30A2\u30F3\u30C0\u30EB\u30B7\u30A2\u5DDE","nl":"Andalusi\u00EB","af":"Andalusi\u00EB","vec":"Andalus\u00ECa"},"geonameFeatureCode":"ADM1","_id":261,"name":"","auto":true,"type":"GEO","geonameId":2593109,"valueCode":""},{"geonameFeatureClass":"A","values":{"de":"Granada","default":"Province of Granada","fr":"Grenade","en":"Province of Granada","es":"Provincia de Granada","ja":"\u30B0\u30E9\u30CA\u30C0"},"geonameFeatureCode":"ADM2","_id":262,"name":"","auto":true,"type":"GEO","geonameId":2517115,"valueCode":""},{"geonameFeatureClass":"A","values":{"default":"Monachil"},"geonameFeatureCode":"ADM3","_id":263,"name":"","auto":true,"type":"GEO","geonameId":6357744,"valueCode":""},{"geonameFeatureClass":"P","values":{"default":"Sierra Nevada"},"geonameFeatureCode":"PPL","_id":264,"name":"","auto":true,"type":"GEO","geonameId":6544329,"valueCode":""}]
	at org.junit.Assert.fail(Assert.java:88)
	at org.junit.Assert.assertTrue(Assert.java:41)
	at org.apache.commons.lang3.StringEscapeUtilsTest.testLang708(StringEscapeUtilsTest.java:566)

testEscapeEcmaScript(org.apache.commons.lang3.StringEscapeUtilsTest)  Time elapsed: 0 sec  <<< FAILURE!
org.junit.ComparisonFailure: expected:<He didn[\'t say, \"stop!\]"> but was:<He didn['t say, "stop!]">
	at org.junit.Assert.assertEquals(Assert.java:115)
	at org.junit.Assert.assertEquals(Assert.java:144)
	at org.apache.commons.lang3.StringEscapeUtilsTest.testEscapeEcmaScript(StringEscapeUtilsTest.java:198)

testEscapeHtmlVersions(org.apache.commons.lang3.StringEscapeUtilsTest)  Time elapsed: 0 sec  <<< FAILURE!
org.junit.ComparisonFailure: expected:<[&Beta;]> but was:<[Β]>
	at org.junit.Assert.assertEquals(Assert.java:115)
	at org.junit.Assert.assertEquals(Assert.java:144)
	at org.apache.commons.lang3.StringEscapeUtilsTest.testEscapeHtmlVersions(StringEscapeUtilsTest.java:288)

testEscapeXml(org.apache.commons.lang3.StringEscapeUtilsTest)  Time elapsed: 0 sec  <<< FAILURE!
org.junit.ComparisonFailure: expected:<[&lt;abc&gt;]> but was:<[<abc>]>
	at org.junit.Assert.assertEquals(Assert.java:115)
	at org.junit.Assert.assertEquals(Assert.java:144)
	at org.apache.commons.lang3.StringEscapeUtilsTest.testEscapeXml(StringEscapeUtilsTest.java:297)

Running org.apache.commons.lang3.AnnotationUtilsTest
Tests run: 10, Failures: 0, Errors: 0, Skipped: 0, Time elapsed: 0.018 sec - in org.apache.commons.lang3.AnnotationUtilsTest
Running org.apache.commons.lang3.ConversionTest
Tests run: 42, Failures: 0, Errors: 0, Skipped: 0, Time elapsed: 0.013 sec - in org.apache.commons.lang3.ConversionTest
Running org.apache.commons.lang3.StringUtilsTrimEmptyTest
Tests run: 15, Failures: 0, Errors: 0, Skipped: 0, Time elapsed: 0.011 sec - in org.apache.commons.lang3.StringUtilsTrimEmptyTest
Running org.apache.commons.lang3.EnumUtilsTest
Tests run: 34, Failures: 0, Errors: 0, Skipped: 0, Time elapsed: 0.009 sec - in org.apache.commons.lang3.EnumUtilsTest
Running org.apache.commons.lang3.exception.ExceptionUtilsTest
Tests run: 28, Failures: 0, Errors: 0, Skipped: 0, Time elapsed: 0.029 sec - in org.apache.commons.lang3.exception.ExceptionUtilsTest
Running org.apache.commons.lang3.exception.DefaultExceptionContextTest
Tests run: 8, Failures: 0, Errors: 0, Skipped: 0, Time elapsed: 0.004 sec - in org.apache.commons.lang3.exception.DefaultExceptionContextTest
Running org.apache.commons.lang3.exception.ContextedExceptionTest
Tests run: 14, Failures: 0, Errors: 0, Skipped: 0, Time elapsed: 0.012 sec - in org.apache.commons.lang3.exception.ContextedExceptionTest
Running org.apache.commons.lang3.exception.ContextedRuntimeExceptionTest
Tests run: 14, Failures: 0, Errors: 0, Skipped: 0, Time elapsed: 0.011 sec - in org.apache.commons.lang3.exception.ContextedRuntimeExceptionTest
Running org.apache.commons.lang3.BitFieldTest
Tests run: 15, Failures: 0, Errors: 0, Skipped: 0, Time elapsed: 0.002 sec - in org.apache.commons.lang3.BitFieldTest
Running org.apache.commons.lang3.ArrayUtilsRemoveMultipleTest
Tests run: 55, Failures: 0, Errors: 0, Skipped: 0, Time elapsed: 0.018 sec - in org.apache.commons.lang3.ArrayUtilsRemoveMultipleTest
Running org.apache.commons.lang3.HashSetvBitSetTest
Ratio=1198% array=100 count=1 extract=4405751 bitset=52792583
Ratio=1545% array=100 count=10 extract=1756871 bitset=27144620
Ratio=9% array=100 count=50 extract=6836579 bitset=619527
Ratio=4% array=100 count=100 extract=10586029 bitset=438494
Ratio=80% array=1000 count=10 extract=6570466 bitset=5308809
Ratio=29% array=1000 count=100 extract=15419569 bitset=4517735
Ratio=6% array=1000 count=500 extract=53259893 bitset=3297509
Ratio=1% array=1000 count=1000 extract=75609620 bitset=879900
Ratio=3% count=0 hash=4169517 bits=147200
Ratio=30% count=5 hash=659110 bits=203117
Ratio=36% count=10 hash=1196778 bits=437610
Ratio=21% count=200 hash=20919396 bits=4549946
Ratio=21% count=50 hash=6035066 bits=1311701
Ratio=20% count=100 hash=15897005 bits=3327294
Ratio=20% count=1000 hash=82811990 bits=17156078
Ratio=20% count=2000 hash=167417097 bits=34092211
Tests run: 2, Failures: 0, Errors: 0, Skipped: 0, Time elapsed: 0.729 sec - in org.apache.commons.lang3.HashSetvBitSetTest
Running org.apache.commons.lang3.StringUtilsTest
Tests run: 124, Failures: 0, Errors: 0, Skipped: 0, Time elapsed: 0.114 sec - in org.apache.commons.lang3.StringUtilsTest
Running org.apache.commons.lang3.ArrayUtilsRemoveTest
Tests run: 19, Failures: 0, Errors: 0, Skipped: 0, Time elapsed: 0.002 sec - in org.apache.commons.lang3.ArrayUtilsRemoveTest
Running org.apache.commons.lang3.ObjectUtilsTest
Tests run: 36, Failures: 0, Errors: 0, Skipped: 0, Time elapsed: 0.01 sec - in org.apache.commons.lang3.ObjectUtilsTest
Running org.apache.commons.lang3.ClassPathUtilsTest
Tests run: 13, Failures: 0, Errors: 0, Skipped: 0, Time elapsed: 0.004 sec - in org.apache.commons.lang3.ClassPathUtilsTest
Running org.apache.commons.lang3.math.NumberUtilsTest
Tests run: 91, Failures: 0, Errors: 0, Skipped: 0, Time elapsed: 0.031 sec - in org.apache.commons.lang3.math.NumberUtilsTest
Running org.apache.commons.lang3.math.IEEE754rUtilsTest
Tests run: 3, Failures: 0, Errors: 0, Skipped: 0, Time elapsed: 0.003 sec - in org.apache.commons.lang3.math.IEEE754rUtilsTest
Running org.apache.commons.lang3.math.FractionTest
Tests run: 25, Failures: 0, Errors: 0, Skipped: 0, Time elapsed: 0.56 sec - in org.apache.commons.lang3.math.FractionTest
Running org.apache.commons.lang3.BooleanUtilsTest
Tests run: 72, Failures: 0, Errors: 0, Skipped: 0, Time elapsed: 0.01 sec - in org.apache.commons.lang3.BooleanUtilsTest
Running org.apache.commons.lang3.CharSequenceUtilsTest
Tests run: 2, Failures: 0, Errors: 0, Skipped: 0, Time elapsed: 0 sec - in org.apache.commons.lang3.CharSequenceUtilsTest
Running org.apache.commons.lang3.CharSetUtilsTest
Tests run: 11, Failures: 0, Errors: 0, Skipped: 0, Time elapsed: 0 sec - in org.apache.commons.lang3.CharSetUtilsTest
Running org.apache.commons.lang3.ArrayUtilsAddTest
Tests run: 13, Failures: 0, Errors: 0, Skipped: 0, Time elapsed: 0.001 sec - in org.apache.commons.lang3.ArrayUtilsAddTest
Running org.apache.commons.lang3.CharEncodingTest
Tests run: 6, Failures: 0, Errors: 0, Skipped: 0, Time elapsed: 0.025 sec - in org.apache.commons.lang3.CharEncodingTest
Running org.apache.commons.lang3.ClassUtilsTest
Tests run: 57, Failures: 0, Errors: 0, Skipped: 0, Time elapsed: 0.029 sec - in org.apache.commons.lang3.ClassUtilsTest
Running org.apache.commons.lang3.RangeTest
Tests run: 24, Failures: 0, Errors: 0, Skipped: 0, Time elapsed: 0.007 sec - in org.apache.commons.lang3.RangeTest
Running org.apache.commons.lang3.event.EventUtilsTest
Tests run: 8, Failures: 0, Errors: 0, Skipped: 0, Time elapsed: 0.014 sec - in org.apache.commons.lang3.event.EventUtilsTest
Running org.apache.commons.lang3.event.EventListenerSupportTest
Tests run: 9, Failures: 0, Errors: 0, Skipped: 0, Time elapsed: 0.019 sec - in org.apache.commons.lang3.event.EventListenerSupportTest
Running org.apache.commons.lang3.ArrayUtilsTest
Tests run: 205, Failures: 0, Errors: 0, Skipped: 0, Time elapsed: 0.034 sec - in org.apache.commons.lang3.ArrayUtilsTest
Running org.apache.commons.lang3.CharUtilsTest
Tests run: 24, Failures: 0, Errors: 0, Skipped: 0, Time elapsed: 0.005 sec - in org.apache.commons.lang3.CharUtilsTest
Running org.apache.commons.lang3.NotImplementedExceptionTest
Tests run: 1, Failures: 0, Errors: 0, Skipped: 0, Time elapsed: 0.001 sec - in org.apache.commons.lang3.NotImplementedExceptionTest
Running org.apache.commons.lang3.StringUtilsEqualsIndexOfTest
Tests run: 50, Failures: 0, Errors: 0, Skipped: 0, Time elapsed: 0.015 sec - in org.apache.commons.lang3.StringUtilsEqualsIndexOfTest
Running org.apache.commons.lang3.RandomUtilsTest
Tests run: 23, Failures: 0, Errors: 0, Skipped: 0, Time elapsed: 0.009 sec - in org.apache.commons.lang3.RandomUtilsTest

Results :

Failed tests: 
  StringEscapeUtilsTest.testEscapeEcmaScript:198 expected:<He didn[\'t say, \"stop!\]"> but was:<He didn['t say, "stop!]">
  StringEscapeUtilsTest.testEscapeHtml:227 ampersand expected:<bread &[amp;] butter> but was:<bread &[] butter>
  StringEscapeUtilsTest.testEscapeHtmlVersions:288 expected:<[&Beta;]> but was:<[Β]>
  StringEscapeUtilsTest.testEscapeJava:75->assertEscapeJava:117 escapeJava(String) failed: tab expected:<\[t]> but was:<\[u0009]>
  StringEscapeUtilsTest.testEscapeJson:610 expected:<He didn't say, [\"stop!\]"> but was:<He didn't say, ["stop!]">
  StringEscapeUtilsTest.testEscapeXml:297 expected:<[&lt;abc&gt;]> but was:<[<abc>]>
  StringEscapeUtilsTest.testEscapeXml10:334 expected:<a[&lt;b&gt;c&quot;d&apos;e&amp;]f> but was:<a[<b>c"d'e&]f>
  StringEscapeUtilsTest.testEscapeXml11:349 expected:<a[&lt;b&gt;c&quot;d&apos;e&amp;]f> but was:<a[<b>c"d'e&]f>
  StringEscapeUtilsTest.testEscapeXmlAllCharacters:407 expected:<Hello World! Ain[&apos;]t this great?> but was:<Hello World! Ain[']t this great?>
  StringEscapeUtilsTest.testLang313:437 expected:<& &[]> but was:<& &[amp;]>
  StringEscapeUtilsTest.testLang708:566 [{"geonameFeatureClass":"L","values":{"eu":"Mundua","ro":"Pam\u00E2nt","it":"Globo","ca":"el m\u00F3n","tr":"Yery\u00FCz\u00FC","no":"Jorden","hu":"F\u00F6ld","lv":"Zeme","de":"Welt","el":"\u03A5\u03B4\u03C1\u03CC\u03B3\u03B5\u03B9\u03BF\u03C2","fi":"Maa","la":"Terra","fr":"Monde","eo":"Mondo","en":"World","ru":"\u0417\u0435\u043C\u043B\u044F","es":"el planeta","nl":"Aarde"},"geonameFeatureCode":"AREA","_id":32,"name":"","auto":true,"type":"GEO","geonameId":6295630,"valueCode":""},{"geonameFeatureClass":"L","values":{"ro":"Europa","zh":"\u6B27\u6D32","ca":"Europa","vi":"Ch\u00E2u \u00C2u","tr":"Avrupa","no":"Europa","hu":"Eur\u00F3pa","lv":"Eiropa","hi":"\u092F\u0942\u0930\u094B\u092A","lt":"Europa","bs":"Evropa","ga":"an Eoraip","th":"\u0E22\u0E38\u0E42\u0E23\u0E1B","id":"Eropa","de":"Europa","fi":"Eurooppa","fr":"Europe","sv":"Europa","bg":"\u0415\u0432\u0440\u043E\u043F\u0430","da":"Europa","eu":"Europa","is":"Evr\u00F3pa","it":"Europa","cy":"Ewrop","ar":"\u0623\u0648\u0631\u0648\u0628\u0627","se":"Eurohp\u00E1","he":"\u05D0\u05D9\u05E8\u05D5\u05E4\u05D4","cs":"Evropa","el":"\u0395\u03C5\u03C1\u03CE\u03C0\u03B7","nb":"Europa","pl":"Europa","la":"Europa","pt":"Europa","eo":"E\u016Dropo","en":"Europe","ru":"\u0415\u0432\u0440\u043E\u043F\u0430","es":"Europa","ja":"\u30E8\u30FC\u30ED\u30C3\u30D1","nl":"Europa"},"geonameFeatureCode":"CONT","_id":33,"name":"","auto":true,"type":"GEO","geonameId":6255148,"valueCode":""},{"geonameFeatureClass":"A","values":{"no":"Spania","nn":"Spania","fy":"Spanje","gd":"An Sp\u00E0inn","ga":"An Sp\u00E1inn","oc":"Espanha","arc":"\u0710\u0723\u0726\u0722\u071D\u0710","fi":"Espanja","fr":"Espagne","fo":"Spania","udm":"\u0418\u0441\u043F\u0430\u043D\u0438\u044F","os":"\u0418\u0441\u043F\u0430\u043D\u0438","he":"\u05E1\u05E4\u05E8\u05D3","gn":"Epa\u00F1a","gl":"Espa\u00F1a","gv":"Yn Spaainey","pl":"Hiszpania","gu":"\u0AB8\u0ACD\u0AAA\u0AC7\u0A87\u0AA8","lo":"\u0EAA\u0EB0\u0EC0\u0E9B\u0E99","ln":"Espania","vi":"T\u00E2y Ban Nha","dz":"Spain","pms":"Spagna","lv":"Sp\u0101nija","lt":"Ispanija","vo":"Spany\u00E4n","de":"Spanien","mg":"Espaina","fur":"Spagne","mk":"\u0428\u043F\u0430\u043D\u0438\u0458\u0430","ml":"\u0D38\u0D4D\u0D2A\u0D46\u0D2F\u0D4D\u0D28\u0D4D\u200D","ceb":"Espanya","mi":"P\u0101niora","uk":"\u0406\u0441\u043F\u0430\u043D\u0456\u044F","eu":"Espainia","mr":"\u0938\u094D\u092A\u0947\u0928","ug":"\u0626\u0649\u0633\u067E\u0627\u0646\u0649\u064A\u06D5","mt":"Spanja","ms":"Sepanyol","ur":"\u0633\u067E\u06CC\u0646","fa":"\u0627\u0633\u067E\u0627\u0646\u06CC\u0627","ty":"Paniora","new":"\u0938\u094D\u092A\u0947\u0928","na":"Pain","el":"\u0399\u03C3\u03C0\u03B1\u03BD\u03AF\u03B1","nb":"Spania","ne":"\u0938\u094D\u092A\u0947\u0928","vls":"Spanje","eo":"Hispanio","en":"Kingdom of Spain","et":"Hispaania","es":"la Madre Patria","nl":"Spanje","vec":"Spagna","to":"Sepeni","ca":"Espanya","tl":"Espanya","tr":"\u0130spanya","tg":"\u0418\u0441\u043F\u043E\u043D\u0438\u0451","haw":"Sepania","bs":"\u0160panija","br":"Spagn","th":"\u0E1B\u0E23\u0E30\u0E40\u0E17\u0E28\u0E2A\u0E40\u0E1B\u0E19","bn":"\u09B8\u09CD\u09AA\u09C7\u09A8","bo":"\u0F66\u0F72\u0F0B\u0F54\u0F53\u0F0D","ta":"\u0BB8\u0BCD\u0BAA\u0BC6\u0BAF\u0BBF\u0BA9\u0BCD","sv":"Spanien","bg":"\u0418\u0441\u043F\u0430\u043D\u0438\u044F","ka":"\u10D4\u10E1\u10DE\u10D0\u10DC\u10D4\u10D7\u10D8","st":"Spain","sw":"Hispania","be":"\u0406\u0441\u043F\u0430\u043D\u0456\u044F","kw":"Spayn","sl":"\u0160panija","sk":"\u0160panielsko","da":"Spanien","ang":"Sp\u0113onland","nds":"Spanien","ks":"Sp\u0113na","so":"Isbeyn","ku":"Spanya","sr":"\u0428\u043F\u0430\u043D\u0438\u0458\u0430","sq":"Spanja","ko":"\uC5D0\uC2A4\uD30C\uB0D0","sc":"Ispagna","cy":"Sbaen","se":"Esp\u00E1njja","sh":"\u0160panija","cv":"\u0418\u0441\u043F\u0430\u043D\u0438","km":"\u17A2\u17C1\u179F\u17D2\u1794\u17C9\u17B6\u1789","cs":"\u0160pan\u011Blsko","li":"Spanje","co":"Spagna","default":"Spain","jbo":"sangu'e","la":"Hesperia","ru":"\u0418\u0441\u043F\u0430\u043D\u0438\u044F","lb":"Spuenien","sco":"Spain","tet":"Espa\u00F1a","scn":"Spagna","hr":"\u0160panjolska","zh":"\u897F\u73ED\u7259","ro":"Spania","rm":"Spagna","ht":"Espay","hu":"Spanyolorsz\u00E1g","ast":"Espa\u00F1a","hi":"\u0938\u094D\u092A\u0947\u0928","hsb":"\u0160paniska","nah":"Caxtill\u0101n","war":"Espanya","lad":"Espanya","id":"Spanyol","ia":"Espania","nrm":"Espangne","hy":"\u053B\u057D\u057A\u0561\u0576\u056B\u0561","qu":"Ispa\u00F1a","ilo":"Espania","az":"\u0130spaniya","is":"Sp\u00E1nn","it":"Spagna","tpi":"Spen","ar":"\u0623\u0633\u0628\u0627\u0646\u064A\u0627","io":"Hispania","pam":"Espanya","frp":"\u00C8spagne","am":"\u12A5\u1235\u1353\u1295\u12EB","an":"Espa\u00F1a","csb":"Szpa\u0144sk\u00F4","pt":"Espanha","ja":"\u30B9\u30DA\u30A4\u30F3","ps":"\u0627\u0633\u067E\u0627\u0646\u064A\u0627","yi":"\u05E9\u05E4\u05D0\u05E0\u05D9\u05E2","af":"Spanje"},"geonameFeatureCode":"PCLI","_id":260,"name":"","auto":true,"type":"GEO","geonameId":2510769,"valueCode":""},{"geonameFeatureClass":"A","values":{"ca":"Andalusia","tr":"End\u00FCl\u00FCs","krc":"\u0410\u043D\u0434\u0430\u043B\u0443\u0441\u0438\u044F","no":"Andaluc\u00EDa","fy":"Andal\u00FBsje","bs":"Andaluzija","br":"Andalouzia","ext":"Andaluzia","ga":"An Andal\u00FAis","th":"\u0E41\u0E04\u0E27\u0E49\u0E19\u0E2D\u0E31\u0E19\u0E14\u0E32\u0E25\u0E39\u0E0B\u0E35\u0E2D\u0E32","bn":"\u0986\u09A8\u09CD\u09A6\u09BE\u09B2\u09C1\u09B8\u09BF\u09AF\u09BC\u09BE","oc":"Andalosia","ka":"\u10D0\u10DC\u10D3\u10D0\u10DA\u10E3\u10E1\u10D8\u10D0","sv":"Andalusien","fr":"Andalousie","bg":"\u0410\u043D\u0434\u0430\u043B\u0443\u0441\u0438\u044F","glk":"\u0622\u0646\u062F\u0627\u0644\u0648\u0633\u06CC\u0627","be":"\u0410\u043D\u0434\u0430\u043B\u0443\u0441\u0456\u044F","kw":"Andalousi","sk":"Andal\u00FAzia","os":"\u0410\u043D\u0434\u0430\u043B\u0443\u0441\u0438","da":"Andalusien","sr":"\u0410\u043D\u0434\u0430\u043B\u0443\u0437\u0438\u0458\u0430","ku":"Endulus","ko":"\uC548\uB2EC\uB8E8\uC2DC\uC544 \uC9C0\uBC29","he":"\u05D0\u05E0\u05D3\u05DC\u05D5\u05E1\u05D9\u05D4","sh":"Andaluzija","arz":"\u0627\u0646\u062F\u0644\u0648\u0633\u064A\u0627","cs":"Andalusie","default":"Andalusia","stq":"Andalusien","la":"Vandalitia","pl":"Andaluzja","ru":"\u0410\u043D\u0434\u0430\u043B\u0443\u0441\u0438\u044F","lb":"Andalusien","tet":"Andaluzia","got":"\uD800\uDF45\uD800\uDF30\uD800\uDF3D\uD800\uDF33\uD800\uDF30\uD800\uDF3B\uD800\uDF39\uD800\uDF44\uD800\uDF3E\uD800\uDF30","hr":"Andaluzija","zh":"\u5B89\u9054\u9B6F\u897F\u4E9E","ro":"Andaluzia","hu":"Andal\u00FAzia","pms":"Andalus\u00ECa","lv":"Andal\u016Bzija","lt":"Andal\u016Bzija","nah":"Andalucia","lad":"Andaluziya","de":"Andalusien","als":"Andalusien","qu":"Andalusiya","hy":"\u0531\u0576\u0564\u0561\u056C\u0578\u0582\u0566\u056B\u0561","eu":"Andaluzia","is":"Andal\u00FAs\u00EDa","uk":"\u0410\u043D\u0434\u0430\u043B\u0443\u0441\u0456\u044F","az":"Andalusiya","mr":"\u0906\u0902\u0926\u093E\u0932\u0941\u0938\u093F\u092F\u093E","ug":"Andalusiye","fa":"\u0627\u0646\u062F\u0644\u0633","ar":"\u0623\u0646\u062F\u0644\u0648\u0633\u064A\u0627","rmy":"Andalusiya","io":"Andaluzia","el":"\u0391\u03BD\u03B4\u03B1\u03BB\u03BF\u03C5\u03C3\u03AF\u03B1","frp":"Andalosie","pt":"Andaluzia","eo":"Andaluzio","en":"Andalusia","et":"Andaluusia","es":"Andaluc\u00EDa","ja":"\u30A2\u30F3\u30C0\u30EB\u30B7\u30A2\u5DDE","nl":"Andalusi\u00EB","af":"Andalusi\u00EB","vec":"Andalus\u00ECa"},"geonameFeatureCode":"ADM1","_id":261,"name":"","auto":true,"type":"GEO","geonameId":2593109,"valueCode":""},{"geonameFeatureClass":"A","values":{"de":"Granada","default":"Province of Granada","fr":"Grenade","en":"Province of Granada","es":"Provincia de Granada","ja":"\u30B0\u30E9\u30CA\u30C0"},"geonameFeatureCode":"ADM2","_id":262,"name":"","auto":true,"type":"GEO","geonameId":2517115,"valueCode":""},{"geonameFeatureClass":"A","values":{"default":"Monachil"},"geonameFeatureCode":"ADM3","_id":263,"name":"","auto":true,"type":"GEO","geonameId":6357744,"valueCode":""},{"geonameFeatureClass":"P","values":{"default":"Sierra Nevada"},"geonameFeatureCode":"PPL","_id":264,"name":"","auto":true,"type":"GEO","geonameId":6544329,"valueCode":""}]
  StringEscapeUtilsTest.testUnescapeHtml4:244 ampersand expected:<bread &[] butter> but was:<bread &[amp;] butter>
  StringEscapeUtilsTest.testUnescapeJava:149->assertUnescapeJava:160->assertUnescapeJava:167 unescape(String) failed: expected '\u000Atest\u0008' actual '\ntest\b' expected:<[
test]> but was:<[\ntest\b]>
  LookupTranslatorTest.testBasicLookup:38 Incorrect codepoint consumption expected:<3> but was:<0>
  LookupTranslatorTest.testLang882:48 Incorrect codepoint consumption expected:<3> but was:<0>

Tests in error: 
  StringEscapeUtilsTest.testStandaloneAmphersand:429 » StringIndexOutOfBounds St...


Tests run: 3526, Failures: 15, Errors: 1, Skipped: 97

[INFO] ------------------------------------------------------------------------
[INFO] BUILD FAILURE
[INFO] ------------------------------------------------------------------------
[INFO] Total time: 37.910s
[INFO] Finished at: Wed Aug 05 05:00:37 BST 2015
[INFO] Final Memory: 25M/499M
[INFO] ------------------------------------------------------------------------
[ERROR] Failed to execute goal org.apache.maven.plugins:maven-surefire-plugin:2.18:test (default-test) on project commons-lang3: There are test failures.
[ERROR] 
[ERROR] Please refer to /home/perham/Study/LittleDarwin/Cases/commons-lang3-3.4-src/target/surefire-reports for the individual test results.
[ERROR] -> [Help 1]
[ERROR] 
[ERROR] To see the full stack trace of the errors, re-run Maven with the -e switch.
[ERROR] Re-run Maven using the -X switch to enable full debug logging.
[ERROR] 
[ERROR] For more information about the errors and possible solutions, please read the following articles:
[ERROR] [Help 1] http://cwiki.apache.org/confluence/display/MAVEN/MojoFailureException
