[INFO] Scanning for projects...
[INFO]                                                                         
[INFO] ------------------------------------------------------------------------
[INFO] Building Apache Commons Lang 3.4
[INFO] ------------------------------------------------------------------------
[INFO] 
[INFO] --- maven-enforcer-plugin:1.3.1:enforce (enforce-maven-3) @ commons-lang3 ---
[INFO] 
[INFO] --- build-helper-maven-plugin:1.8:parse-version (parse-version) @ commons-lang3 ---
[INFO] 
[INFO] --- maven-antrun-plugin:1.8:run (javadoc.resources) @ commons-lang3 ---
[INFO] Executing tasks

main:
[INFO] Executed tasks
[INFO] 
[INFO] --- maven-remote-resources-plugin:1.5:process (default) @ commons-lang3 ---
[INFO] 
[INFO] --- buildnumber-maven-plugin:1.3:create (default) @ commons-lang3 ---
[INFO] Executing: /bin/sh -c cd /home/perham/Study/LittleDarwin/Cases/commons-lang3-3.4-src && svn --non-interactive info
[INFO] Working directory: /home/perham/Study/LittleDarwin/Cases/commons-lang3-3.4-src
[INFO] Storing buildNumber: ?????? at timestamp: 1438746782557
[INFO] Executing: /bin/sh -c cd /home/perham/Study/LittleDarwin/Cases/commons-lang3-3.4-src && svn --non-interactive info
[INFO] Working directory: /home/perham/Study/LittleDarwin/Cases/commons-lang3-3.4-src
[INFO] Storing buildScmBranch: UNKNOWN_BRANCH
[INFO] 
[INFO] --- maven-resources-plugin:2.7:resources (default-resources) @ commons-lang3 ---
[INFO] Using 'ISO-8859-1' encoding to copy filtered resources.
[INFO] Copying 0 resource
[INFO] Copying 2 resources to META-INF
[INFO] 
[INFO] --- maven-compiler-plugin:3.2:compile (default-compile) @ commons-lang3 ---
[INFO] Changes detected - recompiling the module!
[INFO] Compiling 133 source files to /home/perham/Study/LittleDarwin/Cases/commons-lang3-3.4-src/target/classes
[INFO] /home/perham/Study/LittleDarwin/Cases/commons-lang3-3.4-src/src/main/java/org/apache/commons/lang3/SerializationUtils.java: /home/perham/Study/LittleDarwin/Cases/commons-lang3-3.4-src/src/main/java/org/apache/commons/lang3/SerializationUtils.java uses unchecked or unsafe operations.
[INFO] /home/perham/Study/LittleDarwin/Cases/commons-lang3-3.4-src/src/main/java/org/apache/commons/lang3/SerializationUtils.java: Recompile with -Xlint:unchecked for details.
[INFO] 
[INFO] --- maven-bundle-plugin:2.5.3:manifest (bundle-manifest) @ commons-lang3 ---
[INFO] 
[INFO] --- animal-sniffer-maven-plugin:1.13:check (checkAPIcompatibility) @ commons-lang3 ---
[INFO] Checking unresolved references to org.codehaus.mojo.signature:java16:1.0
[INFO] 
[INFO] --- maven-resources-plugin:2.7:testResources (default-testResources) @ commons-lang3 ---
[INFO] Using 'ISO-8859-1' encoding to copy filtered resources.
[INFO] Copying 2 resources
[INFO] Copying 2 resources to META-INF
[INFO] 
[INFO] --- maven-compiler-plugin:3.2:testCompile (default-testCompile) @ commons-lang3 ---
[INFO] Nothing to compile - all classes are up to date
[INFO] 
[INFO] --- maven-surefire-plugin:2.18:test (default-test) @ commons-lang3 ---
[INFO] Surefire report directory: /home/perham/Study/LittleDarwin/Cases/commons-lang3-3.4-src/target/surefire-reports

-------------------------------------------------------
 T E S T S
-------------------------------------------------------
Running org.apache.commons.lang3.ValidateTest
Tests run: 63, Failures: 0, Errors: 0, Skipped: 0, Time elapsed: 0.047 sec - in org.apache.commons.lang3.ValidateTest
Running org.apache.commons.lang3.LocaleUtilsTest
Tests run: 15, Failures: 0, Errors: 0, Skipped: 0, Time elapsed: 0.027 sec - in org.apache.commons.lang3.LocaleUtilsTest
Running org.apache.commons.lang3.tuple.MutableTripleTest
Tests run: 8, Failures: 0, Errors: 0, Skipped: 0, Time elapsed: 0.011 sec - in org.apache.commons.lang3.tuple.MutableTripleTest
Running org.apache.commons.lang3.tuple.TripleTest
Tests run: 10, Failures: 0, Errors: 0, Skipped: 0, Time elapsed: 0.011 sec - in org.apache.commons.lang3.tuple.TripleTest
Running org.apache.commons.lang3.tuple.ImmutablePairTest
Tests run: 6, Failures: 0, Errors: 0, Skipped: 0, Time elapsed: 0.015 sec - in org.apache.commons.lang3.tuple.ImmutablePairTest
Running org.apache.commons.lang3.tuple.MutablePairTest
Tests run: 8, Failures: 0, Errors: 0, Skipped: 0, Time elapsed: 0.001 sec - in org.apache.commons.lang3.tuple.MutablePairTest
Running org.apache.commons.lang3.tuple.ImmutableTripleTest
Tests run: 6, Failures: 0, Errors: 0, Skipped: 0, Time elapsed: 0.001 sec - in org.apache.commons.lang3.tuple.ImmutableTripleTest
Running org.apache.commons.lang3.tuple.PairTest
Tests run: 9, Failures: 0, Errors: 0, Skipped: 0, Time elapsed: 0.003 sec - in org.apache.commons.lang3.tuple.PairTest
Running org.apache.commons.lang3.StringUtilsIsTest
Tests run: 8, Failures: 0, Errors: 0, Skipped: 0, Time elapsed: 0.023 sec - in org.apache.commons.lang3.StringUtilsIsTest
Running org.apache.commons.lang3.JavaVersionTest
Tests run: 3, Failures: 0, Errors: 0, Skipped: 0, Time elapsed: 0 sec - in org.apache.commons.lang3.JavaVersionTest
Running org.apache.commons.lang3.builder.NoFieldNamesToStringStyleTest
Tests run: 8, Failures: 0, Errors: 0, Skipped: 0, Time elapsed: 0.016 sec - in org.apache.commons.lang3.builder.NoFieldNamesToStringStyleTest
Running org.apache.commons.lang3.builder.ShortPrefixToStringStyleTest
Tests run: 8, Failures: 0, Errors: 0, Skipped: 0, Time elapsed: 0.007 sec - in org.apache.commons.lang3.builder.ShortPrefixToStringStyleTest
Running org.apache.commons.lang3.builder.DiffResultTest
Tests run: 9, Failures: 0, Errors: 0, Skipped: 0, Time elapsed: 0.011 sec - in org.apache.commons.lang3.builder.DiffResultTest
Running org.apache.commons.lang3.builder.CompareToBuilderTest
Tests run: 48, Failures: 0, Errors: 0, Skipped: 0, Time elapsed: 0.035 sec - in org.apache.commons.lang3.builder.CompareToBuilderTest
Running org.apache.commons.lang3.builder.MultilineRecursiveToStringStyleTest
Tests run: 10, Failures: 0, Errors: 0, Skipped: 0, Time elapsed: 0.008 sec - in org.apache.commons.lang3.builder.MultilineRecursiveToStringStyleTest
Running org.apache.commons.lang3.builder.RecursiveToStringStyleTest
Tests run: 8, Failures: 0, Errors: 0, Skipped: 0, Time elapsed: 0.015 sec - in org.apache.commons.lang3.builder.RecursiveToStringStyleTest
Running org.apache.commons.lang3.builder.DefaultToStringStyleTest
Tests run: 8, Failures: 0, Errors: 0, Skipped: 0, Time elapsed: 0.006 sec - in org.apache.commons.lang3.builder.DefaultToStringStyleTest
Running org.apache.commons.lang3.builder.ReflectionToStringBuilderExcludeTest
Tests run: 11, Failures: 0, Errors: 0, Skipped: 0, Time elapsed: 0.007 sec - in org.apache.commons.lang3.builder.ReflectionToStringBuilderExcludeTest
Running org.apache.commons.lang3.builder.StandardToStringStyleTest
Tests run: 8, Failures: 0, Errors: 0, Skipped: 0, Time elapsed: 0.005 sec - in org.apache.commons.lang3.builder.StandardToStringStyleTest
Running org.apache.commons.lang3.builder.ToStringStyleTest
Tests run: 12, Failures: 0, Errors: 0, Skipped: 0, Time elapsed: 0.007 sec - in org.apache.commons.lang3.builder.ToStringStyleTest
Running org.apache.commons.lang3.builder.DiffTest
Tests run: 4, Failures: 0, Errors: 0, Skipped: 0, Time elapsed: 0.002 sec - in org.apache.commons.lang3.builder.DiffTest
Running org.apache.commons.lang3.builder.SimpleToStringStyleTest
Tests run: 8, Failures: 0, Errors: 0, Skipped: 0, Time elapsed: 0.007 sec - in org.apache.commons.lang3.builder.SimpleToStringStyleTest
Running org.apache.commons.lang3.builder.MultiLineToStringStyleTest
Tests run: 8, Failures: 0, Errors: 0, Skipped: 0, Time elapsed: 0.008 sec - in org.apache.commons.lang3.builder.MultiLineToStringStyleTest
Running org.apache.commons.lang3.builder.ToStringStyleConcurrencyTest
Tests run: 3, Failures: 0, Errors: 0, Skipped: 0, Time elapsed: 4.854 sec - in org.apache.commons.lang3.builder.ToStringStyleConcurrencyTest
Running org.apache.commons.lang3.builder.ReflectionToStringBuilderMutateInspectConcurrencyTest
Tests run: 1, Failures: 0, Errors: 0, Skipped: 1, Time elapsed: 0.001 sec - in org.apache.commons.lang3.builder.ReflectionToStringBuilderMutateInspectConcurrencyTest
Running org.apache.commons.lang3.builder.ToStringBuilderTest
Tests run: 74, Failures: 0, Errors: 0, Skipped: 1, Time elapsed: 0.063 sec - in org.apache.commons.lang3.builder.ToStringBuilderTest
Running org.apache.commons.lang3.builder.EqualsBuilderTest
Tests run: 48, Failures: 0, Errors: 0, Skipped: 0, Time elapsed: 0.011 sec - in org.apache.commons.lang3.builder.EqualsBuilderTest
Running org.apache.commons.lang3.builder.HashCodeBuilderAndEqualsBuilderTest
Tests run: 4, Failures: 0, Errors: 0, Skipped: 0, Time elapsed: 0.008 sec - in org.apache.commons.lang3.builder.HashCodeBuilderAndEqualsBuilderTest
Running org.apache.commons.lang3.builder.ReflectionToStringBuilderConcurrencyTest
Tests run: 3, Failures: 0, Errors: 0, Skipped: 3, Time elapsed: 0 sec - in org.apache.commons.lang3.builder.ReflectionToStringBuilderConcurrencyTest
Running org.apache.commons.lang3.builder.JsonToStringStyleTest
Tests run: 9, Failures: 0, Errors: 0, Skipped: 0, Time elapsed: 0.002 sec - in org.apache.commons.lang3.builder.JsonToStringStyleTest
Running org.apache.commons.lang3.builder.NoClassNameToStringStyleTest
Tests run: 8, Failures: 0, Errors: 0, Skipped: 0, Time elapsed: 0.007 sec - in org.apache.commons.lang3.builder.NoClassNameToStringStyleTest
Running org.apache.commons.lang3.builder.DiffBuilderTest
Tests run: 30, Failures: 0, Errors: 0, Skipped: 0, Time elapsed: 0.026 sec - in org.apache.commons.lang3.builder.DiffBuilderTest
Running org.apache.commons.lang3.builder.HashCodeBuilderTest
Tests run: 44, Failures: 0, Errors: 0, Skipped: 0, Time elapsed: 0.014 sec - in org.apache.commons.lang3.builder.HashCodeBuilderTest
Running org.apache.commons.lang3.concurrent.AtomicInitializerTest
Tests run: 3, Failures: 0, Errors: 0, Skipped: 0, Time elapsed: 0.008 sec - in org.apache.commons.lang3.concurrent.AtomicInitializerTest
Running org.apache.commons.lang3.concurrent.CallableBackgroundInitializerTest
Tests run: 4, Failures: 0, Errors: 0, Skipped: 0, Time elapsed: 0.001 sec - in org.apache.commons.lang3.concurrent.CallableBackgroundInitializerTest
Running org.apache.commons.lang3.concurrent.BackgroundInitializerTest
Tests run: 15, Failures: 0, Errors: 0, Skipped: 0, Time elapsed: 0.013 sec - in org.apache.commons.lang3.concurrent.BackgroundInitializerTest
Running org.apache.commons.lang3.concurrent.LazyInitializerTest
Tests run: 3, Failures: 0, Errors: 0, Skipped: 0, Time elapsed: 0.003 sec - in org.apache.commons.lang3.concurrent.LazyInitializerTest
Running org.apache.commons.lang3.concurrent.BasicThreadFactoryTest
Tests run: 15, Failures: 0, Errors: 0, Skipped: 0, Time elapsed: 0.036 sec - in org.apache.commons.lang3.concurrent.BasicThreadFactoryTest
Running org.apache.commons.lang3.concurrent.ConstantInitializerTest
Tests run: 7, Failures: 0, Errors: 0, Skipped: 0, Time elapsed: 0.001 sec - in org.apache.commons.lang3.concurrent.ConstantInitializerTest
Running org.apache.commons.lang3.concurrent.MultiBackgroundInitializerTest
Tests run: 17, Failures: 0, Errors: 0, Skipped: 0, Time elapsed: 0.076 sec - in org.apache.commons.lang3.concurrent.MultiBackgroundInitializerTest
Running org.apache.commons.lang3.concurrent.AtomicSafeInitializerTest
Tests run: 4, Failures: 0, Errors: 0, Skipped: 0, Time elapsed: 0.008 sec - in org.apache.commons.lang3.concurrent.AtomicSafeInitializerTest
Running org.apache.commons.lang3.concurrent.ConcurrentUtilsTest
Tests run: 40, Failures: 0, Errors: 0, Skipped: 0, Time elapsed: 0.014 sec - in org.apache.commons.lang3.concurrent.ConcurrentUtilsTest
Running org.apache.commons.lang3.concurrent.TimedSemaphoreTest
Tests run: 15, Failures: 0, Errors: 0, Skipped: 0, Time elapsed: 1.18 sec - in org.apache.commons.lang3.concurrent.TimedSemaphoreTest
Running org.apache.commons.lang3.StringUtilsSubstringTest
Tests run: 14, Failures: 0, Errors: 0, Skipped: 0, Time elapsed: 0.005 sec - in org.apache.commons.lang3.StringUtilsSubstringTest
Running org.apache.commons.lang3.SystemUtilsTest
Tests run: 12, Failures: 0, Errors: 0, Skipped: 0, Time elapsed: 0.005 sec - in org.apache.commons.lang3.SystemUtilsTest
Running org.apache.commons.lang3.CharRangeTest
Tests run: 16, Failures: 0, Errors: 0, Skipped: 0, Time elapsed: 0.044 sec - in org.apache.commons.lang3.CharRangeTest
Running org.apache.commons.lang3.CharSetTest
Tests run: 14, Failures: 0, Errors: 0, Skipped: 0, Time elapsed: 0.011 sec - in org.apache.commons.lang3.CharSetTest
Running org.apache.commons.lang3.StringUtilsStartsEndsWithTest
Tests run: 6, Failures: 0, Errors: 0, Skipped: 0, Time elapsed: 0.003 sec - in org.apache.commons.lang3.StringUtilsStartsEndsWithTest
Running org.apache.commons.lang3.RandomStringUtilsTest
Tests run: 11, Failures: 0, Errors: 0, Skipped: 0, Time elapsed: 0.038 sec - in org.apache.commons.lang3.RandomStringUtilsTest
Running org.apache.commons.lang3.SerializationUtilsTest
Tests run: 26, Failures: 0, Errors: 0, Skipped: 0, Time elapsed: 0.063 sec - in org.apache.commons.lang3.SerializationUtilsTest
Running org.apache.commons.lang3.time.StopWatchTest
Tests run: 8, Failures: 0, Errors: 0, Skipped: 0, Time elapsed: 4.763 sec - in org.apache.commons.lang3.time.StopWatchTest
Running org.apache.commons.lang3.time.DateUtilsRoundingTest
Tests run: 22, Failures: 0, Errors: 0, Skipped: 0, Time elapsed: 0.165 sec - in org.apache.commons.lang3.time.DateUtilsRoundingTest
Running org.apache.commons.lang3.time.FastDateParserTest
Tests run: 33, Failures: 0, Errors: 0, Skipped: 0, Time elapsed: 2.424 sec - in org.apache.commons.lang3.time.FastDateParserTest
Running org.apache.commons.lang3.time.FastDateFormat_ParserTest
Tests run: 33, Failures: 0, Errors: 0, Skipped: 0, Time elapsed: 0.79 sec - in org.apache.commons.lang3.time.FastDateFormat_ParserTest
Running org.apache.commons.lang3.time.DurationFormatUtilsTest
Tests run: 25, Failures: 0, Errors: 0, Skipped: 0, Time elapsed: 1.02 sec - in org.apache.commons.lang3.time.DurationFormatUtilsTest
Running org.apache.commons.lang3.time.DateFormatUtilsTest
Tests run: 10, Failures: 0, Errors: 0, Skipped: 0, Time elapsed: 0.002 sec - in org.apache.commons.lang3.time.DateFormatUtilsTest
Running org.apache.commons.lang3.time.DateUtilsFragmentTest
Tests run: 57, Failures: 0, Errors: 0, Skipped: 0, Time elapsed: 0.013 sec - in org.apache.commons.lang3.time.DateUtilsFragmentTest
Running org.apache.commons.lang3.time.FastDatePrinterTimeZonesTest
Tests run: 617, Failures: 0, Errors: 0, Skipped: 0, Time elapsed: 0.255 sec - in org.apache.commons.lang3.time.FastDatePrinterTimeZonesTest
Running org.apache.commons.lang3.time.FastDateFormatTest
>>FastDateFormatTest: FastDateParser:20604  SimpleDateFormat:4072
Tests run: 14, Failures: 0, Errors: 0, Skipped: 0, Time elapsed: 2.678 sec - in org.apache.commons.lang3.time.FastDateFormatTest
Running org.apache.commons.lang3.time.FastDateFormat_PrinterTest
Tests run: 17, Failures: 0, Errors: 0, Skipped: 0, Time elapsed: 0.008 sec - in org.apache.commons.lang3.time.FastDateFormat_PrinterTest
Running org.apache.commons.lang3.time.FastDatePrinterTest
Tests run: 17, Failures: 0, Errors: 0, Skipped: 0, Time elapsed: 0.006 sec - in org.apache.commons.lang3.time.FastDatePrinterTest
Running org.apache.commons.lang3.time.FastDateParserSDFTest
Tests run: 276, Failures: 0, Errors: 0, Skipped: 92, Time elapsed: 0.085 sec - in org.apache.commons.lang3.time.FastDateParserSDFTest
Running org.apache.commons.lang3.time.DateUtilsTest
DateUtilsTest: Default Locale=en_US
Tests run: 38, Failures: 0, Errors: 0, Skipped: 0, Time elapsed: 0.025 sec - in org.apache.commons.lang3.time.DateUtilsTest
Running org.apache.commons.lang3.reflect.InheritanceUtilsTest
Tests run: 9, Failures: 0, Errors: 0, Skipped: 0, Time elapsed: 0.006 sec - in org.apache.commons.lang3.reflect.InheritanceUtilsTest
Running org.apache.commons.lang3.reflect.MethodUtilsTest
Tests run: 23, Failures: 0, Errors: 0, Skipped: 0, Time elapsed: 0.04 sec - in org.apache.commons.lang3.reflect.MethodUtilsTest
Running org.apache.commons.lang3.reflect.ConstructorUtilsTest
Tests run: 7, Failures: 0, Errors: 0, Skipped: 0, Time elapsed: 0.007 sec - in org.apache.commons.lang3.reflect.ConstructorUtilsTest
Running org.apache.commons.lang3.reflect.FieldUtilsTest
Tests run: 64, Failures: 0, Errors: 0, Skipped: 0, Time elapsed: 0.038 sec - in org.apache.commons.lang3.reflect.FieldUtilsTest
Running org.apache.commons.lang3.reflect.TypeLiteralTest
Tests run: 4, Failures: 0, Errors: 0, Skipped: 0, Time elapsed: 0.027 sec - in org.apache.commons.lang3.reflect.TypeLiteralTest
Running org.apache.commons.lang3.reflect.TypeUtilsTest
Tests run: 19, Failures: 0, Errors: 0, Skipped: 0, Time elapsed: 0.036 sec - in org.apache.commons.lang3.reflect.TypeUtilsTest
Running org.apache.commons.lang3.mutable.MutableByteTest
Tests run: 17, Failures: 0, Errors: 0, Skipped: 0, Time elapsed: 0.002 sec - in org.apache.commons.lang3.mutable.MutableByteTest
Running org.apache.commons.lang3.mutable.MutableShortTest
Tests run: 14, Failures: 0, Errors: 0, Skipped: 0, Time elapsed: 0.002 sec - in org.apache.commons.lang3.mutable.MutableShortTest
Running org.apache.commons.lang3.mutable.MutableIntTest
Tests run: 17, Failures: 0, Errors: 0, Skipped: 0, Time elapsed: 0.003 sec - in org.apache.commons.lang3.mutable.MutableIntTest
Running org.apache.commons.lang3.mutable.MutableDoubleTest
Tests run: 18, Failures: 0, Errors: 0, Skipped: 0, Time elapsed: 0.003 sec - in org.apache.commons.lang3.mutable.MutableDoubleTest
Running org.apache.commons.lang3.mutable.MutableFloatTest
Tests run: 18, Failures: 0, Errors: 0, Skipped: 0, Time elapsed: 0.004 sec - in org.apache.commons.lang3.mutable.MutableFloatTest
Running org.apache.commons.lang3.mutable.MutableLongTest
Tests run: 17, Failures: 0, Errors: 0, Skipped: 0, Time elapsed: 0.008 sec - in org.apache.commons.lang3.mutable.MutableLongTest
Running org.apache.commons.lang3.mutable.MutableBooleanTest
Tests run: 9, Failures: 0, Errors: 0, Skipped: 0, Time elapsed: 0 sec - in org.apache.commons.lang3.mutable.MutableBooleanTest
Running org.apache.commons.lang3.mutable.MutableObjectTest
Tests run: 5, Failures: 0, Errors: 0, Skipped: 0, Time elapsed: 0 sec - in org.apache.commons.lang3.mutable.MutableObjectTest
Running org.apache.commons.lang3.text.translate.UnicodeEscaperTest
Tests run: 3, Failures: 3, Errors: 0, Skipped: 0, Time elapsed: 0.001 sec <<< FAILURE! - in org.apache.commons.lang3.text.translate.UnicodeEscaperTest
testAbove(org.apache.commons.lang3.text.translate.UnicodeEscaperTest)  Time elapsed: 0.001 sec  <<< FAILURE!
java.lang.AssertionError: Failed to escape Unicode characters via the above method expected:<ADF\u0047\u005A> but was:<null>
	at org.junit.Assert.fail(Assert.java:88)
	at org.junit.Assert.failNotEquals(Assert.java:834)
	at org.junit.Assert.assertEquals(Assert.java:118)
	at org.apache.commons.lang3.text.translate.UnicodeEscaperTest.testAbove(UnicodeEscaperTest.java:54)

testBelow(org.apache.commons.lang3.text.translate.UnicodeEscaperTest)  Time elapsed: 0 sec  <<< FAILURE!
java.lang.AssertionError: Failed to escape Unicode characters via the below method expected:<\u0041\u0044FGZ> but was:<null>
	at org.junit.Assert.fail(Assert.java:88)
	at org.junit.Assert.failNotEquals(Assert.java:834)
	at org.junit.Assert.assertEquals(Assert.java:118)
	at org.apache.commons.lang3.text.translate.UnicodeEscaperTest.testBelow(UnicodeEscaperTest.java:36)

testBetween(org.apache.commons.lang3.text.translate.UnicodeEscaperTest)  Time elapsed: 0 sec  <<< FAILURE!
java.lang.AssertionError: Failed to escape Unicode characters via the between method expected:<AD\u0046\u0047Z> but was:<null>
	at org.junit.Assert.fail(Assert.java:88)
	at org.junit.Assert.failNotEquals(Assert.java:834)
	at org.junit.Assert.assertEquals(Assert.java:118)
	at org.apache.commons.lang3.text.translate.UnicodeEscaperTest.testBetween(UnicodeEscaperTest.java:45)

Running org.apache.commons.lang3.text.translate.EntityArraysTest
Tests run: 3, Failures: 0, Errors: 0, Skipped: 0, Time elapsed: 0 sec - in org.apache.commons.lang3.text.translate.EntityArraysTest
Running org.apache.commons.lang3.text.translate.UnicodeUnpairedSurrogateRemoverTest
Tests run: 2, Failures: 0, Errors: 0, Skipped: 0, Time elapsed: 0 sec - in org.apache.commons.lang3.text.translate.UnicodeUnpairedSurrogateRemoverTest
Running org.apache.commons.lang3.text.translate.NumericEntityUnescaperTest
Tests run: 3, Failures: 3, Errors: 0, Skipped: 0, Time elapsed: 0.002 sec <<< FAILURE! - in org.apache.commons.lang3.text.translate.NumericEntityUnescaperTest
testSupplementaryUnescaping(org.apache.commons.lang3.text.translate.NumericEntityUnescaperTest)  Time elapsed: 0 sec  <<< FAILURE!
java.lang.AssertionError: Failed to unescape numeric entities supplementary characters expected:<𐰢> but was:<null>
	at org.junit.Assert.fail(Assert.java:88)
	at org.junit.Assert.failNotEquals(Assert.java:834)
	at org.junit.Assert.assertEquals(Assert.java:118)
	at org.apache.commons.lang3.text.translate.NumericEntityUnescaperTest.testSupplementaryUnescaping(NumericEntityUnescaperTest.java:38)

testUnfinishedEntity(org.apache.commons.lang3.text.translate.NumericEntityUnescaperTest)  Time elapsed: 0.001 sec  <<< FAILURE!
java.lang.AssertionError: Failed to support unfinished entities (i.e. missing semi-colon) expected:<Test 0 not test> but was:<null>
	at org.junit.Assert.fail(Assert.java:88)
	at org.junit.Assert.failNotEquals(Assert.java:834)
	at org.junit.Assert.assertEquals(Assert.java:118)
	at org.apache.commons.lang3.text.translate.NumericEntityUnescaperTest.testUnfinishedEntity(NumericEntityUnescaperTest.java:59)

testOutOfBounds(org.apache.commons.lang3.text.translate.NumericEntityUnescaperTest)  Time elapsed: 0 sec  <<< FAILURE!
java.lang.AssertionError: Failed to ignore when last character is & expected:<Test &> but was:<null>
	at org.junit.Assert.fail(Assert.java:88)
	at org.junit.Assert.failNotEquals(Assert.java:834)
	at org.junit.Assert.assertEquals(Assert.java:118)
	at org.apache.commons.lang3.text.translate.NumericEntityUnescaperTest.testOutOfBounds(NumericEntityUnescaperTest.java:45)

Running org.apache.commons.lang3.text.translate.NumericEntityEscaperTest
Tests run: 4, Failures: 4, Errors: 0, Skipped: 0, Time elapsed: 0.011 sec <<< FAILURE! - in org.apache.commons.lang3.text.translate.NumericEntityEscaperTest
testAbove(org.apache.commons.lang3.text.translate.NumericEntityEscaperTest)  Time elapsed: 0 sec  <<< FAILURE!
java.lang.AssertionError: Failed to escape numeric entities via the above method expected:<ADF&#71;&#90;> but was:<null>
	at org.junit.Assert.fail(Assert.java:88)
	at org.junit.Assert.failNotEquals(Assert.java:834)
	at org.junit.Assert.assertEquals(Assert.java:118)
	at org.apache.commons.lang3.text.translate.NumericEntityEscaperTest.testAbove(NumericEntityEscaperTest.java:54)

testBelow(org.apache.commons.lang3.text.translate.NumericEntityEscaperTest)  Time elapsed: 0.011 sec  <<< FAILURE!
java.lang.AssertionError: Failed to escape numeric entities via the below method expected:<&#65;&#68;FGZ> but was:<null>
	at org.junit.Assert.fail(Assert.java:88)
	at org.junit.Assert.failNotEquals(Assert.java:834)
	at org.junit.Assert.assertEquals(Assert.java:118)
	at org.apache.commons.lang3.text.translate.NumericEntityEscaperTest.testBelow(NumericEntityEscaperTest.java:36)

testBetween(org.apache.commons.lang3.text.translate.NumericEntityEscaperTest)  Time elapsed: 0 sec  <<< FAILURE!
java.lang.AssertionError: Failed to escape numeric entities via the between method expected:<AD&#70;&#71;Z> but was:<null>
	at org.junit.Assert.fail(Assert.java:88)
	at org.junit.Assert.failNotEquals(Assert.java:834)
	at org.junit.Assert.assertEquals(Assert.java:118)
	at org.apache.commons.lang3.text.translate.NumericEntityEscaperTest.testBetween(NumericEntityEscaperTest.java:45)

testSupplementary(org.apache.commons.lang3.text.translate.NumericEntityEscaperTest)  Time elapsed: 0 sec  <<< FAILURE!
java.lang.AssertionError: Failed to escape numeric entities supplementary characters expected:<&#68642;> but was:<null>
	at org.junit.Assert.fail(Assert.java:88)
	at org.junit.Assert.failNotEquals(Assert.java:834)
	at org.junit.Assert.assertEquals(Assert.java:118)
	at org.apache.commons.lang3.text.translate.NumericEntityEscaperTest.testSupplementary(NumericEntityEscaperTest.java:65)

Running org.apache.commons.lang3.text.translate.LookupTranslatorTest
Tests run: 2, Failures: 0, Errors: 0, Skipped: 0, Time elapsed: 0 sec - in org.apache.commons.lang3.text.translate.LookupTranslatorTest
Running org.apache.commons.lang3.text.translate.UnicodeUnescaperTest
Tests run: 3, Failures: 3, Errors: 0, Skipped: 0, Time elapsed: 0 sec <<< FAILURE! - in org.apache.commons.lang3.text.translate.UnicodeUnescaperTest
testUPlus(org.apache.commons.lang3.text.translate.UnicodeUnescaperTest)  Time elapsed: 0 sec  <<< FAILURE!
java.lang.AssertionError: Failed to unescape Unicode characters with 'u+' notation expected:<G> but was:<null>
	at org.junit.Assert.fail(Assert.java:88)
	at org.junit.Assert.failNotEquals(Assert.java:834)
	at org.junit.Assert.assertEquals(Assert.java:118)
	at org.apache.commons.lang3.text.translate.UnicodeUnescaperTest.testUPlus(UnicodeUnescaperTest.java:37)

testUuuuu(org.apache.commons.lang3.text.translate.UnicodeUnescaperTest)  Time elapsed: 0 sec  <<< FAILURE!
java.lang.AssertionError: Failed to unescape Unicode characters with many 'u' characters expected:<G> but was:<null>
	at org.junit.Assert.fail(Assert.java:88)
	at org.junit.Assert.failNotEquals(Assert.java:834)
	at org.junit.Assert.assertEquals(Assert.java:118)
	at org.apache.commons.lang3.text.translate.UnicodeUnescaperTest.testUuuuu(UnicodeUnescaperTest.java:46)

testLessThanFour(org.apache.commons.lang3.text.translate.UnicodeUnescaperTest)  Time elapsed: 0 sec  <<< FAILURE!
java.lang.AssertionError: A lack of digits in a Unicode escape sequence failed to throw an exception
	at org.junit.Assert.fail(Assert.java:88)
	at org.apache.commons.lang3.text.translate.UnicodeUnescaperTest.testLessThanFour(UnicodeUnescaperTest.java:56)

Running org.apache.commons.lang3.text.translate.OctalUnescaperTest
Tests run: 1, Failures: 1, Errors: 0, Skipped: 0, Time elapsed: 0 sec <<< FAILURE! - in org.apache.commons.lang3.text.translate.OctalUnescaperTest
testBetween(org.apache.commons.lang3.text.translate.OctalUnescaperTest)  Time elapsed: 0 sec  <<< FAILURE!
java.lang.AssertionError: Failed to unescape octal characters via the between method expected:<%> but was:<null>
	at org.junit.Assert.fail(Assert.java:88)
	at org.junit.Assert.failNotEquals(Assert.java:834)
	at org.junit.Assert.assertEquals(Assert.java:118)
	at org.apache.commons.lang3.text.translate.OctalUnescaperTest.testBetween(OctalUnescaperTest.java:35)

Running org.apache.commons.lang3.text.StrMatcherTest
Tests run: 14, Failures: 0, Errors: 0, Skipped: 0, Time elapsed: 0.001 sec - in org.apache.commons.lang3.text.StrMatcherTest
Running org.apache.commons.lang3.text.StrTokenizerTest
Tests run: 55, Failures: 0, Errors: 0, Skipped: 0, Time elapsed: 0.005 sec - in org.apache.commons.lang3.text.StrTokenizerTest
Running org.apache.commons.lang3.text.FormattableUtilsTest
Tests run: 5, Failures: 0, Errors: 0, Skipped: 0, Time elapsed: 0.001 sec - in org.apache.commons.lang3.text.FormattableUtilsTest
Running org.apache.commons.lang3.text.CompositeFormatTest
Tests run: 2, Failures: 0, Errors: 0, Skipped: 0, Time elapsed: 0.001 sec - in org.apache.commons.lang3.text.CompositeFormatTest
Running org.apache.commons.lang3.text.WordUtilsTest
Tests run: 12, Failures: 0, Errors: 0, Skipped: 0, Time elapsed: 0.004 sec - in org.apache.commons.lang3.text.WordUtilsTest
Running org.apache.commons.lang3.text.StrLookupTest
Tests run: 5, Failures: 0, Errors: 0, Skipped: 0, Time elapsed: 0.002 sec - in org.apache.commons.lang3.text.StrLookupTest
Running org.apache.commons.lang3.text.StrBuilderAppendInsertTest
Tests run: 51, Failures: 0, Errors: 0, Skipped: 0, Time elapsed: 0.02 sec - in org.apache.commons.lang3.text.StrBuilderAppendInsertTest
Running org.apache.commons.lang3.text.ExtendedMessageFormatTest
Tests run: 10, Failures: 0, Errors: 0, Skipped: 0, Time elapsed: 0.795 sec - in org.apache.commons.lang3.text.ExtendedMessageFormatTest
Running org.apache.commons.lang3.text.StrSubstitutorTest
Tests run: 40, Failures: 0, Errors: 0, Skipped: 0, Time elapsed: 0.036 sec - in org.apache.commons.lang3.text.StrSubstitutorTest
Running org.apache.commons.lang3.text.StrBuilderTest
Tests run: 90, Failures: 0, Errors: 0, Skipped: 0, Time elapsed: 0.07 sec - in org.apache.commons.lang3.text.StrBuilderTest
Running org.apache.commons.lang3.StringEscapeUtilsTest
Tests run: 28, Failures: 19, Errors: 6, Skipped: 0, Time elapsed: 0.039 sec <<< FAILURE! - in org.apache.commons.lang3.StringEscapeUtilsTest
testEscapeXmlAllCharacters(org.apache.commons.lang3.StringEscapeUtilsTest)  Time elapsed: 0.001 sec  <<< FAILURE!
java.lang.AssertionError: expected:<&#0;&#1;&#2;&#3;&#4;&#5;&#6;&#7;&#8;> but was:<null>
	at org.junit.Assert.fail(Assert.java:88)
	at org.junit.Assert.failNotEquals(Assert.java:834)
	at org.junit.Assert.assertEquals(Assert.java:118)
	at org.junit.Assert.assertEquals(Assert.java:144)
	at org.apache.commons.lang3.StringEscapeUtilsTest.testEscapeXmlAllCharacters(StringEscapeUtilsTest.java:402)

testUnescapeJava(org.apache.commons.lang3.StringEscapeUtilsTest)  Time elapsed: 0.004 sec  <<< ERROR!
java.lang.NullPointerException: null
	at org.apache.commons.lang3.text.translate.CharSequenceTranslator.translate(CharSequenceTranslator.java:16)
	at org.apache.commons.lang3.StringEscapeUtils.unescapeJava(StringEscapeUtils.java:525)
	at org.apache.commons.lang3.StringEscapeUtilsTest.testUnescapeJava(StringEscapeUtilsTest.java:126)

testStandaloneAmphersand(org.apache.commons.lang3.StringEscapeUtilsTest)  Time elapsed: 0.001 sec  <<< FAILURE!
java.lang.AssertionError: expected:<<P&O>> but was:<null>
	at org.junit.Assert.fail(Assert.java:88)
	at org.junit.Assert.failNotEquals(Assert.java:834)
	at org.junit.Assert.assertEquals(Assert.java:118)
	at org.junit.Assert.assertEquals(Assert.java:144)
	at org.apache.commons.lang3.StringEscapeUtilsTest.testStandaloneAmphersand(StringEscapeUtilsTest.java:429)

testUnescapeHtml4(org.apache.commons.lang3.StringEscapeUtilsTest)  Time elapsed: 0.001 sec  <<< FAILURE!
java.lang.AssertionError: no escaping expected:<plain text> but was:<null>
	at org.junit.Assert.fail(Assert.java:88)
	at org.junit.Assert.failNotEquals(Assert.java:834)
	at org.junit.Assert.assertEquals(Assert.java:118)
	at org.apache.commons.lang3.StringEscapeUtilsTest.testUnescapeHtml4(StringEscapeUtilsTest.java:244)

testEscapeHtml(org.apache.commons.lang3.StringEscapeUtilsTest)  Time elapsed: 0.001 sec  <<< FAILURE!
java.lang.AssertionError: no escaping expected:<plain text> but was:<null>
	at org.junit.Assert.fail(Assert.java:88)
	at org.junit.Assert.failNotEquals(Assert.java:834)
	at org.junit.Assert.assertEquals(Assert.java:118)
	at org.apache.commons.lang3.StringEscapeUtilsTest.testEscapeHtml(StringEscapeUtilsTest.java:227)

testEscapeJava(org.apache.commons.lang3.StringEscapeUtilsTest)  Time elapsed: 0.001 sec  <<< ERROR!
java.lang.NullPointerException: null
	at org.apache.commons.lang3.text.translate.CharSequenceTranslator.translate(CharSequenceTranslator.java:16)
	at org.apache.commons.lang3.StringEscapeUtils.escapeJava(StringEscapeUtils.java:456)
	at org.apache.commons.lang3.StringEscapeUtilsTest.testEscapeJava(StringEscapeUtilsTest.java:57)

testEscapeJson(org.apache.commons.lang3.StringEscapeUtilsTest)  Time elapsed: 0.001 sec  <<< ERROR!
java.lang.NullPointerException: null
	at org.apache.commons.lang3.text.translate.CharSequenceTranslator.translate(CharSequenceTranslator.java:16)
	at org.apache.commons.lang3.StringEscapeUtils.escapeJson(StringEscapeUtils.java:512)
	at org.apache.commons.lang3.StringEscapeUtilsTest.testEscapeJson(StringEscapeUtilsTest.java:594)

testEscapeJavaWithSlash(org.apache.commons.lang3.StringEscapeUtilsTest)  Time elapsed: 0 sec  <<< FAILURE!
java.lang.AssertionError: expected:<String with a slash (/) in it> but was:<null>
	at org.junit.Assert.fail(Assert.java:88)
	at org.junit.Assert.failNotEquals(Assert.java:834)
	at org.junit.Assert.assertEquals(Assert.java:118)
	at org.junit.Assert.assertEquals(Assert.java:144)
	at org.apache.commons.lang3.StringEscapeUtilsTest.testEscapeJavaWithSlash(StringEscapeUtilsTest.java:107)

testEscapeXml10(org.apache.commons.lang3.StringEscapeUtilsTest)  Time elapsed: 0 sec  <<< FAILURE!
java.lang.AssertionError: expected:<a&lt;b&gt;c&quot;d&apos;e&amp;f> but was:<null>
	at org.junit.Assert.fail(Assert.java:88)
	at org.junit.Assert.failNotEquals(Assert.java:834)
	at org.junit.Assert.assertEquals(Assert.java:118)
	at org.junit.Assert.assertEquals(Assert.java:144)
	at org.apache.commons.lang3.StringEscapeUtilsTest.testEscapeXml10(StringEscapeUtilsTest.java:334)

testEscapeXml11(org.apache.commons.lang3.StringEscapeUtilsTest)  Time elapsed: 0 sec  <<< FAILURE!
java.lang.AssertionError: expected:<a&lt;b&gt;c&quot;d&apos;e&amp;f> but was:<null>
	at org.junit.Assert.fail(Assert.java:88)
	at org.junit.Assert.failNotEquals(Assert.java:834)
	at org.junit.Assert.assertEquals(Assert.java:118)
	at org.junit.Assert.assertEquals(Assert.java:144)
	at org.apache.commons.lang3.StringEscapeUtilsTest.testEscapeXml11(StringEscapeUtilsTest.java:349)

testEscapeXmlSupplementaryCharacters(org.apache.commons.lang3.StringEscapeUtilsTest)  Time elapsed: 0 sec  <<< FAILURE!
java.lang.AssertionError: Supplementary character must be represented using a single escape expected:<&#144308;> but was:<null>
	at org.junit.Assert.fail(Assert.java:88)
	at org.junit.Assert.failNotEquals(Assert.java:834)
	at org.junit.Assert.assertEquals(Assert.java:118)
	at org.apache.commons.lang3.StringEscapeUtilsTest.testEscapeXmlSupplementaryCharacters(StringEscapeUtilsTest.java:385)

testLang313(org.apache.commons.lang3.StringEscapeUtilsTest)  Time elapsed: 0.001 sec  <<< FAILURE!
java.lang.AssertionError: expected:<& &> but was:<null>
	at org.junit.Assert.fail(Assert.java:88)
	at org.junit.Assert.failNotEquals(Assert.java:834)
	at org.junit.Assert.assertEquals(Assert.java:118)
	at org.junit.Assert.assertEquals(Assert.java:144)
	at org.apache.commons.lang3.StringEscapeUtilsTest.testLang313(StringEscapeUtilsTest.java:437)

testLang708(org.apache.commons.lang3.StringEscapeUtilsTest)  Time elapsed: 0.008 sec  <<< ERROR!
java.lang.NullPointerException: null
	at org.apache.commons.lang3.StringEscapeUtilsTest.testLang708(StringEscapeUtilsTest.java:564)

testLang720(org.apache.commons.lang3.StringEscapeUtilsTest)  Time elapsed: 0.001 sec  <<< FAILURE!
java.lang.AssertionError: expected:<𠮷A> but was:<null>
	at org.junit.Assert.fail(Assert.java:88)
	at org.junit.Assert.failNotEquals(Assert.java:834)
	at org.junit.Assert.assertEquals(Assert.java:118)
	at org.junit.Assert.assertEquals(Assert.java:144)
	at org.apache.commons.lang3.StringEscapeUtilsTest.testLang720(StringEscapeUtilsTest.java:578)

testLang911(org.apache.commons.lang3.StringEscapeUtilsTest)  Time elapsed: 0.001 sec  <<< ERROR!
java.lang.NullPointerException: null
	at org.apache.commons.lang3.text.translate.CharSequenceTranslator.translate(CharSequenceTranslator.java:16)
	at org.apache.commons.lang3.StringEscapeUtils.unescapeJava(StringEscapeUtils.java:525)
	at org.apache.commons.lang3.StringEscapeUtilsTest.testLang911(StringEscapeUtilsTest.java:588)

testEscapeEcmaScript(org.apache.commons.lang3.StringEscapeUtilsTest)  Time elapsed: 0 sec  <<< ERROR!
java.lang.NullPointerException: null
	at org.apache.commons.lang3.text.translate.CharSequenceTranslator.translate(CharSequenceTranslator.java:16)
	at org.apache.commons.lang3.StringEscapeUtils.escapeEcmaScript(StringEscapeUtils.java:484)
	at org.apache.commons.lang3.StringEscapeUtilsTest.testEscapeEcmaScript(StringEscapeUtilsTest.java:182)

testEscapeCsvString(org.apache.commons.lang3.StringEscapeUtilsTest)  Time elapsed: 0 sec  <<< FAILURE!
java.lang.AssertionError: expected:<foo.bar> but was:<null>
	at org.junit.Assert.fail(Assert.java:88)
	at org.junit.Assert.failNotEquals(Assert.java:834)
	at org.junit.Assert.assertEquals(Assert.java:118)
	at org.junit.Assert.assertEquals(Assert.java:144)
	at org.apache.commons.lang3.StringEscapeUtilsTest.testEscapeCsvString(StringEscapeUtilsTest.java:442)

testEscapeHtmlHighUnicode(org.apache.commons.lang3.StringEscapeUtilsTest)  Time elapsed: 0.001 sec  <<< FAILURE!
java.lang.AssertionError: High Unicode should not have been escaped expected:<𝍢> but was:<null>
	at org.junit.Assert.fail(Assert.java:88)
	at org.junit.Assert.failNotEquals(Assert.java:834)
	at org.junit.Assert.assertEquals(Assert.java:118)
	at org.apache.commons.lang3.StringEscapeUtilsTest.testEscapeHtmlHighUnicode(StringEscapeUtilsTest.java:526)

testUnescapeHexCharsHtml(org.apache.commons.lang3.StringEscapeUtilsTest)  Time elapsed: 0.001 sec  <<< FAILURE!
java.lang.AssertionError: hex number unescape expected:<> but was:<null>
	at org.junit.Assert.fail(Assert.java:88)
	at org.junit.Assert.failNotEquals(Assert.java:834)
	at org.junit.Assert.assertEquals(Assert.java:118)
	at org.apache.commons.lang3.StringEscapeUtilsTest.testUnescapeHexCharsHtml(StringEscapeUtilsTest.java:268)

testUnescapeXmlSupplementaryCharacters(org.apache.commons.lang3.StringEscapeUtilsTest)  Time elapsed: 0 sec  <<< FAILURE!
java.lang.AssertionError: Supplementary character must be represented using a single escape expected:<𣎴> but was:<null>
	at org.junit.Assert.fail(Assert.java:88)
	at org.junit.Assert.failNotEquals(Assert.java:834)
	at org.junit.Assert.assertEquals(Assert.java:118)
	at org.apache.commons.lang3.StringEscapeUtilsTest.testUnescapeXmlSupplementaryCharacters(StringEscapeUtilsTest.java:418)

testUnescapeCsvString(org.apache.commons.lang3.StringEscapeUtilsTest)  Time elapsed: 0 sec  <<< FAILURE!
java.lang.AssertionError: expected:<foo.bar> but was:<null>
	at org.junit.Assert.fail(Assert.java:88)
	at org.junit.Assert.failNotEquals(Assert.java:834)
	at org.junit.Assert.assertEquals(Assert.java:118)
	at org.junit.Assert.assertEquals(Assert.java:144)
	at org.apache.commons.lang3.StringEscapeUtilsTest.testUnescapeCsvString(StringEscapeUtilsTest.java:476)

testEscapeHtmlVersions(org.apache.commons.lang3.StringEscapeUtilsTest)  Time elapsed: 0.001 sec  <<< FAILURE!
java.lang.AssertionError: expected:<&Beta;> but was:<null>
	at org.junit.Assert.fail(Assert.java:88)
	at org.junit.Assert.failNotEquals(Assert.java:834)
	at org.junit.Assert.assertEquals(Assert.java:118)
	at org.junit.Assert.assertEquals(Assert.java:144)
	at org.apache.commons.lang3.StringEscapeUtilsTest.testEscapeHtmlVersions(StringEscapeUtilsTest.java:288)

testUnescapeUnknownEntity(org.apache.commons.lang3.StringEscapeUtilsTest)  Time elapsed: 0.001 sec  <<< FAILURE!
java.lang.AssertionError: expected:<&zzzz;> but was:<null>
	at org.junit.Assert.fail(Assert.java:88)
	at org.junit.Assert.failNotEquals(Assert.java:834)
	at org.junit.Assert.assertEquals(Assert.java:118)
	at org.junit.Assert.assertEquals(Assert.java:144)
	at org.apache.commons.lang3.StringEscapeUtilsTest.testUnescapeUnknownEntity(StringEscapeUtilsTest.java:283)

testEscapeHiragana(org.apache.commons.lang3.StringEscapeUtilsTest)  Time elapsed: 0 sec  <<< FAILURE!
java.lang.AssertionError: Hiragana character Unicode behaviour should not be being escaped by escapeHtml4 expected:<かがと> but was:<null>
	at org.junit.Assert.fail(Assert.java:88)
	at org.junit.Assert.failNotEquals(Assert.java:834)
	at org.junit.Assert.assertEquals(Assert.java:118)
	at org.apache.commons.lang3.StringEscapeUtilsTest.testEscapeHiragana(StringEscapeUtilsTest.java:544)

testEscapeXml(org.apache.commons.lang3.StringEscapeUtilsTest)  Time elapsed: 0 sec  <<< FAILURE!
java.lang.AssertionError: expected:<&lt;abc&gt;> but was:<null>
	at org.junit.Assert.fail(Assert.java:88)
	at org.junit.Assert.failNotEquals(Assert.java:834)
	at org.junit.Assert.assertEquals(Assert.java:118)
	at org.junit.Assert.assertEquals(Assert.java:144)
	at org.apache.commons.lang3.StringEscapeUtilsTest.testEscapeXml(StringEscapeUtilsTest.java:297)

Running org.apache.commons.lang3.AnnotationUtilsTest
Tests run: 10, Failures: 0, Errors: 0, Skipped: 0, Time elapsed: 0.049 sec - in org.apache.commons.lang3.AnnotationUtilsTest
Running org.apache.commons.lang3.ConversionTest
Tests run: 42, Failures: 0, Errors: 0, Skipped: 0, Time elapsed: 0.035 sec - in org.apache.commons.lang3.ConversionTest
Running org.apache.commons.lang3.StringUtilsTrimEmptyTest
Tests run: 15, Failures: 0, Errors: 0, Skipped: 0, Time elapsed: 0.016 sec - in org.apache.commons.lang3.StringUtilsTrimEmptyTest
Running org.apache.commons.lang3.EnumUtilsTest
Tests run: 34, Failures: 0, Errors: 0, Skipped: 0, Time elapsed: 0.012 sec - in org.apache.commons.lang3.EnumUtilsTest
Running org.apache.commons.lang3.exception.ExceptionUtilsTest
Tests run: 28, Failures: 0, Errors: 0, Skipped: 0, Time elapsed: 0.036 sec - in org.apache.commons.lang3.exception.ExceptionUtilsTest
Running org.apache.commons.lang3.exception.DefaultExceptionContextTest
Tests run: 8, Failures: 0, Errors: 0, Skipped: 0, Time elapsed: 0.006 sec - in org.apache.commons.lang3.exception.DefaultExceptionContextTest
Running org.apache.commons.lang3.exception.ContextedExceptionTest
Tests run: 14, Failures: 0, Errors: 0, Skipped: 0, Time elapsed: 0.013 sec - in org.apache.commons.lang3.exception.ContextedExceptionTest
Running org.apache.commons.lang3.exception.ContextedRuntimeExceptionTest
Tests run: 14, Failures: 0, Errors: 0, Skipped: 0, Time elapsed: 0.014 sec - in org.apache.commons.lang3.exception.ContextedRuntimeExceptionTest
Running org.apache.commons.lang3.BitFieldTest
Tests run: 15, Failures: 0, Errors: 0, Skipped: 0, Time elapsed: 0.003 sec - in org.apache.commons.lang3.BitFieldTest
Running org.apache.commons.lang3.ArrayUtilsRemoveMultipleTest
Tests run: 55, Failures: 0, Errors: 0, Skipped: 0, Time elapsed: 0.014 sec - in org.apache.commons.lang3.ArrayUtilsRemoveMultipleTest
Running org.apache.commons.lang3.HashSetvBitSetTest
Ratio=8% array=100 count=1 extract=18877196 bitset=1614929
Ratio=7% array=100 count=10 extract=22721889 bitset=1634787
Ratio=13% array=100 count=50 extract=10396107 bitset=1413579
Ratio=4% array=100 count=100 extract=12956506 bitset=539620
Ratio=86% array=1000 count=10 extract=7430543 bitset=6463509
Ratio=31% array=1000 count=100 extract=18073860 bitset=5757516
Ratio=7% array=1000 count=500 extract=49134893 bitset=3524079
Ratio=1% array=1000 count=1000 extract=78211419 bitset=837097
Ratio=36% count=0 hash=4148489 bits=1526922
Ratio=14% count=5 hash=1829756 bits=262690
Ratio=27% count=10 hash=1303145 bits=356319
Ratio=18% count=200 hash=28820986 bits=5420395
Ratio=13% count=50 hash=8365763 bits=1168233
Ratio=24% count=100 hash=12667600 bits=3056313
Ratio=15% count=1000 hash=124432735 bits=19042433
Ratio=15% count=2000 hash=235387621 bits=37420041
Tests run: 2, Failures: 0, Errors: 0, Skipped: 0, Time elapsed: 0.834 sec - in org.apache.commons.lang3.HashSetvBitSetTest
Running org.apache.commons.lang3.StringUtilsTest
Tests run: 124, Failures: 3, Errors: 0, Skipped: 0, Time elapsed: 0.179 sec <<< FAILURE! - in org.apache.commons.lang3.StringUtilsTest
testEscapeSurrogatePairs(org.apache.commons.lang3.StringUtilsTest)  Time elapsed: 0 sec  <<< FAILURE!
java.lang.AssertionError: expected:<😰> but was:<null>
	at org.junit.Assert.fail(Assert.java:88)
	at org.junit.Assert.failNotEquals(Assert.java:834)
	at org.junit.Assert.assertEquals(Assert.java:118)
	at org.junit.Assert.assertEquals(Assert.java:144)
	at org.apache.commons.lang3.StringUtilsTest.testEscapeSurrogatePairs(StringUtilsTest.java:2351)

testUnescapeSurrogatePairs(org.apache.commons.lang3.StringUtilsTest)  Time elapsed: 0 sec  <<< FAILURE!
java.lang.AssertionError: expected:<😰> but was:<null>
	at org.junit.Assert.fail(Assert.java:88)
	at org.junit.Assert.failNotEquals(Assert.java:834)
	at org.junit.Assert.assertEquals(Assert.java:118)
	at org.junit.Assert.assertEquals(Assert.java:144)
	at org.apache.commons.lang3.StringUtilsTest.testUnescapeSurrogatePairs(StringUtilsTest.java:2372)

testEscapeSurrogatePairsLang858(org.apache.commons.lang3.StringUtilsTest)  Time elapsed: 0 sec  <<< FAILURE!
java.lang.AssertionError: expected:<\uDBFF\uDFFD> but was:<null>
	at org.junit.Assert.fail(Assert.java:88)
	at org.junit.Assert.failNotEquals(Assert.java:834)
	at org.junit.Assert.assertEquals(Assert.java:118)
	at org.junit.Assert.assertEquals(Assert.java:144)
	at org.apache.commons.lang3.StringUtilsTest.testEscapeSurrogatePairsLang858(StringUtilsTest.java:2366)

Running org.apache.commons.lang3.ArrayUtilsRemoveTest
Tests run: 19, Failures: 0, Errors: 0, Skipped: 0, Time elapsed: 0.001 sec - in org.apache.commons.lang3.ArrayUtilsRemoveTest
Running org.apache.commons.lang3.ObjectUtilsTest
Tests run: 36, Failures: 0, Errors: 0, Skipped: 0, Time elapsed: 0.015 sec - in org.apache.commons.lang3.ObjectUtilsTest
Running org.apache.commons.lang3.ClassPathUtilsTest
Tests run: 13, Failures: 0, Errors: 0, Skipped: 0, Time elapsed: 0.003 sec - in org.apache.commons.lang3.ClassPathUtilsTest
Running org.apache.commons.lang3.math.NumberUtilsTest
Tests run: 91, Failures: 0, Errors: 0, Skipped: 0, Time elapsed: 0.035 sec - in org.apache.commons.lang3.math.NumberUtilsTest
Running org.apache.commons.lang3.math.IEEE754rUtilsTest
Tests run: 3, Failures: 0, Errors: 0, Skipped: 0, Time elapsed: 0 sec - in org.apache.commons.lang3.math.IEEE754rUtilsTest
Running org.apache.commons.lang3.math.FractionTest
Tests run: 25, Failures: 0, Errors: 0, Skipped: 0, Time elapsed: 0.241 sec - in org.apache.commons.lang3.math.FractionTest
Running org.apache.commons.lang3.BooleanUtilsTest
Tests run: 72, Failures: 0, Errors: 0, Skipped: 0, Time elapsed: 0.013 sec - in org.apache.commons.lang3.BooleanUtilsTest
Running org.apache.commons.lang3.CharSequenceUtilsTest
Tests run: 2, Failures: 0, Errors: 0, Skipped: 0, Time elapsed: 0 sec - in org.apache.commons.lang3.CharSequenceUtilsTest
Running org.apache.commons.lang3.CharSetUtilsTest
Tests run: 11, Failures: 0, Errors: 0, Skipped: 0, Time elapsed: 0.01 sec - in org.apache.commons.lang3.CharSetUtilsTest
Running org.apache.commons.lang3.ArrayUtilsAddTest
Tests run: 13, Failures: 0, Errors: 0, Skipped: 0, Time elapsed: 0.001 sec - in org.apache.commons.lang3.ArrayUtilsAddTest
Running org.apache.commons.lang3.CharEncodingTest
Tests run: 6, Failures: 0, Errors: 0, Skipped: 0, Time elapsed: 0.023 sec - in org.apache.commons.lang3.CharEncodingTest
Running org.apache.commons.lang3.ClassUtilsTest
Tests run: 57, Failures: 0, Errors: 0, Skipped: 0, Time elapsed: 0.044 sec - in org.apache.commons.lang3.ClassUtilsTest
Running org.apache.commons.lang3.RangeTest
Tests run: 24, Failures: 0, Errors: 0, Skipped: 0, Time elapsed: 0.017 sec - in org.apache.commons.lang3.RangeTest
Running org.apache.commons.lang3.event.EventUtilsTest
Tests run: 8, Failures: 0, Errors: 0, Skipped: 0, Time elapsed: 0.021 sec - in org.apache.commons.lang3.event.EventUtilsTest
Running org.apache.commons.lang3.event.EventListenerSupportTest
Tests run: 9, Failures: 0, Errors: 0, Skipped: 0, Time elapsed: 0.024 sec - in org.apache.commons.lang3.event.EventListenerSupportTest
Running org.apache.commons.lang3.ArrayUtilsTest
Tests run: 205, Failures: 0, Errors: 0, Skipped: 0, Time elapsed: 0.057 sec - in org.apache.commons.lang3.ArrayUtilsTest
Running org.apache.commons.lang3.CharUtilsTest
Tests run: 24, Failures: 0, Errors: 0, Skipped: 0, Time elapsed: 0.004 sec - in org.apache.commons.lang3.CharUtilsTest
Running org.apache.commons.lang3.NotImplementedExceptionTest
Tests run: 1, Failures: 0, Errors: 0, Skipped: 0, Time elapsed: 0 sec - in org.apache.commons.lang3.NotImplementedExceptionTest
Running org.apache.commons.lang3.StringUtilsEqualsIndexOfTest
Tests run: 50, Failures: 0, Errors: 0, Skipped: 0, Time elapsed: 0.006 sec - in org.apache.commons.lang3.StringUtilsEqualsIndexOfTest
Running org.apache.commons.lang3.RandomUtilsTest
Tests run: 23, Failures: 0, Errors: 0, Skipped: 0, Time elapsed: 0.006 sec - in org.apache.commons.lang3.RandomUtilsTest

Results :

Failed tests: 
  StringEscapeUtilsTest.testEscapeCsvString:442 expected:<foo.bar> but was:<null>
  StringEscapeUtilsTest.testEscapeHiragana:544 Hiragana character Unicode behaviour should not be being escaped by escapeHtml4 expected:<かがと> but was:<null>
  StringEscapeUtilsTest.testEscapeHtml:227 no escaping expected:<plain text> but was:<null>
  StringEscapeUtilsTest.testEscapeHtmlHighUnicode:526 High Unicode should not have been escaped expected:<𝍢> but was:<null>
  StringEscapeUtilsTest.testEscapeHtmlVersions:288 expected:<&Beta;> but was:<null>
  StringEscapeUtilsTest.testEscapeJavaWithSlash:107 expected:<String with a slash (/) in it> but was:<null>
  StringEscapeUtilsTest.testEscapeXml:297 expected:<&lt;abc&gt;> but was:<null>
  StringEscapeUtilsTest.testEscapeXml10:334 expected:<a&lt;b&gt;c&quot;d&apos;e&amp;f> but was:<null>
  StringEscapeUtilsTest.testEscapeXml11:349 expected:<a&lt;b&gt;c&quot;d&apos;e&amp;f> but was:<null>
  StringEscapeUtilsTest.testEscapeXmlAllCharacters:402 expected:<&#0;&#1;&#2;&#3;&#4;&#5;&#6;&#7;&#8;> but was:<null>
  StringEscapeUtilsTest.testEscapeXmlSupplementaryCharacters:385 Supplementary character must be represented using a single escape expected:<&#144308;> but was:<null>
  StringEscapeUtilsTest.testLang313:437 expected:<& &> but was:<null>
  StringEscapeUtilsTest.testLang720:578 expected:<𠮷A> but was:<null>
  StringEscapeUtilsTest.testStandaloneAmphersand:429 expected:<<P&O>> but was:<null>
  StringEscapeUtilsTest.testUnescapeCsvString:476 expected:<foo.bar> but was:<null>
  StringEscapeUtilsTest.testUnescapeHexCharsHtml:268 hex number unescape expected:<> but was:<null>
  StringEscapeUtilsTest.testUnescapeHtml4:244 no escaping expected:<plain text> but was:<null>
  StringEscapeUtilsTest.testUnescapeUnknownEntity:283 expected:<&zzzz;> but was:<null>
  StringEscapeUtilsTest.testUnescapeXmlSupplementaryCharacters:418 Supplementary character must be represented using a single escape expected:<𣎴> but was:<null>
  StringUtilsTest.testEscapeSurrogatePairs:2351 expected:<😰> but was:<null>
  StringUtilsTest.testEscapeSurrogatePairsLang858:2366 expected:<\uDBFF\uDFFD> but was:<null>
  StringUtilsTest.testUnescapeSurrogatePairs:2372 expected:<😰> but was:<null>
  NumericEntityEscaperTest.testAbove:54 Failed to escape numeric entities via the above method expected:<ADF&#71;&#90;> but was:<null>
  NumericEntityEscaperTest.testBelow:36 Failed to escape numeric entities via the below method expected:<&#65;&#68;FGZ> but was:<null>
  NumericEntityEscaperTest.testBetween:45 Failed to escape numeric entities via the between method expected:<AD&#70;&#71;Z> but was:<null>
  NumericEntityEscaperTest.testSupplementary:65 Failed to escape numeric entities supplementary characters expected:<&#68642;> but was:<null>
  NumericEntityUnescaperTest.testOutOfBounds:45 Failed to ignore when last character is & expected:<Test &> but was:<null>
  NumericEntityUnescaperTest.testSupplementaryUnescaping:38 Failed to unescape numeric entities supplementary characters expected:<𐰢> but was:<null>
  NumericEntityUnescaperTest.testUnfinishedEntity:59 Failed to support unfinished entities (i.e. missing semi-colon) expected:<Test 0 not test> but was:<null>
  OctalUnescaperTest.testBetween:35 Failed to unescape octal characters via the between method expected:<%> but was:<null>
  UnicodeEscaperTest.testAbove:54 Failed to escape Unicode characters via the above method expected:<ADF\u0047\u005A> but was:<null>
  UnicodeEscaperTest.testBelow:36 Failed to escape Unicode characters via the below method expected:<\u0041\u0044FGZ> but was:<null>
  UnicodeEscaperTest.testBetween:45 Failed to escape Unicode characters via the between method expected:<AD\u0046\u0047Z> but was:<null>
  UnicodeUnescaperTest.testLessThanFour:56 A lack of digits in a Unicode escape sequence failed to throw an exception
  UnicodeUnescaperTest.testUPlus:37 Failed to unescape Unicode characters with 'u+' notation expected:<G> but was:<null>
  UnicodeUnescaperTest.testUuuuu:46 Failed to unescape Unicode characters with many 'u' characters expected:<G> but was:<null>

Tests in error: 
  StringEscapeUtilsTest.testEscapeEcmaScript:182 » NullPointer
  StringEscapeUtilsTest.testEscapeJava:57 » NullPointer
  StringEscapeUtilsTest.testEscapeJson:594 » NullPointer
  StringEscapeUtilsTest.testLang708:564 NullPointer
  StringEscapeUtilsTest.testLang911:588 » NullPointer
  StringEscapeUtilsTest.testUnescapeJava:126 » NullPointer


Tests run: 3526, Failures: 36, Errors: 6, Skipped: 97

[INFO] ------------------------------------------------------------------------
[INFO] BUILD FAILURE
[INFO] ------------------------------------------------------------------------
[INFO] Total time: 37.373s
[INFO] Finished at: Wed Aug 05 04:53:36 BST 2015
[INFO] Final Memory: 28M/580M
[INFO] ------------------------------------------------------------------------
[ERROR] Failed to execute goal org.apache.maven.plugins:maven-surefire-plugin:2.18:test (default-test) on project commons-lang3: There are test failures.
[ERROR] 
[ERROR] Please refer to /home/perham/Study/LittleDarwin/Cases/commons-lang3-3.4-src/target/surefire-reports for the individual test results.
[ERROR] -> [Help 1]
[ERROR] 
[ERROR] To see the full stack trace of the errors, re-run Maven with the -e switch.
[ERROR] Re-run Maven using the -X switch to enable full debug logging.
[ERROR] 
[ERROR] For more information about the errors and possible solutions, please read the following articles:
[ERROR] [Help 1] http://cwiki.apache.org/confluence/display/MAVEN/MojoFailureException
