[INFO] Scanning for projects...
[INFO]                                                                         
[INFO] ------------------------------------------------------------------------
[INFO] Building Apache Commons Lang 3.4
[INFO] ------------------------------------------------------------------------
[INFO] 
[INFO] --- maven-enforcer-plugin:1.3.1:enforce (enforce-maven-3) @ commons-lang3 ---
[INFO] 
[INFO] --- build-helper-maven-plugin:1.8:parse-version (parse-version) @ commons-lang3 ---
[INFO] 
[INFO] --- maven-antrun-plugin:1.8:run (javadoc.resources) @ commons-lang3 ---
[INFO] Executing tasks

main:
[INFO] Executed tasks
[INFO] 
[INFO] --- maven-remote-resources-plugin:1.5:process (default) @ commons-lang3 ---
[INFO] 
[INFO] --- buildnumber-maven-plugin:1.3:create (default) @ commons-lang3 ---
[INFO] Executing: /bin/sh -c cd /home/perham/Study/LittleDarwin/Cases/commons-lang3-3.4-src && svn --non-interactive info
[INFO] Working directory: /home/perham/Study/LittleDarwin/Cases/commons-lang3-3.4-src
[INFO] Storing buildNumber: ?????? at timestamp: 1438746217415
[INFO] Executing: /bin/sh -c cd /home/perham/Study/LittleDarwin/Cases/commons-lang3-3.4-src && svn --non-interactive info
[INFO] Working directory: /home/perham/Study/LittleDarwin/Cases/commons-lang3-3.4-src
[INFO] Storing buildScmBranch: UNKNOWN_BRANCH
[INFO] 
[INFO] --- maven-resources-plugin:2.7:resources (default-resources) @ commons-lang3 ---
[INFO] Using 'ISO-8859-1' encoding to copy filtered resources.
[INFO] Copying 0 resource
[INFO] Copying 2 resources to META-INF
[INFO] 
[INFO] --- maven-compiler-plugin:3.2:compile (default-compile) @ commons-lang3 ---
[INFO] Changes detected - recompiling the module!
[INFO] Compiling 133 source files to /home/perham/Study/LittleDarwin/Cases/commons-lang3-3.4-src/target/classes
[INFO] /home/perham/Study/LittleDarwin/Cases/commons-lang3-3.4-src/src/main/java/org/apache/commons/lang3/SerializationUtils.java: /home/perham/Study/LittleDarwin/Cases/commons-lang3-3.4-src/src/main/java/org/apache/commons/lang3/SerializationUtils.java uses unchecked or unsafe operations.
[INFO] /home/perham/Study/LittleDarwin/Cases/commons-lang3-3.4-src/src/main/java/org/apache/commons/lang3/SerializationUtils.java: Recompile with -Xlint:unchecked for details.
[INFO] 
[INFO] --- maven-bundle-plugin:2.5.3:manifest (bundle-manifest) @ commons-lang3 ---
[INFO] 
[INFO] --- animal-sniffer-maven-plugin:1.13:check (checkAPIcompatibility) @ commons-lang3 ---
[INFO] Checking unresolved references to org.codehaus.mojo.signature:java16:1.0
[INFO] 
[INFO] --- maven-resources-plugin:2.7:testResources (default-testResources) @ commons-lang3 ---
[INFO] Using 'ISO-8859-1' encoding to copy filtered resources.
[INFO] Copying 2 resources
[INFO] Copying 2 resources to META-INF
[INFO] 
[INFO] --- maven-compiler-plugin:3.2:testCompile (default-testCompile) @ commons-lang3 ---
[INFO] Nothing to compile - all classes are up to date
[INFO] 
[INFO] --- maven-surefire-plugin:2.18:test (default-test) @ commons-lang3 ---
[INFO] Surefire report directory: /home/perham/Study/LittleDarwin/Cases/commons-lang3-3.4-src/target/surefire-reports

-------------------------------------------------------
 T E S T S
-------------------------------------------------------
Running org.apache.commons.lang3.ValidateTest
Tests run: 63, Failures: 0, Errors: 0, Skipped: 0, Time elapsed: 0.052 sec - in org.apache.commons.lang3.ValidateTest
Running org.apache.commons.lang3.LocaleUtilsTest
Tests run: 15, Failures: 0, Errors: 0, Skipped: 0, Time elapsed: 0.03 sec - in org.apache.commons.lang3.LocaleUtilsTest
Running org.apache.commons.lang3.tuple.MutableTripleTest
Tests run: 8, Failures: 0, Errors: 0, Skipped: 0, Time elapsed: 0.001 sec - in org.apache.commons.lang3.tuple.MutableTripleTest
Running org.apache.commons.lang3.tuple.TripleTest
Tests run: 10, Failures: 0, Errors: 0, Skipped: 0, Time elapsed: 0.005 sec - in org.apache.commons.lang3.tuple.TripleTest
Running org.apache.commons.lang3.tuple.ImmutablePairTest
Tests run: 6, Failures: 0, Errors: 0, Skipped: 0, Time elapsed: 0 sec - in org.apache.commons.lang3.tuple.ImmutablePairTest
Running org.apache.commons.lang3.tuple.MutablePairTest
Tests run: 8, Failures: 0, Errors: 0, Skipped: 0, Time elapsed: 0 sec - in org.apache.commons.lang3.tuple.MutablePairTest
Running org.apache.commons.lang3.tuple.ImmutableTripleTest
Tests run: 6, Failures: 0, Errors: 0, Skipped: 0, Time elapsed: 0 sec - in org.apache.commons.lang3.tuple.ImmutableTripleTest
Running org.apache.commons.lang3.tuple.PairTest
Tests run: 9, Failures: 0, Errors: 0, Skipped: 0, Time elapsed: 0.001 sec - in org.apache.commons.lang3.tuple.PairTest
Running org.apache.commons.lang3.StringUtilsIsTest
Tests run: 8, Failures: 0, Errors: 0, Skipped: 0, Time elapsed: 0.033 sec - in org.apache.commons.lang3.StringUtilsIsTest
Running org.apache.commons.lang3.JavaVersionTest
Tests run: 3, Failures: 0, Errors: 0, Skipped: 0, Time elapsed: 0.001 sec - in org.apache.commons.lang3.JavaVersionTest
Running org.apache.commons.lang3.builder.NoFieldNamesToStringStyleTest
Tests run: 8, Failures: 0, Errors: 0, Skipped: 0, Time elapsed: 0.024 sec - in org.apache.commons.lang3.builder.NoFieldNamesToStringStyleTest
Running org.apache.commons.lang3.builder.ShortPrefixToStringStyleTest
Tests run: 8, Failures: 0, Errors: 0, Skipped: 0, Time elapsed: 0.003 sec - in org.apache.commons.lang3.builder.ShortPrefixToStringStyleTest
Running org.apache.commons.lang3.builder.DiffResultTest
Tests run: 9, Failures: 0, Errors: 0, Skipped: 0, Time elapsed: 0.01 sec - in org.apache.commons.lang3.builder.DiffResultTest
Running org.apache.commons.lang3.builder.CompareToBuilderTest
Tests run: 48, Failures: 0, Errors: 0, Skipped: 0, Time elapsed: 0.025 sec - in org.apache.commons.lang3.builder.CompareToBuilderTest
Running org.apache.commons.lang3.builder.MultilineRecursiveToStringStyleTest
Tests run: 10, Failures: 0, Errors: 0, Skipped: 0, Time elapsed: 0.003 sec - in org.apache.commons.lang3.builder.MultilineRecursiveToStringStyleTest
Running org.apache.commons.lang3.builder.RecursiveToStringStyleTest
Tests run: 8, Failures: 0, Errors: 0, Skipped: 0, Time elapsed: 0.007 sec - in org.apache.commons.lang3.builder.RecursiveToStringStyleTest
Running org.apache.commons.lang3.builder.DefaultToStringStyleTest
Tests run: 8, Failures: 0, Errors: 0, Skipped: 0, Time elapsed: 0.002 sec - in org.apache.commons.lang3.builder.DefaultToStringStyleTest
Running org.apache.commons.lang3.builder.ReflectionToStringBuilderExcludeTest
Tests run: 11, Failures: 0, Errors: 0, Skipped: 0, Time elapsed: 0.005 sec - in org.apache.commons.lang3.builder.ReflectionToStringBuilderExcludeTest
Running org.apache.commons.lang3.builder.StandardToStringStyleTest
Tests run: 8, Failures: 0, Errors: 0, Skipped: 0, Time elapsed: 0.004 sec - in org.apache.commons.lang3.builder.StandardToStringStyleTest
Running org.apache.commons.lang3.builder.ToStringStyleTest
Tests run: 12, Failures: 0, Errors: 0, Skipped: 0, Time elapsed: 0.004 sec - in org.apache.commons.lang3.builder.ToStringStyleTest
Running org.apache.commons.lang3.builder.DiffTest
Tests run: 4, Failures: 0, Errors: 0, Skipped: 0, Time elapsed: 0 sec - in org.apache.commons.lang3.builder.DiffTest
Running org.apache.commons.lang3.builder.SimpleToStringStyleTest
Tests run: 8, Failures: 0, Errors: 0, Skipped: 0, Time elapsed: 0.004 sec - in org.apache.commons.lang3.builder.SimpleToStringStyleTest
Running org.apache.commons.lang3.builder.MultiLineToStringStyleTest
Tests run: 8, Failures: 0, Errors: 0, Skipped: 0, Time elapsed: 0.012 sec - in org.apache.commons.lang3.builder.MultiLineToStringStyleTest
Running org.apache.commons.lang3.builder.ToStringStyleConcurrencyTest
Tests run: 3, Failures: 0, Errors: 0, Skipped: 0, Time elapsed: 4.788 sec - in org.apache.commons.lang3.builder.ToStringStyleConcurrencyTest
Running org.apache.commons.lang3.builder.ReflectionToStringBuilderMutateInspectConcurrencyTest
Tests run: 1, Failures: 0, Errors: 0, Skipped: 1, Time elapsed: 0.004 sec - in org.apache.commons.lang3.builder.ReflectionToStringBuilderMutateInspectConcurrencyTest
Running org.apache.commons.lang3.builder.ToStringBuilderTest
Tests run: 74, Failures: 0, Errors: 0, Skipped: 1, Time elapsed: 0.05 sec - in org.apache.commons.lang3.builder.ToStringBuilderTest
Running org.apache.commons.lang3.builder.EqualsBuilderTest
Tests run: 48, Failures: 0, Errors: 0, Skipped: 0, Time elapsed: 0.024 sec - in org.apache.commons.lang3.builder.EqualsBuilderTest
Running org.apache.commons.lang3.builder.HashCodeBuilderAndEqualsBuilderTest
Tests run: 4, Failures: 0, Errors: 0, Skipped: 0, Time elapsed: 0.013 sec - in org.apache.commons.lang3.builder.HashCodeBuilderAndEqualsBuilderTest
Running org.apache.commons.lang3.builder.ReflectionToStringBuilderConcurrencyTest
Tests run: 3, Failures: 0, Errors: 0, Skipped: 3, Time elapsed: 0.002 sec - in org.apache.commons.lang3.builder.ReflectionToStringBuilderConcurrencyTest
Running org.apache.commons.lang3.builder.JsonToStringStyleTest
Tests run: 9, Failures: 0, Errors: 0, Skipped: 0, Time elapsed: 0.006 sec - in org.apache.commons.lang3.builder.JsonToStringStyleTest
Running org.apache.commons.lang3.builder.NoClassNameToStringStyleTest
Tests run: 8, Failures: 0, Errors: 0, Skipped: 0, Time elapsed: 0.006 sec - in org.apache.commons.lang3.builder.NoClassNameToStringStyleTest
Running org.apache.commons.lang3.builder.DiffBuilderTest
Tests run: 30, Failures: 0, Errors: 0, Skipped: 0, Time elapsed: 0.029 sec - in org.apache.commons.lang3.builder.DiffBuilderTest
Running org.apache.commons.lang3.builder.HashCodeBuilderTest
Tests run: 44, Failures: 0, Errors: 0, Skipped: 0, Time elapsed: 0.014 sec - in org.apache.commons.lang3.builder.HashCodeBuilderTest
Running org.apache.commons.lang3.concurrent.AtomicInitializerTest
Tests run: 3, Failures: 0, Errors: 0, Skipped: 0, Time elapsed: 0.009 sec - in org.apache.commons.lang3.concurrent.AtomicInitializerTest
Running org.apache.commons.lang3.concurrent.CallableBackgroundInitializerTest
Tests run: 4, Failures: 0, Errors: 0, Skipped: 0, Time elapsed: 0.002 sec - in org.apache.commons.lang3.concurrent.CallableBackgroundInitializerTest
Running org.apache.commons.lang3.concurrent.BackgroundInitializerTest
Tests run: 15, Failures: 0, Errors: 0, Skipped: 0, Time elapsed: 0.014 sec - in org.apache.commons.lang3.concurrent.BackgroundInitializerTest
Running org.apache.commons.lang3.concurrent.LazyInitializerTest
Tests run: 3, Failures: 0, Errors: 0, Skipped: 0, Time elapsed: 0.007 sec - in org.apache.commons.lang3.concurrent.LazyInitializerTest
Running org.apache.commons.lang3.concurrent.BasicThreadFactoryTest
Tests run: 15, Failures: 0, Errors: 0, Skipped: 0, Time elapsed: 0.037 sec - in org.apache.commons.lang3.concurrent.BasicThreadFactoryTest
Running org.apache.commons.lang3.concurrent.ConstantInitializerTest
Tests run: 7, Failures: 0, Errors: 0, Skipped: 0, Time elapsed: 0.001 sec - in org.apache.commons.lang3.concurrent.ConstantInitializerTest
Running org.apache.commons.lang3.concurrent.MultiBackgroundInitializerTest
Tests run: 17, Failures: 0, Errors: 0, Skipped: 0, Time elapsed: 0.06 sec - in org.apache.commons.lang3.concurrent.MultiBackgroundInitializerTest
Running org.apache.commons.lang3.concurrent.AtomicSafeInitializerTest
Tests run: 4, Failures: 0, Errors: 0, Skipped: 0, Time elapsed: 0.006 sec - in org.apache.commons.lang3.concurrent.AtomicSafeInitializerTest
Running org.apache.commons.lang3.concurrent.ConcurrentUtilsTest
Tests run: 40, Failures: 0, Errors: 0, Skipped: 0, Time elapsed: 0.014 sec - in org.apache.commons.lang3.concurrent.ConcurrentUtilsTest
Running org.apache.commons.lang3.concurrent.TimedSemaphoreTest
Tests run: 15, Failures: 0, Errors: 0, Skipped: 0, Time elapsed: 1.172 sec - in org.apache.commons.lang3.concurrent.TimedSemaphoreTest
Running org.apache.commons.lang3.StringUtilsSubstringTest
Tests run: 14, Failures: 0, Errors: 0, Skipped: 0, Time elapsed: 0.003 sec - in org.apache.commons.lang3.StringUtilsSubstringTest
Running org.apache.commons.lang3.SystemUtilsTest
Tests run: 12, Failures: 0, Errors: 0, Skipped: 0, Time elapsed: 0.002 sec - in org.apache.commons.lang3.SystemUtilsTest
Running org.apache.commons.lang3.CharRangeTest
Tests run: 16, Failures: 0, Errors: 0, Skipped: 0, Time elapsed: 0.038 sec - in org.apache.commons.lang3.CharRangeTest
Running org.apache.commons.lang3.CharSetTest
Tests run: 14, Failures: 0, Errors: 0, Skipped: 0, Time elapsed: 0.01 sec - in org.apache.commons.lang3.CharSetTest
Running org.apache.commons.lang3.StringUtilsStartsEndsWithTest
Tests run: 6, Failures: 0, Errors: 0, Skipped: 0, Time elapsed: 0.003 sec - in org.apache.commons.lang3.StringUtilsStartsEndsWithTest
Running org.apache.commons.lang3.RandomStringUtilsTest
Tests run: 11, Failures: 0, Errors: 0, Skipped: 0, Time elapsed: 0.039 sec - in org.apache.commons.lang3.RandomStringUtilsTest
Running org.apache.commons.lang3.SerializationUtilsTest
Tests run: 26, Failures: 0, Errors: 0, Skipped: 0, Time elapsed: 0.052 sec - in org.apache.commons.lang3.SerializationUtilsTest
Running org.apache.commons.lang3.time.StopWatchTest
Tests run: 8, Failures: 0, Errors: 0, Skipped: 0, Time elapsed: 4.762 sec - in org.apache.commons.lang3.time.StopWatchTest
Running org.apache.commons.lang3.time.DateUtilsRoundingTest
Tests run: 22, Failures: 0, Errors: 0, Skipped: 0, Time elapsed: 0.19 sec - in org.apache.commons.lang3.time.DateUtilsRoundingTest
Running org.apache.commons.lang3.time.FastDateParserTest
Tests run: 33, Failures: 0, Errors: 0, Skipped: 0, Time elapsed: 2.414 sec - in org.apache.commons.lang3.time.FastDateParserTest
Running org.apache.commons.lang3.time.FastDateFormat_ParserTest
Tests run: 33, Failures: 0, Errors: 0, Skipped: 0, Time elapsed: 0.777 sec - in org.apache.commons.lang3.time.FastDateFormat_ParserTest
Running org.apache.commons.lang3.time.DurationFormatUtilsTest
Tests run: 25, Failures: 0, Errors: 0, Skipped: 0, Time elapsed: 0.868 sec - in org.apache.commons.lang3.time.DurationFormatUtilsTest
Running org.apache.commons.lang3.time.DateFormatUtilsTest
Tests run: 10, Failures: 0, Errors: 0, Skipped: 0, Time elapsed: 0.003 sec - in org.apache.commons.lang3.time.DateFormatUtilsTest
Running org.apache.commons.lang3.time.DateUtilsFragmentTest
Tests run: 57, Failures: 0, Errors: 0, Skipped: 0, Time elapsed: 0.011 sec - in org.apache.commons.lang3.time.DateUtilsFragmentTest
Running org.apache.commons.lang3.time.FastDatePrinterTimeZonesTest
Tests run: 617, Failures: 0, Errors: 0, Skipped: 0, Time elapsed: 0.273 sec - in org.apache.commons.lang3.time.FastDatePrinterTimeZonesTest
Running org.apache.commons.lang3.time.FastDateFormatTest
>>FastDateFormatTest: FastDateParser:20437  SimpleDateFormat:3971
Tests run: 14, Failures: 0, Errors: 0, Skipped: 0, Time elapsed: 2.742 sec - in org.apache.commons.lang3.time.FastDateFormatTest
Running org.apache.commons.lang3.time.FastDateFormat_PrinterTest
Tests run: 17, Failures: 0, Errors: 0, Skipped: 0, Time elapsed: 0.008 sec - in org.apache.commons.lang3.time.FastDateFormat_PrinterTest
Running org.apache.commons.lang3.time.FastDatePrinterTest
Tests run: 17, Failures: 0, Errors: 0, Skipped: 0, Time elapsed: 0.005 sec - in org.apache.commons.lang3.time.FastDatePrinterTest
Running org.apache.commons.lang3.time.FastDateParserSDFTest
Tests run: 276, Failures: 0, Errors: 0, Skipped: 92, Time elapsed: 0.08 sec - in org.apache.commons.lang3.time.FastDateParserSDFTest
Running org.apache.commons.lang3.time.DateUtilsTest
DateUtilsTest: Default Locale=en_US
Tests run: 38, Failures: 0, Errors: 0, Skipped: 0, Time elapsed: 0.031 sec - in org.apache.commons.lang3.time.DateUtilsTest
Running org.apache.commons.lang3.reflect.InheritanceUtilsTest
Tests run: 9, Failures: 0, Errors: 0, Skipped: 0, Time elapsed: 0.008 sec - in org.apache.commons.lang3.reflect.InheritanceUtilsTest
Running org.apache.commons.lang3.reflect.MethodUtilsTest
Tests run: 23, Failures: 0, Errors: 0, Skipped: 0, Time elapsed: 0.047 sec - in org.apache.commons.lang3.reflect.MethodUtilsTest
Running org.apache.commons.lang3.reflect.ConstructorUtilsTest
Tests run: 7, Failures: 0, Errors: 0, Skipped: 0, Time elapsed: 0.009 sec - in org.apache.commons.lang3.reflect.ConstructorUtilsTest
Running org.apache.commons.lang3.reflect.FieldUtilsTest
Tests run: 64, Failures: 0, Errors: 0, Skipped: 0, Time elapsed: 0.049 sec - in org.apache.commons.lang3.reflect.FieldUtilsTest
Running org.apache.commons.lang3.reflect.TypeLiteralTest
Tests run: 4, Failures: 0, Errors: 0, Skipped: 0, Time elapsed: 0.011 sec - in org.apache.commons.lang3.reflect.TypeLiteralTest
Running org.apache.commons.lang3.reflect.TypeUtilsTest
Tests run: 19, Failures: 0, Errors: 0, Skipped: 0, Time elapsed: 0.048 sec - in org.apache.commons.lang3.reflect.TypeUtilsTest
Running org.apache.commons.lang3.mutable.MutableByteTest
Tests run: 17, Failures: 0, Errors: 0, Skipped: 0, Time elapsed: 0.009 sec - in org.apache.commons.lang3.mutable.MutableByteTest
Running org.apache.commons.lang3.mutable.MutableShortTest
Tests run: 14, Failures: 0, Errors: 0, Skipped: 0, Time elapsed: 0.007 sec - in org.apache.commons.lang3.mutable.MutableShortTest
Running org.apache.commons.lang3.mutable.MutableIntTest
Tests run: 17, Failures: 0, Errors: 0, Skipped: 0, Time elapsed: 0.01 sec - in org.apache.commons.lang3.mutable.MutableIntTest
Running org.apache.commons.lang3.mutable.MutableDoubleTest
Tests run: 18, Failures: 0, Errors: 0, Skipped: 0, Time elapsed: 0.01 sec - in org.apache.commons.lang3.mutable.MutableDoubleTest
Running org.apache.commons.lang3.mutable.MutableFloatTest
Tests run: 18, Failures: 0, Errors: 0, Skipped: 0, Time elapsed: 0.009 sec - in org.apache.commons.lang3.mutable.MutableFloatTest
Running org.apache.commons.lang3.mutable.MutableLongTest
Tests run: 17, Failures: 0, Errors: 0, Skipped: 0, Time elapsed: 0.006 sec - in org.apache.commons.lang3.mutable.MutableLongTest
Running org.apache.commons.lang3.mutable.MutableBooleanTest
Tests run: 9, Failures: 0, Errors: 0, Skipped: 0, Time elapsed: 0.004 sec - in org.apache.commons.lang3.mutable.MutableBooleanTest
Running org.apache.commons.lang3.mutable.MutableObjectTest
Tests run: 5, Failures: 0, Errors: 0, Skipped: 0, Time elapsed: 0.002 sec - in org.apache.commons.lang3.mutable.MutableObjectTest
Running org.apache.commons.lang3.text.translate.UnicodeEscaperTest
Tests run: 3, Failures: 0, Errors: 0, Skipped: 0, Time elapsed: 0.001 sec - in org.apache.commons.lang3.text.translate.UnicodeEscaperTest
Running org.apache.commons.lang3.text.translate.EntityArraysTest
Tests run: 3, Failures: 0, Errors: 0, Skipped: 0, Time elapsed: 0.001 sec - in org.apache.commons.lang3.text.translate.EntityArraysTest
Running org.apache.commons.lang3.text.translate.UnicodeUnpairedSurrogateRemoverTest
Tests run: 2, Failures: 0, Errors: 0, Skipped: 0, Time elapsed: 0.001 sec - in org.apache.commons.lang3.text.translate.UnicodeUnpairedSurrogateRemoverTest
Running org.apache.commons.lang3.text.translate.NumericEntityUnescaperTest
Tests run: 3, Failures: 0, Errors: 0, Skipped: 0, Time elapsed: 0.001 sec - in org.apache.commons.lang3.text.translate.NumericEntityUnescaperTest
Running org.apache.commons.lang3.text.translate.NumericEntityEscaperTest
Tests run: 4, Failures: 0, Errors: 0, Skipped: 0, Time elapsed: 0.002 sec - in org.apache.commons.lang3.text.translate.NumericEntityEscaperTest
Running org.apache.commons.lang3.text.translate.LookupTranslatorTest
Tests run: 2, Failures: 0, Errors: 0, Skipped: 0, Time elapsed: 0 sec - in org.apache.commons.lang3.text.translate.LookupTranslatorTest
Running org.apache.commons.lang3.text.translate.UnicodeUnescaperTest
Tests run: 3, Failures: 0, Errors: 0, Skipped: 0, Time elapsed: 0.001 sec - in org.apache.commons.lang3.text.translate.UnicodeUnescaperTest
Running org.apache.commons.lang3.text.translate.OctalUnescaperTest
Tests run: 1, Failures: 0, Errors: 0, Skipped: 0, Time elapsed: 0 sec - in org.apache.commons.lang3.text.translate.OctalUnescaperTest
Running org.apache.commons.lang3.text.StrMatcherTest
Tests run: 14, Failures: 0, Errors: 0, Skipped: 0, Time elapsed: 0.003 sec - in org.apache.commons.lang3.text.StrMatcherTest
Running org.apache.commons.lang3.text.StrTokenizerTest
Tests run: 55, Failures: 0, Errors: 0, Skipped: 0, Time elapsed: 0.014 sec - in org.apache.commons.lang3.text.StrTokenizerTest
Running org.apache.commons.lang3.text.FormattableUtilsTest
Tests run: 5, Failures: 0, Errors: 0, Skipped: 0, Time elapsed: 0 sec - in org.apache.commons.lang3.text.FormattableUtilsTest
Running org.apache.commons.lang3.text.CompositeFormatTest
Tests run: 2, Failures: 0, Errors: 0, Skipped: 0, Time elapsed: 0 sec - in org.apache.commons.lang3.text.CompositeFormatTest
Running org.apache.commons.lang3.text.WordUtilsTest
Tests run: 12, Failures: 0, Errors: 0, Skipped: 0, Time elapsed: 0.005 sec - in org.apache.commons.lang3.text.WordUtilsTest
Running org.apache.commons.lang3.text.StrLookupTest
Tests run: 5, Failures: 0, Errors: 0, Skipped: 0, Time elapsed: 0.002 sec - in org.apache.commons.lang3.text.StrLookupTest
Running org.apache.commons.lang3.text.StrBuilderAppendInsertTest
Tests run: 51, Failures: 0, Errors: 0, Skipped: 0, Time elapsed: 0.015 sec - in org.apache.commons.lang3.text.StrBuilderAppendInsertTest
Running org.apache.commons.lang3.text.ExtendedMessageFormatTest
Tests run: 10, Failures: 0, Errors: 0, Skipped: 0, Time elapsed: 0.915 sec - in org.apache.commons.lang3.text.ExtendedMessageFormatTest
Running org.apache.commons.lang3.text.StrSubstitutorTest
Tests run: 40, Failures: 0, Errors: 0, Skipped: 0, Time elapsed: 0.038 sec - in org.apache.commons.lang3.text.StrSubstitutorTest
Running org.apache.commons.lang3.text.StrBuilderTest
Tests run: 90, Failures: 0, Errors: 0, Skipped: 0, Time elapsed: 0.054 sec - in org.apache.commons.lang3.text.StrBuilderTest
Running org.apache.commons.lang3.StringEscapeUtilsTest
Tests run: 28, Failures: 17, Errors: 0, Skipped: 0, Time elapsed: 0.063 sec <<< FAILURE! - in org.apache.commons.lang3.StringEscapeUtilsTest
testEscapeXmlAllCharacters(org.apache.commons.lang3.StringEscapeUtilsTest)  Time elapsed: 0.007 sec  <<< FAILURE!
org.junit.ComparisonFailure: expected:<[&#0;&#1;&#2;&#3;&#4;&#5;&#6;&#7;&#8;]> but was:<[ ]>
	at org.junit.Assert.assertEquals(Assert.java:115)
	at org.junit.Assert.assertEquals(Assert.java:144)
	at org.apache.commons.lang3.StringEscapeUtilsTest.testEscapeXmlAllCharacters(StringEscapeUtilsTest.java:402)

testUnescapeJava(org.apache.commons.lang3.StringEscapeUtilsTest)  Time elapsed: 0.001 sec  <<< FAILURE!
java.lang.AssertionError: null
	at org.junit.Assert.fail(Assert.java:86)
	at org.junit.Assert.fail(Assert.java:95)
	at org.apache.commons.lang3.StringEscapeUtilsTest.testUnescapeJava(StringEscapeUtilsTest.java:143)

testStandaloneAmphersand(org.apache.commons.lang3.StringEscapeUtilsTest)  Time elapsed: 0.001 sec  <<< FAILURE!
org.junit.ComparisonFailure: expected:<<[P&O>]> but was:<<[&lt;P&O>&gt;]>
	at org.junit.Assert.assertEquals(Assert.java:115)
	at org.junit.Assert.assertEquals(Assert.java:144)
	at org.apache.commons.lang3.StringEscapeUtilsTest.testStandaloneAmphersand(StringEscapeUtilsTest.java:429)

testUnescapeHtml4(org.apache.commons.lang3.StringEscapeUtilsTest)  Time elapsed: 0 sec  <<< FAILURE!
org.junit.ComparisonFailure: ampersand expected:<bread &[] butter> but was:<bread &[&amp;] butter>
	at org.junit.Assert.assertEquals(Assert.java:115)
	at org.apache.commons.lang3.StringEscapeUtilsTest.testUnescapeHtml4(StringEscapeUtilsTest.java:244)

testEscapeHtml(org.apache.commons.lang3.StringEscapeUtilsTest)  Time elapsed: 0 sec  <<< FAILURE!
org.junit.ComparisonFailure: ampersand expected:<bread &amp;[] butter> but was:<bread &amp;[&] butter>
	at org.junit.Assert.assertEquals(Assert.java:115)
	at org.apache.commons.lang3.StringEscapeUtilsTest.testEscapeHtml(StringEscapeUtilsTest.java:227)

testEscapeJava(org.apache.commons.lang3.StringEscapeUtilsTest)  Time elapsed: 0.001 sec  <<< FAILURE!
org.junit.ComparisonFailure: escapeJava(String) failed: tab expected:<[\t]> but was:<[	]>
	at org.junit.Assert.assertEquals(Assert.java:115)
	at org.apache.commons.lang3.StringEscapeUtilsTest.assertEscapeJava(StringEscapeUtilsTest.java:117)
	at org.apache.commons.lang3.StringEscapeUtilsTest.testEscapeJava(StringEscapeUtilsTest.java:75)

testEscapeJson(org.apache.commons.lang3.StringEscapeUtilsTest)  Time elapsed: 0.001 sec  <<< FAILURE!
org.junit.ComparisonFailure: expected:<He didn't say, \"[stop!\]"> but was:<He didn't say, \"["stop!\"]">
	at org.junit.Assert.assertEquals(Assert.java:115)
	at org.junit.Assert.assertEquals(Assert.java:144)
	at org.apache.commons.lang3.StringEscapeUtilsTest.testEscapeJson(StringEscapeUtilsTest.java:610)

testEscapeXml10(org.apache.commons.lang3.StringEscapeUtilsTest)  Time elapsed: 0.001 sec  <<< FAILURE!
org.junit.ComparisonFailure: expected:<a&lt;[b&gt;c&quot;d&apos;e&amp;]f> but was:<a&lt;[<b&gt;>c&quot;"d'e&amp;&]f>
	at org.junit.Assert.assertEquals(Assert.java:115)
	at org.junit.Assert.assertEquals(Assert.java:144)
	at org.apache.commons.lang3.StringEscapeUtilsTest.testEscapeXml10(StringEscapeUtilsTest.java:334)

testEscapeXml11(org.apache.commons.lang3.StringEscapeUtilsTest)  Time elapsed: 0.001 sec  <<< FAILURE!
org.junit.ComparisonFailure: expected:<a&lt;[b&gt;c&quot;d&apos;e&amp;]f> but was:<a&lt;[<b&gt;>c&quot;"d'e&amp;&]f>
	at org.junit.Assert.assertEquals(Assert.java:115)
	at org.junit.Assert.assertEquals(Assert.java:144)
	at org.apache.commons.lang3.StringEscapeUtilsTest.testEscapeXml11(StringEscapeUtilsTest.java:349)

testEscapeXmlSupplementaryCharacters(org.apache.commons.lang3.StringEscapeUtilsTest)  Time elapsed: 0.001 sec  <<< FAILURE!
org.junit.ComparisonFailure: Supplementary character must be represented using a single escape expected:<[&#144308;]> but was:<[𣎴]>
	at org.junit.Assert.assertEquals(Assert.java:115)
	at org.apache.commons.lang3.StringEscapeUtilsTest.testEscapeXmlSupplementaryCharacters(StringEscapeUtilsTest.java:385)

testLang313(org.apache.commons.lang3.StringEscapeUtilsTest)  Time elapsed: 0.001 sec  <<< FAILURE!
org.junit.ComparisonFailure: expected:<& &[]> but was:<& &[&amp;]>
	at org.junit.Assert.assertEquals(Assert.java:115)
	at org.junit.Assert.assertEquals(Assert.java:144)
	at org.apache.commons.lang3.StringEscapeUtilsTest.testLang313(StringEscapeUtilsTest.java:437)

testLang708(org.apache.commons.lang3.StringEscapeUtilsTest)  Time elapsed: 0.028 sec  <<< FAILURE!
java.lang.AssertionError: [{\""geonameFeatureClass\"":\""L\"",\""values\"":{\""eu\"":\""Mundua\"",\""ro\"":\""Pamânt\"",\""it\"":\""Globo\"",\""ca\"":\""el món\"",\""tr\"":\""Yeryüzü\"",\""no\"":\""Jorden\"",\""hu\"":\""Föld\"",\""lv\"":\""Zeme\"",\""de\"":\""Welt\"",\""el\"":\""Υδρόγειος\"",\""fi\"":\""Maa\"",\""la\"":\""Terra\"",\""fr\"":\""Monde\"",\""eo\"":\""Mondo\"",\""en\"":\""World\"",\""ru\"":\""Земля\"",\""es\"":\""el planeta\"",\""nl\"":\""Aarde\""},\""geonameFeatureCode\"":\""AREA\"",\""_id\"":32,\""name\"":\""\"",\""auto\"":true,\""type\"":\""GEO\"",\""geonameId\"":6295630,\""valueCode\"":\""\""},{\""geonameFeatureClass\"":\""L\"",\""values\"":{\""ro\"":\""Europa\"",\""zh\"":\""欧洲\"",\""ca\"":\""Europa\"",\""vi\"":\""Châu Âu\"",\""tr\"":\""Avrupa\"",\""no\"":\""Europa\"",\""hu\"":\""Európa\"",\""lv\"":\""Eiropa\"",\""hi\"":\""यूरोप\"",\""lt\"":\""Europa\"",\""bs\"":\""Evropa\"",\""ga\"":\""an Eoraip\"",\""th\"":\""ยุโรป\"",\""id\"":\""Eropa\"",\""de\"":\""Europa\"",\""fi\"":\""Eurooppa\"",\""fr\"":\""Europe\"",\""sv\"":\""Europa\"",\""bg\"":\""Европа\"",\""da\"":\""Europa\"",\""eu\"":\""Europa\"",\""is\"":\""Evrópa\"",\""it\"":\""Europa\"",\""cy\"":\""Ewrop\"",\""ar\"":\""أوروبا\"",\""se\"":\""Eurohpá\"",\""he\"":\""אירופה\"",\""cs\"":\""Evropa\"",\""el\"":\""Ευρώπη\"",\""nb\"":\""Europa\"",\""pl\"":\""Europa\"",\""la\"":\""Europa\"",\""pt\"":\""Europa\"",\""eo\"":\""Eŭropo\"",\""en\"":\""Europe\"",\""ru\"":\""Европа\"",\""es\"":\""Europa\"",\""ja\"":\""ヨーロッパ\"",\""nl\"":\""Europa\""},\""geonameFeatureCode\"":\""CONT\"",\""_id\"":33,\""name\"":\""\"",\""auto\"":true,\""type\"":\""GEO\"",\""geonameId\"":6255148,\""valueCode\"":\""\""},{\""geonameFeatureClass\"":\""A\"",\""values\"":{\""no\"":\""Spania\"",\""nn\"":\""Spania\"",\""fy\"":\""Spanje\"",\""gd\"":\""An Spàinn\"",\""ga\"":\""An Spáinn\"",\""oc\"":\""Espanha\"",\""arc\"":\""ܐܣܦܢܝܐ\"",\""fi\"":\""Espanja\"",\""fr\"":\""Espagne\"",\""fo\"":\""Spania\"",\""udm\"":\""Испания\"",\""os\"":\""Испани\"",\""he\"":\""ספרד\"",\""gn\"":\""Epaña\"",\""gl\"":\""España\"",\""gv\"":\""Yn Spaainey\"",\""pl\"":\""Hiszpania\"",\""gu\"":\""સ્પેઇન\"",\""lo\"":\""ສະເປນ\"",\""ln\"":\""Espania\"",\""vi\"":\""Tây Ban Nha\"",\""dz\"":\""Spain\"",\""pms\"":\""Spagna\"",\""lv\"":\""Spānija\"",\""lt\"":\""Ispanija\"",\""vo\"":\""Spanyän\"",\""de\"":\""Spanien\"",\""mg\"":\""Espaina\"",\""fur\"":\""Spagne\"",\""mk\"":\""Шпанија\"",\""ml\"":\""സ്പെയ്ന്\\\u200D\"",\""ceb\"":\""Espanya\"",\""mi\"":\""Pāniora\"",\""uk\"":\""Іспанія\"",\""eu\"":\""Espainia\"",\""mr\"":\""स्पेन\"",\""ug\"":\""ئىسپانىيە\"",\""mt\"":\""Spanja\"",\""ms\"":\""Sepanyol\"",\""ur\"":\""سپین\"",\""fa\"":\""اسپانیا\"",\""ty\"":\""Paniora\"",\""new\"":\""स्पेन\"",\""na\"":\""Pain\"",\""el\"":\""Ισπανία\"",\""nb\"":\""Spania\"",\""ne\"":\""स्पेन\"",\""vls\"":\""Spanje\"",\""eo\"":\""Hispanio\"",\""en\"":\""Kingdom of Spain\"",\""et\"":\""Hispaania\"",\""es\"":\""la Madre Patria\"",\""nl\"":\""Spanje\"",\""vec\"":\""Spagna\"",\""to\"":\""Sepeni\"",\""ca\"":\""Espanya\"",\""tl\"":\""Espanya\"",\""tr\"":\""İspanya\"",\""tg\"":\""Испониё\"",\""haw\"":\""Sepania\"",\""bs\"":\""Španija\"",\""br\"":\""Spagn\"",\""th\"":\""ประเทศสเปน\"",\""bn\"":\""স্পেন\"",\""bo\"":\""སི་པན།\"",\""ta\"":\""ஸ்பெயின்\"",\""sv\"":\""Spanien\"",\""bg\"":\""Испания\"",\""ka\"":\""ესპანეთი\"",\""st\"":\""Spain\"",\""sw\"":\""Hispania\"",\""be\"":\""Іспанія\"",\""kw\"":\""Spayn\"",\""sl\"":\""Španija\"",\""sk\"":\""Španielsko\"",\""da\"":\""Spanien\"",\""ang\"":\""Spēonland\"",\""nds\"":\""Spanien\"",\""ks\"":\""Spēna\"",\""so\"":\""Isbeyn\"",\""ku\"":\""Spanya\"",\""sr\"":\""Шпанија\"",\""sq\"":\""Spanja\"",\""ko\"":\""에스파냐\"",\""sc\"":\""Ispagna\"",\""cy\"":\""Sbaen\"",\""se\"":\""Espánjja\"",\""sh\"":\""Španija\"",\""cv\"":\""Испани\"",\""km\"":\""អេស្ប៉ាញ\"",\""cs\"":\""Španělsko\"",\""li\"":\""Spanje\"",\""co\"":\""Spagna\"",\""default\"":\""Spain\"",\""jbo\"":\""sangu\''e\"",\""la\"":\""Hesperia\"",\""ru\"":\""Испания\"",\""lb\"":\""Spuenien\"",\""sco\"":\""Spain\"",\""tet\"":\""España\"",\""scn\"":\""Spagna\"",\""hr\"":\""Španjolska\"",\""zh\"":\""西班牙\"",\""ro\"":\""Spania\"",\""rm\"":\""Spagna\"",\""ht\"":\""Espay\"",\""hu\"":\""Spanyolország\"",\""ast\"":\""España\"",\""hi\"":\""स्पेन\"",\""hsb\"":\""Španiska\"",\""nah\"":\""Caxtillān\"",\""war\"":\""Espanya\"",\""lad\"":\""Espanya\"",\""id\"":\""Spanyol\"",\""ia\"":\""Espania\"",\""nrm\"":\""Espangne\"",\""hy\"":\""Իսպանիա\"",\""qu\"":\""Ispaña\"",\""ilo\"":\""Espania\"",\""az\"":\""İspaniya\"",\""is\"":\""Spánn\"",\""it\"":\""Spagna\"",\""tpi\"":\""Spen\"",\""ar\"":\""أسبانيا\"",\""io\"":\""Hispania\"",\""pam\"":\""Espanya\"",\""frp\"":\""Èspagne\"",\""am\"":\""እስፓንያ\"",\""an\"":\""España\"",\""csb\"":\""Szpańskô\"",\""pt\"":\""Espanha\"",\""ja\"":\""スペイン\"",\""ps\"":\""اسپانيا\"",\""yi\"":\""שפאניע\"",\""af\"":\""Spanje\""},\""geonameFeatureCode\"":\""PCLI\"",\""_id\"":260,\""name\"":\""\"",\""auto\"":true,\""type\"":\""GEO\"",\""geonameId\"":2510769,\""valueCode\"":\""\""},{\""geonameFeatureClass\"":\""A\"",\""values\"":{\""ca\"":\""Andalusia\"",\""tr\"":\""Endülüs\"",\""krc\"":\""Андалусия\"",\""no\"":\""Andalucía\"",\""fy\"":\""Andalûsje\"",\""bs\"":\""Andaluzija\"",\""br\"":\""Andalouzia\"",\""ext\"":\""Andaluzia\"",\""ga\"":\""An Andalúis\"",\""th\"":\""แคว้นอันดาลูซีอา\"",\""bn\"":\""আন্দালুসিয়া\"",\""oc\"":\""Andalosia\"",\""ka\"":\""ანდალუსია\"",\""sv\"":\""Andalusien\"",\""fr\"":\""Andalousie\"",\""bg\"":\""Андалусия\"",\""glk\"":\""آندالوسیا\"",\""be\"":\""Андалусія\"",\""kw\"":\""Andalousi\"",\""sk\"":\""Andalúzia\"",\""os\"":\""Андалуси\"",\""da\"":\""Andalusien\"",\""sr\"":\""Андалузија\"",\""ku\"":\""Endulus\"",\""ko\"":\""안달루시아 지방\"",\""he\"":\""אנדלוסיה\"",\""sh\"":\""Andaluzija\"",\""arz\"":\""اندلوسيا\"",\""cs\"":\""Andalusie\"",\""default\"":\""Andalusia\"",\""stq\"":\""Andalusien\"",\""la\"":\""Vandalitia\"",\""pl\"":\""Andaluzja\"",\""ru\"":\""Андалусия\"",\""lb\"":\""Andalusien\"",\""tet\"":\""Andaluzia\"",\""got\"":\""𐍅𐌰𐌽𐌳𐌰𐌻𐌹𐍄𐌾𐌰\"",\""hr\"":\""Andaluzija\"",\""zh\"":\""安達魯西亞\"",\""ro\"":\""Andaluzia\"",\""hu\"":\""Andalúzia\"",\""pms\"":\""Andalusìa\"",\""lv\"":\""Andalūzija\"",\""lt\"":\""Andalūzija\"",\""nah\"":\""Andalucia\"",\""lad\"":\""Andaluziya\"",\""de\"":\""Andalusien\"",\""als\"":\""Andalusien\"",\""qu\"":\""Andalusiya\"",\""hy\"":\""Անդալուզիա\"",\""eu\"":\""Andaluzia\"",\""is\"":\""Andalúsía\"",\""uk\"":\""Андалусія\"",\""az\"":\""Andalusiya\"",\""mr\"":\""आंदालुसिया\"",\""ug\"":\""Andalusiye\"",\""fa\"":\""اندلس\"",\""ar\"":\""أندلوسيا\"",\""rmy\"":\""Andalusiya\"",\""io\"":\""Andaluzia\"",\""el\"":\""Ανδαλουσία\"",\""frp\"":\""Andalosie\"",\""pt\"":\""Andaluzia\"",\""eo\"":\""Andaluzio\"",\""en\"":\""Andalusia\"",\""et\"":\""Andaluusia\"",\""es\"":\""Andalucía\"",\""ja\"":\""アンダルシア州\"",\""nl\"":\""Andalusië\"",\""af\"":\""Andalusië\"",\""vec\"":\""Andalusìa\""},\""geonameFeatureCode\"":\""ADM1\"",\""_id\"":261,\""name\"":\""\"",\""auto\"":true,\""type\"":\""GEO\"",\""geonameId\"":2593109,\""valueCode\"":\""\""},{\""geonameFeatureClass\"":\""A\"",\""values\"":{\""de\"":\""Granada\"",\""default\"":\""Province of Granada\"",\""fr\"":\""Grenade\"",\""en\"":\""Province of Granada\"",\""es\"":\""Provincia de Granada\"",\""ja\"":\""グラナダ\""},\""geonameFeatureCode\"":\""ADM2\"",\""_id\"":262,\""name\"":\""\"",\""auto\"":true,\""type\"":\""GEO\"",\""geonameId\"":2517115,\""valueCode\"":\""\""},{\""geonameFeatureClass\"":\""A\"",\""values\"":{\""default\"":\""Monachil\""},\""geonameFeatureCode\"":\""ADM3\"",\""_id\"":263,\""name\"":\""\"",\""auto\"":true,\""type\"":\""GEO\"",\""geonameId\"":6357744,\""valueCode\"":\""\""},{\""geonameFeatureClass\"":\""P\"",\""values\"":{\""default\"":\""Sierra Nevada\""},\""geonameFeatureCode\"":\""PPL\"",\""_id\"":264,\""name\"":\""\"",\""auto\"":true,\""type\"":\""GEO\"",\""geonameId\"":6544329,\""valueCode\"":\""\""}]
	at org.junit.Assert.fail(Assert.java:88)
	at org.junit.Assert.assertTrue(Assert.java:41)
	at org.apache.commons.lang3.StringEscapeUtilsTest.testLang708(StringEscapeUtilsTest.java:566)

testEscapeEcmaScript(org.apache.commons.lang3.StringEscapeUtilsTest)  Time elapsed: 0.001 sec  <<< FAILURE!
org.junit.ComparisonFailure: expected:<He didn\'[t say, \"stop!\]"> but was:<He didn\'['t say, \""stop!\"]">
	at org.junit.Assert.assertEquals(Assert.java:115)
	at org.junit.Assert.assertEquals(Assert.java:144)
	at org.apache.commons.lang3.StringEscapeUtilsTest.testEscapeEcmaScript(StringEscapeUtilsTest.java:198)

testUnescapeHexCharsHtml(org.apache.commons.lang3.StringEscapeUtilsTest)  Time elapsed: 0.001 sec  <<< FAILURE!
org.junit.ComparisonFailure: hex number unescape expected:<[]> but was:<[&#x80;&#x9F;]>
	at org.junit.Assert.assertEquals(Assert.java:115)
	at org.apache.commons.lang3.StringEscapeUtilsTest.testUnescapeHexCharsHtml(StringEscapeUtilsTest.java:268)

testUnescapeXmlSupplementaryCharacters(org.apache.commons.lang3.StringEscapeUtilsTest)  Time elapsed: 0 sec  <<< FAILURE!
org.junit.ComparisonFailure: Supplementary character must be represented using a single escape expected:<[𣎴]> but was:<[&#144308;]>
	at org.junit.Assert.assertEquals(Assert.java:115)
	at org.apache.commons.lang3.StringEscapeUtilsTest.testUnescapeXmlSupplementaryCharacters(StringEscapeUtilsTest.java:418)

testEscapeHtmlVersions(org.apache.commons.lang3.StringEscapeUtilsTest)  Time elapsed: 0.001 sec  <<< FAILURE!
org.junit.ComparisonFailure: expected:<[&Beta;]> but was:<[Β]>
	at org.junit.Assert.assertEquals(Assert.java:115)
	at org.junit.Assert.assertEquals(Assert.java:144)
	at org.apache.commons.lang3.StringEscapeUtilsTest.testEscapeHtmlVersions(StringEscapeUtilsTest.java:288)

testEscapeXml(org.apache.commons.lang3.StringEscapeUtilsTest)  Time elapsed: 0.001 sec  <<< FAILURE!
org.junit.ComparisonFailure: expected:<&lt;[abc&gt;]> but was:<&lt;[<abc&gt;>]>
	at org.junit.Assert.assertEquals(Assert.java:115)
	at org.junit.Assert.assertEquals(Assert.java:144)
	at org.apache.commons.lang3.StringEscapeUtilsTest.testEscapeXml(StringEscapeUtilsTest.java:297)

Running org.apache.commons.lang3.AnnotationUtilsTest
Tests run: 10, Failures: 0, Errors: 0, Skipped: 0, Time elapsed: 0.038 sec - in org.apache.commons.lang3.AnnotationUtilsTest
Running org.apache.commons.lang3.ConversionTest
Tests run: 42, Failures: 0, Errors: 0, Skipped: 0, Time elapsed: 0.029 sec - in org.apache.commons.lang3.ConversionTest
Running org.apache.commons.lang3.StringUtilsTrimEmptyTest
Tests run: 15, Failures: 0, Errors: 0, Skipped: 0, Time elapsed: 0 sec - in org.apache.commons.lang3.StringUtilsTrimEmptyTest
Running org.apache.commons.lang3.EnumUtilsTest
Tests run: 34, Failures: 0, Errors: 0, Skipped: 0, Time elapsed: 0.011 sec - in org.apache.commons.lang3.EnumUtilsTest
Running org.apache.commons.lang3.exception.ExceptionUtilsTest
Tests run: 28, Failures: 0, Errors: 0, Skipped: 0, Time elapsed: 0.036 sec - in org.apache.commons.lang3.exception.ExceptionUtilsTest
Running org.apache.commons.lang3.exception.DefaultExceptionContextTest
Tests run: 8, Failures: 0, Errors: 0, Skipped: 0, Time elapsed: 0.006 sec - in org.apache.commons.lang3.exception.DefaultExceptionContextTest
Running org.apache.commons.lang3.exception.ContextedExceptionTest
Tests run: 14, Failures: 0, Errors: 0, Skipped: 0, Time elapsed: 0.014 sec - in org.apache.commons.lang3.exception.ContextedExceptionTest
Running org.apache.commons.lang3.exception.ContextedRuntimeExceptionTest
Tests run: 14, Failures: 0, Errors: 0, Skipped: 0, Time elapsed: 0.014 sec - in org.apache.commons.lang3.exception.ContextedRuntimeExceptionTest
Running org.apache.commons.lang3.BitFieldTest
Tests run: 15, Failures: 0, Errors: 0, Skipped: 0, Time elapsed: 0.006 sec - in org.apache.commons.lang3.BitFieldTest
Running org.apache.commons.lang3.ArrayUtilsRemoveMultipleTest
Tests run: 55, Failures: 0, Errors: 0, Skipped: 0, Time elapsed: 0.019 sec - in org.apache.commons.lang3.ArrayUtilsRemoveMultipleTest
Running org.apache.commons.lang3.HashSetvBitSetTest
Ratio=8% array=100 count=1 extract=23075985 bitset=1978181
Ratio=7% array=100 count=10 extract=25278780 bitset=1963616
Ratio=16% array=100 count=50 extract=10633511 bitset=1795581
Ratio=4% array=100 count=100 extract=10620800 bitset=526733
Ratio=80% array=1000 count=10 extract=6660145 bitset=5337366
Ratio=31% array=1000 count=100 extract=15933653 bitset=5000288
Ratio=27% array=1000 count=500 extract=45273763 bitset=12307547
Ratio=1% array=1000 count=1000 extract=75286079 bitset=783622
Ratio=3% count=0 hash=5032171 bits=201254
Ratio=5% count=5 hash=3720543 bits=209913
Ratio=29% count=10 hash=998728 bits=295944
Ratio=22% count=200 hash=20419005 bits=4550297
Ratio=15% count=50 hash=8598399 bits=1363323
Ratio=24% count=100 hash=9570691 bits=2312933
Ratio=21% count=1000 hash=78975010 bits=17103242
Ratio=21% count=2000 hash=158845610 bits=34012449
Tests run: 2, Failures: 0, Errors: 0, Skipped: 0, Time elapsed: 0.711 sec - in org.apache.commons.lang3.HashSetvBitSetTest
Running org.apache.commons.lang3.StringUtilsTest
Tests run: 124, Failures: 1, Errors: 0, Skipped: 0, Time elapsed: 0.119 sec <<< FAILURE! - in org.apache.commons.lang3.StringUtilsTest
testEscapeSurrogatePairsLang858(org.apache.commons.lang3.StringUtilsTest)  Time elapsed: 0 sec  <<< FAILURE!
org.junit.ComparisonFailure: expected:<[\uDBFF\uDFFD]> but was:<[􏿽]>
	at org.junit.Assert.assertEquals(Assert.java:115)
	at org.junit.Assert.assertEquals(Assert.java:144)
	at org.apache.commons.lang3.StringUtilsTest.testEscapeSurrogatePairsLang858(StringUtilsTest.java:2366)

Running org.apache.commons.lang3.ArrayUtilsRemoveTest
Tests run: 19, Failures: 0, Errors: 0, Skipped: 0, Time elapsed: 0.004 sec - in org.apache.commons.lang3.ArrayUtilsRemoveTest
Running org.apache.commons.lang3.ObjectUtilsTest
Tests run: 36, Failures: 0, Errors: 0, Skipped: 0, Time elapsed: 0.015 sec - in org.apache.commons.lang3.ObjectUtilsTest
Running org.apache.commons.lang3.ClassPathUtilsTest
Tests run: 13, Failures: 0, Errors: 0, Skipped: 0, Time elapsed: 0.007 sec - in org.apache.commons.lang3.ClassPathUtilsTest
Running org.apache.commons.lang3.math.NumberUtilsTest
Tests run: 91, Failures: 0, Errors: 0, Skipped: 0, Time elapsed: 0.045 sec - in org.apache.commons.lang3.math.NumberUtilsTest
Running org.apache.commons.lang3.math.IEEE754rUtilsTest
Tests run: 3, Failures: 0, Errors: 0, Skipped: 0, Time elapsed: 0.002 sec - in org.apache.commons.lang3.math.IEEE754rUtilsTest
Running org.apache.commons.lang3.math.FractionTest
Tests run: 25, Failures: 0, Errors: 0, Skipped: 0, Time elapsed: 0.421 sec - in org.apache.commons.lang3.math.FractionTest
Running org.apache.commons.lang3.BooleanUtilsTest
Tests run: 72, Failures: 0, Errors: 0, Skipped: 0, Time elapsed: 0.014 sec - in org.apache.commons.lang3.BooleanUtilsTest
Running org.apache.commons.lang3.CharSequenceUtilsTest
Tests run: 2, Failures: 0, Errors: 0, Skipped: 0, Time elapsed: 0.001 sec - in org.apache.commons.lang3.CharSequenceUtilsTest
Running org.apache.commons.lang3.CharSetUtilsTest
Tests run: 11, Failures: 0, Errors: 0, Skipped: 0, Time elapsed: 0.001 sec - in org.apache.commons.lang3.CharSetUtilsTest
Running org.apache.commons.lang3.ArrayUtilsAddTest
Tests run: 13, Failures: 0, Errors: 0, Skipped: 0, Time elapsed: 0.002 sec - in org.apache.commons.lang3.ArrayUtilsAddTest
Running org.apache.commons.lang3.CharEncodingTest
Tests run: 6, Failures: 0, Errors: 0, Skipped: 0, Time elapsed: 0.022 sec - in org.apache.commons.lang3.CharEncodingTest
Running org.apache.commons.lang3.ClassUtilsTest
Tests run: 57, Failures: 0, Errors: 0, Skipped: 0, Time elapsed: 0.052 sec - in org.apache.commons.lang3.ClassUtilsTest
Running org.apache.commons.lang3.RangeTest
Tests run: 24, Failures: 0, Errors: 0, Skipped: 0, Time elapsed: 0.007 sec - in org.apache.commons.lang3.RangeTest
Running org.apache.commons.lang3.event.EventUtilsTest
Tests run: 8, Failures: 0, Errors: 0, Skipped: 0, Time elapsed: 0.013 sec - in org.apache.commons.lang3.event.EventUtilsTest
Running org.apache.commons.lang3.event.EventListenerSupportTest
Tests run: 9, Failures: 0, Errors: 0, Skipped: 0, Time elapsed: 0.022 sec - in org.apache.commons.lang3.event.EventListenerSupportTest
Running org.apache.commons.lang3.ArrayUtilsTest
Tests run: 205, Failures: 0, Errors: 0, Skipped: 0, Time elapsed: 0.051 sec - in org.apache.commons.lang3.ArrayUtilsTest
Running org.apache.commons.lang3.CharUtilsTest
Tests run: 24, Failures: 0, Errors: 0, Skipped: 0, Time elapsed: 0.007 sec - in org.apache.commons.lang3.CharUtilsTest
Running org.apache.commons.lang3.NotImplementedExceptionTest
Tests run: 1, Failures: 0, Errors: 0, Skipped: 0, Time elapsed: 0 sec - in org.apache.commons.lang3.NotImplementedExceptionTest
Running org.apache.commons.lang3.StringUtilsEqualsIndexOfTest
Tests run: 50, Failures: 0, Errors: 0, Skipped: 0, Time elapsed: 0.006 sec - in org.apache.commons.lang3.StringUtilsEqualsIndexOfTest
Running org.apache.commons.lang3.RandomUtilsTest
Tests run: 23, Failures: 0, Errors: 0, Skipped: 0, Time elapsed: 0.009 sec - in org.apache.commons.lang3.RandomUtilsTest

Results :

Failed tests: 
  StringEscapeUtilsTest.testEscapeEcmaScript:198 expected:<He didn\'[t say, \"stop!\]"> but was:<He didn\'['t say, \""stop!\"]">
  StringEscapeUtilsTest.testEscapeHtml:227 ampersand expected:<bread &amp;[] butter> but was:<bread &amp;[&] butter>
  StringEscapeUtilsTest.testEscapeHtmlVersions:288 expected:<[&Beta;]> but was:<[Β]>
  StringEscapeUtilsTest.testEscapeJava:75->assertEscapeJava:117 escapeJava(String) failed: tab expected:<[\t]> but was:<[	]>
  StringEscapeUtilsTest.testEscapeJson:610 expected:<He didn't say, \"[stop!\]"> but was:<He didn't say, \"["stop!\"]">
  StringEscapeUtilsTest.testEscapeXml:297 expected:<&lt;[abc&gt;]> but was:<&lt;[<abc&gt;>]>
  StringEscapeUtilsTest.testEscapeXml10:334 expected:<a&lt;[b&gt;c&quot;d&apos;e&amp;]f> but was:<a&lt;[<b&gt;>c&quot;"d'e&amp;&]f>
  StringEscapeUtilsTest.testEscapeXml11:349 expected:<a&lt;[b&gt;c&quot;d&apos;e&amp;]f> but was:<a&lt;[<b&gt;>c&quot;"d'e&amp;&]f>
  StringEscapeUtilsTest.testEscapeXmlAllCharacters:402 expected:<[&#0;&#1;&#2;&#3;&#4;&#5;&#6;&#7;&#8;]> but was:<[ ]>
  StringEscapeUtilsTest.testEscapeXmlSupplementaryCharacters:385 Supplementary character must be represented using a single escape expected:<[&#144308;]> but was:<[𣎴]>
  StringEscapeUtilsTest.testLang313:437 expected:<& &[]> but was:<& &[&amp;]>
  StringEscapeUtilsTest.testLang708:566 [{\""geonameFeatureClass\"":\""L\"",\""values\"":{\""eu\"":\""Mundua\"",\""ro\"":\""Pamânt\"",\""it\"":\""Globo\"",\""ca\"":\""el món\"",\""tr\"":\""Yeryüzü\"",\""no\"":\""Jorden\"",\""hu\"":\""Föld\"",\""lv\"":\""Zeme\"",\""de\"":\""Welt\"",\""el\"":\""Υδρόγειος\"",\""fi\"":\""Maa\"",\""la\"":\""Terra\"",\""fr\"":\""Monde\"",\""eo\"":\""Mondo\"",\""en\"":\""World\"",\""ru\"":\""Земля\"",\""es\"":\""el planeta\"",\""nl\"":\""Aarde\""},\""geonameFeatureCode\"":\""AREA\"",\""_id\"":32,\""name\"":\""\"",\""auto\"":true,\""type\"":\""GEO\"",\""geonameId\"":6295630,\""valueCode\"":\""\""},{\""geonameFeatureClass\"":\""L\"",\""values\"":{\""ro\"":\""Europa\"",\""zh\"":\""欧洲\"",\""ca\"":\""Europa\"",\""vi\"":\""Châu Âu\"",\""tr\"":\""Avrupa\"",\""no\"":\""Europa\"",\""hu\"":\""Európa\"",\""lv\"":\""Eiropa\"",\""hi\"":\""यूरोप\"",\""lt\"":\""Europa\"",\""bs\"":\""Evropa\"",\""ga\"":\""an Eoraip\"",\""th\"":\""ยุโรป\"",\""id\"":\""Eropa\"",\""de\"":\""Europa\"",\""fi\"":\""Eurooppa\"",\""fr\"":\""Europe\"",\""sv\"":\""Europa\"",\""bg\"":\""Европа\"",\""da\"":\""Europa\"",\""eu\"":\""Europa\"",\""is\"":\""Evrópa\"",\""it\"":\""Europa\"",\""cy\"":\""Ewrop\"",\""ar\"":\""أوروبا\"",\""se\"":\""Eurohpá\"",\""he\"":\""אירופה\"",\""cs\"":\""Evropa\"",\""el\"":\""Ευρώπη\"",\""nb\"":\""Europa\"",\""pl\"":\""Europa\"",\""la\"":\""Europa\"",\""pt\"":\""Europa\"",\""eo\"":\""Eŭropo\"",\""en\"":\""Europe\"",\""ru\"":\""Европа\"",\""es\"":\""Europa\"",\""ja\"":\""ヨーロッパ\"",\""nl\"":\""Europa\""},\""geonameFeatureCode\"":\""CONT\"",\""_id\"":33,\""name\"":\""\"",\""auto\"":true,\""type\"":\""GEO\"",\""geonameId\"":6255148,\""valueCode\"":\""\""},{\""geonameFeatureClass\"":\""A\"",\""values\"":{\""no\"":\""Spania\"",\""nn\"":\""Spania\"",\""fy\"":\""Spanje\"",\""gd\"":\""An Spàinn\"",\""ga\"":\""An Spáinn\"",\""oc\"":\""Espanha\"",\""arc\"":\""ܐܣܦܢܝܐ\"",\""fi\"":\""Espanja\"",\""fr\"":\""Espagne\"",\""fo\"":\""Spania\"",\""udm\"":\""Испания\"",\""os\"":\""Испани\"",\""he\"":\""ספרד\"",\""gn\"":\""Epaña\"",\""gl\"":\""España\"",\""gv\"":\""Yn Spaainey\"",\""pl\"":\""Hiszpania\"",\""gu\"":\""સ્પેઇન\"",\""lo\"":\""ສະເປນ\"",\""ln\"":\""Espania\"",\""vi\"":\""Tây Ban Nha\"",\""dz\"":\""Spain\"",\""pms\"":\""Spagna\"",\""lv\"":\""Spānija\"",\""lt\"":\""Ispanija\"",\""vo\"":\""Spanyän\"",\""de\"":\""Spanien\"",\""mg\"":\""Espaina\"",\""fur\"":\""Spagne\"",\""mk\"":\""Шпанија\"",\""ml\"":\""സ്പെയ്ന്\\\u200D\"",\""ceb\"":\""Espanya\"",\""mi\"":\""Pāniora\"",\""uk\"":\""Іспанія\"",\""eu\"":\""Espainia\"",\""mr\"":\""स्पेन\"",\""ug\"":\""ئىسپانىيە\"",\""mt\"":\""Spanja\"",\""ms\"":\""Sepanyol\"",\""ur\"":\""سپین\"",\""fa\"":\""اسپانیا\"",\""ty\"":\""Paniora\"",\""new\"":\""स्पेन\"",\""na\"":\""Pain\"",\""el\"":\""Ισπανία\"",\""nb\"":\""Spania\"",\""ne\"":\""स्पेन\"",\""vls\"":\""Spanje\"",\""eo\"":\""Hispanio\"",\""en\"":\""Kingdom of Spain\"",\""et\"":\""Hispaania\"",\""es\"":\""la Madre Patria\"",\""nl\"":\""Spanje\"",\""vec\"":\""Spagna\"",\""to\"":\""Sepeni\"",\""ca\"":\""Espanya\"",\""tl\"":\""Espanya\"",\""tr\"":\""İspanya\"",\""tg\"":\""Испониё\"",\""haw\"":\""Sepania\"",\""bs\"":\""Španija\"",\""br\"":\""Spagn\"",\""th\"":\""ประเทศสเปน\"",\""bn\"":\""স্পেন\"",\""bo\"":\""སི་པན།\"",\""ta\"":\""ஸ்பெயின்\"",\""sv\"":\""Spanien\"",\""bg\"":\""Испания\"",\""ka\"":\""ესპანეთი\"",\""st\"":\""Spain\"",\""sw\"":\""Hispania\"",\""be\"":\""Іспанія\"",\""kw\"":\""Spayn\"",\""sl\"":\""Španija\"",\""sk\"":\""Španielsko\"",\""da\"":\""Spanien\"",\""ang\"":\""Spēonland\"",\""nds\"":\""Spanien\"",\""ks\"":\""Spēna\"",\""so\"":\""Isbeyn\"",\""ku\"":\""Spanya\"",\""sr\"":\""Шпанија\"",\""sq\"":\""Spanja\"",\""ko\"":\""에스파냐\"",\""sc\"":\""Ispagna\"",\""cy\"":\""Sbaen\"",\""se\"":\""Espánjja\"",\""sh\"":\""Španija\"",\""cv\"":\""Испани\"",\""km\"":\""អេស្ប៉ាញ\"",\""cs\"":\""Španělsko\"",\""li\"":\""Spanje\"",\""co\"":\""Spagna\"",\""default\"":\""Spain\"",\""jbo\"":\""sangu\''e\"",\""la\"":\""Hesperia\"",\""ru\"":\""Испания\"",\""lb\"":\""Spuenien\"",\""sco\"":\""Spain\"",\""tet\"":\""España\"",\""scn\"":\""Spagna\"",\""hr\"":\""Španjolska\"",\""zh\"":\""西班牙\"",\""ro\"":\""Spania\"",\""rm\"":\""Spagna\"",\""ht\"":\""Espay\"",\""hu\"":\""Spanyolország\"",\""ast\"":\""España\"",\""hi\"":\""स्पेन\"",\""hsb\"":\""Španiska\"",\""nah\"":\""Caxtillān\"",\""war\"":\""Espanya\"",\""lad\"":\""Espanya\"",\""id\"":\""Spanyol\"",\""ia\"":\""Espania\"",\""nrm\"":\""Espangne\"",\""hy\"":\""Իսպանիա\"",\""qu\"":\""Ispaña\"",\""ilo\"":\""Espania\"",\""az\"":\""İspaniya\"",\""is\"":\""Spánn\"",\""it\"":\""Spagna\"",\""tpi\"":\""Spen\"",\""ar\"":\""أسبانيا\"",\""io\"":\""Hispania\"",\""pam\"":\""Espanya\"",\""frp\"":\""Èspagne\"",\""am\"":\""እስፓንያ\"",\""an\"":\""España\"",\""csb\"":\""Szpańskô\"",\""pt\"":\""Espanha\"",\""ja\"":\""スペイン\"",\""ps\"":\""اسپانيا\"",\""yi\"":\""שפאניע\"",\""af\"":\""Spanje\""},\""geonameFeatureCode\"":\""PCLI\"",\""_id\"":260,\""name\"":\""\"",\""auto\"":true,\""type\"":\""GEO\"",\""geonameId\"":2510769,\""valueCode\"":\""\""},{\""geonameFeatureClass\"":\""A\"",\""values\"":{\""ca\"":\""Andalusia\"",\""tr\"":\""Endülüs\"",\""krc\"":\""Андалусия\"",\""no\"":\""Andalucía\"",\""fy\"":\""Andalûsje\"",\""bs\"":\""Andaluzija\"",\""br\"":\""Andalouzia\"",\""ext\"":\""Andaluzia\"",\""ga\"":\""An Andalúis\"",\""th\"":\""แคว้นอันดาลูซีอา\"",\""bn\"":\""আন্দালুসিয়া\"",\""oc\"":\""Andalosia\"",\""ka\"":\""ანდალუსია\"",\""sv\"":\""Andalusien\"",\""fr\"":\""Andalousie\"",\""bg\"":\""Андалусия\"",\""glk\"":\""آندالوسیا\"",\""be\"":\""Андалусія\"",\""kw\"":\""Andalousi\"",\""sk\"":\""Andalúzia\"",\""os\"":\""Андалуси\"",\""da\"":\""Andalusien\"",\""sr\"":\""Андалузија\"",\""ku\"":\""Endulus\"",\""ko\"":\""안달루시아 지방\"",\""he\"":\""אנדלוסיה\"",\""sh\"":\""Andaluzija\"",\""arz\"":\""اندلوسيا\"",\""cs\"":\""Andalusie\"",\""default\"":\""Andalusia\"",\""stq\"":\""Andalusien\"",\""la\"":\""Vandalitia\"",\""pl\"":\""Andaluzja\"",\""ru\"":\""Андалусия\"",\""lb\"":\""Andalusien\"",\""tet\"":\""Andaluzia\"",\""got\"":\""𐍅𐌰𐌽𐌳𐌰𐌻𐌹𐍄𐌾𐌰\"",\""hr\"":\""Andaluzija\"",\""zh\"":\""安達魯西亞\"",\""ro\"":\""Andaluzia\"",\""hu\"":\""Andalúzia\"",\""pms\"":\""Andalusìa\"",\""lv\"":\""Andalūzija\"",\""lt\"":\""Andalūzija\"",\""nah\"":\""Andalucia\"",\""lad\"":\""Andaluziya\"",\""de\"":\""Andalusien\"",\""als\"":\""Andalusien\"",\""qu\"":\""Andalusiya\"",\""hy\"":\""Անդալուզիա\"",\""eu\"":\""Andaluzia\"",\""is\"":\""Andalúsía\"",\""uk\"":\""Андалусія\"",\""az\"":\""Andalusiya\"",\""mr\"":\""आंदालुसिया\"",\""ug\"":\""Andalusiye\"",\""fa\"":\""اندلس\"",\""ar\"":\""أندلوسيا\"",\""rmy\"":\""Andalusiya\"",\""io\"":\""Andaluzia\"",\""el\"":\""Ανδαλουσία\"",\""frp\"":\""Andalosie\"",\""pt\"":\""Andaluzia\"",\""eo\"":\""Andaluzio\"",\""en\"":\""Andalusia\"",\""et\"":\""Andaluusia\"",\""es\"":\""Andalucía\"",\""ja\"":\""アンダルシア州\"",\""nl\"":\""Andalusië\"",\""af\"":\""Andalusië\"",\""vec\"":\""Andalusìa\""},\""geonameFeatureCode\"":\""ADM1\"",\""_id\"":261,\""name\"":\""\"",\""auto\"":true,\""type\"":\""GEO\"",\""geonameId\"":2593109,\""valueCode\"":\""\""},{\""geonameFeatureClass\"":\""A\"",\""values\"":{\""de\"":\""Granada\"",\""default\"":\""Province of Granada\"",\""fr\"":\""Grenade\"",\""en\"":\""Province of Granada\"",\""es\"":\""Provincia de Granada\"",\""ja\"":\""グラナダ\""},\""geonameFeatureCode\"":\""ADM2\"",\""_id\"":262,\""name\"":\""\"",\""auto\"":true,\""type\"":\""GEO\"",\""geonameId\"":2517115,\""valueCode\"":\""\""},{\""geonameFeatureClass\"":\""A\"",\""values\"":{\""default\"":\""Monachil\""},\""geonameFeatureCode\"":\""ADM3\"",\""_id\"":263,\""name\"":\""\"",\""auto\"":true,\""type\"":\""GEO\"",\""geonameId\"":6357744,\""valueCode\"":\""\""},{\""geonameFeatureClass\"":\""P\"",\""values\"":{\""default\"":\""Sierra Nevada\""},\""geonameFeatureCode\"":\""PPL\"",\""_id\"":264,\""name\"":\""\"",\""auto\"":true,\""type\"":\""GEO\"",\""geonameId\"":6544329,\""valueCode\"":\""\""}]
  StringEscapeUtilsTest.testStandaloneAmphersand:429 expected:<<[P&O>]> but was:<<[&lt;P&O>&gt;]>
  StringEscapeUtilsTest.testUnescapeHexCharsHtml:268 hex number unescape expected:<[]> but was:<[&#x80;&#x9F;]>
  StringEscapeUtilsTest.testUnescapeHtml4:244 ampersand expected:<bread &[] butter> but was:<bread &[&amp;] butter>
  StringEscapeUtilsTest.testUnescapeJava:143 null
  StringEscapeUtilsTest.testUnescapeXmlSupplementaryCharacters:418 Supplementary character must be represented using a single escape expected:<[𣎴]> but was:<[&#144308;]>
  StringUtilsTest.testEscapeSurrogatePairsLang858:2366 expected:<[\uDBFF\uDFFD]> but was:<[􏿽]>



Tests run: 3526, Failures: 18, Errors: 0, Skipped: 97

[INFO] ------------------------------------------------------------------------
[INFO] BUILD FAILURE
[INFO] ------------------------------------------------------------------------
[INFO] Total time: 42.543s
[INFO] Finished at: Wed Aug 05 04:44:16 BST 2015
[INFO] Final Memory: 25M/498M
[INFO] ------------------------------------------------------------------------
[ERROR] Failed to execute goal org.apache.maven.plugins:maven-surefire-plugin:2.18:test (default-test) on project commons-lang3: There are test failures.
[ERROR] 
[ERROR] Please refer to /home/perham/Study/LittleDarwin/Cases/commons-lang3-3.4-src/target/surefire-reports for the individual test results.
[ERROR] -> [Help 1]
[ERROR] 
[ERROR] To see the full stack trace of the errors, re-run Maven with the -e switch.
[ERROR] Re-run Maven using the -X switch to enable full debug logging.
[ERROR] 
[ERROR] For more information about the errors and possible solutions, please read the following articles:
[ERROR] [Help 1] http://cwiki.apache.org/confluence/display/MAVEN/MojoFailureException
