[INFO] Scanning for projects...
[INFO]                                                                         
[INFO] ------------------------------------------------------------------------
[INFO] Building Apache Commons Lang 3.4
[INFO] ------------------------------------------------------------------------
[INFO] 
[INFO] --- maven-enforcer-plugin:1.3.1:enforce (enforce-maven-3) @ commons-lang3 ---
[INFO] 
[INFO] --- build-helper-maven-plugin:1.8:parse-version (parse-version) @ commons-lang3 ---
[INFO] 
[INFO] --- maven-antrun-plugin:1.8:run (javadoc.resources) @ commons-lang3 ---
[INFO] Executing tasks

main:
[INFO] Executed tasks
[INFO] 
[INFO] --- maven-remote-resources-plugin:1.5:process (default) @ commons-lang3 ---
[INFO] 
[INFO] --- buildnumber-maven-plugin:1.3:create (default) @ commons-lang3 ---
[INFO] Executing: /bin/sh -c cd /home/perham/Study/LittleDarwin/Cases/commons-lang3-3.4-src && svn --non-interactive info
[INFO] Working directory: /home/perham/Study/LittleDarwin/Cases/commons-lang3-3.4-src
[INFO] Storing buildNumber: ?????? at timestamp: 1438744005000
[INFO] Executing: /bin/sh -c cd /home/perham/Study/LittleDarwin/Cases/commons-lang3-3.4-src && svn --non-interactive info
[INFO] Working directory: /home/perham/Study/LittleDarwin/Cases/commons-lang3-3.4-src
[INFO] Storing buildScmBranch: UNKNOWN_BRANCH
[INFO] 
[INFO] --- maven-resources-plugin:2.7:resources (default-resources) @ commons-lang3 ---
[INFO] Using 'ISO-8859-1' encoding to copy filtered resources.
[INFO] Copying 0 resource
[INFO] Copying 2 resources to META-INF
[INFO] 
[INFO] --- maven-compiler-plugin:3.2:compile (default-compile) @ commons-lang3 ---
[INFO] Changes detected - recompiling the module!
[INFO] Compiling 133 source files to /home/perham/Study/LittleDarwin/Cases/commons-lang3-3.4-src/target/classes
[INFO] /home/perham/Study/LittleDarwin/Cases/commons-lang3-3.4-src/src/main/java/org/apache/commons/lang3/SerializationUtils.java: /home/perham/Study/LittleDarwin/Cases/commons-lang3-3.4-src/src/main/java/org/apache/commons/lang3/SerializationUtils.java uses unchecked or unsafe operations.
[INFO] /home/perham/Study/LittleDarwin/Cases/commons-lang3-3.4-src/src/main/java/org/apache/commons/lang3/SerializationUtils.java: Recompile with -Xlint:unchecked for details.
[INFO] 
[INFO] --- maven-bundle-plugin:2.5.3:manifest (bundle-manifest) @ commons-lang3 ---
[INFO] 
[INFO] --- animal-sniffer-maven-plugin:1.13:check (checkAPIcompatibility) @ commons-lang3 ---
[INFO] Checking unresolved references to org.codehaus.mojo.signature:java16:1.0
[INFO] 
[INFO] --- maven-resources-plugin:2.7:testResources (default-testResources) @ commons-lang3 ---
[INFO] Using 'ISO-8859-1' encoding to copy filtered resources.
[INFO] Copying 2 resources
[INFO] Copying 2 resources to META-INF
[INFO] 
[INFO] --- maven-compiler-plugin:3.2:testCompile (default-testCompile) @ commons-lang3 ---
[INFO] Nothing to compile - all classes are up to date
[INFO] 
[INFO] --- maven-surefire-plugin:2.18:test (default-test) @ commons-lang3 ---
[INFO] Surefire report directory: /home/perham/Study/LittleDarwin/Cases/commons-lang3-3.4-src/target/surefire-reports

-------------------------------------------------------
 T E S T S
-------------------------------------------------------
Running org.apache.commons.lang3.ValidateTest
Tests run: 63, Failures: 0, Errors: 0, Skipped: 0, Time elapsed: 0.044 sec - in org.apache.commons.lang3.ValidateTest
Running org.apache.commons.lang3.LocaleUtilsTest
Tests run: 15, Failures: 0, Errors: 0, Skipped: 0, Time elapsed: 0.025 sec - in org.apache.commons.lang3.LocaleUtilsTest
Running org.apache.commons.lang3.tuple.MutableTripleTest
Tests run: 8, Failures: 0, Errors: 0, Skipped: 0, Time elapsed: 0.011 sec - in org.apache.commons.lang3.tuple.MutableTripleTest
Running org.apache.commons.lang3.tuple.TripleTest
Tests run: 10, Failures: 0, Errors: 0, Skipped: 0, Time elapsed: 0.001 sec - in org.apache.commons.lang3.tuple.TripleTest
Running org.apache.commons.lang3.tuple.ImmutablePairTest
Tests run: 6, Failures: 0, Errors: 0, Skipped: 0, Time elapsed: 0.001 sec - in org.apache.commons.lang3.tuple.ImmutablePairTest
Running org.apache.commons.lang3.tuple.MutablePairTest
Tests run: 8, Failures: 0, Errors: 0, Skipped: 0, Time elapsed: 0.001 sec - in org.apache.commons.lang3.tuple.MutablePairTest
Running org.apache.commons.lang3.tuple.ImmutableTripleTest
Tests run: 6, Failures: 0, Errors: 0, Skipped: 0, Time elapsed: 0 sec - in org.apache.commons.lang3.tuple.ImmutableTripleTest
Running org.apache.commons.lang3.tuple.PairTest
Tests run: 9, Failures: 0, Errors: 0, Skipped: 0, Time elapsed: 0.001 sec - in org.apache.commons.lang3.tuple.PairTest
Running org.apache.commons.lang3.StringUtilsIsTest
Tests run: 8, Failures: 0, Errors: 0, Skipped: 0, Time elapsed: 0.002 sec - in org.apache.commons.lang3.StringUtilsIsTest
Running org.apache.commons.lang3.JavaVersionTest
Tests run: 3, Failures: 0, Errors: 0, Skipped: 0, Time elapsed: 0 sec - in org.apache.commons.lang3.JavaVersionTest
Running org.apache.commons.lang3.builder.NoFieldNamesToStringStyleTest
Tests run: 8, Failures: 0, Errors: 0, Skipped: 0, Time elapsed: 0 sec - in org.apache.commons.lang3.builder.NoFieldNamesToStringStyleTest
Running org.apache.commons.lang3.builder.ShortPrefixToStringStyleTest
Tests run: 8, Failures: 0, Errors: 0, Skipped: 0, Time elapsed: 0.001 sec - in org.apache.commons.lang3.builder.ShortPrefixToStringStyleTest
Running org.apache.commons.lang3.builder.DiffResultTest
Tests run: 9, Failures: 0, Errors: 0, Skipped: 0, Time elapsed: 0.001 sec - in org.apache.commons.lang3.builder.DiffResultTest
Running org.apache.commons.lang3.builder.CompareToBuilderTest
Tests run: 48, Failures: 0, Errors: 0, Skipped: 0, Time elapsed: 0.013 sec - in org.apache.commons.lang3.builder.CompareToBuilderTest
Running org.apache.commons.lang3.builder.MultilineRecursiveToStringStyleTest
Tests run: 10, Failures: 0, Errors: 0, Skipped: 0, Time elapsed: 0.001 sec - in org.apache.commons.lang3.builder.MultilineRecursiveToStringStyleTest
Running org.apache.commons.lang3.builder.RecursiveToStringStyleTest
Tests run: 8, Failures: 0, Errors: 0, Skipped: 0, Time elapsed: 0.004 sec - in org.apache.commons.lang3.builder.RecursiveToStringStyleTest
Running org.apache.commons.lang3.builder.DefaultToStringStyleTest
Tests run: 8, Failures: 0, Errors: 0, Skipped: 0, Time elapsed: 0.001 sec - in org.apache.commons.lang3.builder.DefaultToStringStyleTest
Running org.apache.commons.lang3.builder.ReflectionToStringBuilderExcludeTest
Tests run: 11, Failures: 0, Errors: 0, Skipped: 0, Time elapsed: 0.001 sec - in org.apache.commons.lang3.builder.ReflectionToStringBuilderExcludeTest
Running org.apache.commons.lang3.builder.StandardToStringStyleTest
Tests run: 8, Failures: 0, Errors: 0, Skipped: 0, Time elapsed: 0.001 sec - in org.apache.commons.lang3.builder.StandardToStringStyleTest
Running org.apache.commons.lang3.builder.ToStringStyleTest
Tests run: 12, Failures: 0, Errors: 0, Skipped: 0, Time elapsed: 0.011 sec - in org.apache.commons.lang3.builder.ToStringStyleTest
Running org.apache.commons.lang3.builder.DiffTest
Tests run: 4, Failures: 0, Errors: 0, Skipped: 0, Time elapsed: 0.001 sec - in org.apache.commons.lang3.builder.DiffTest
Running org.apache.commons.lang3.builder.SimpleToStringStyleTest
Tests run: 8, Failures: 0, Errors: 0, Skipped: 0, Time elapsed: 0.001 sec - in org.apache.commons.lang3.builder.SimpleToStringStyleTest
Running org.apache.commons.lang3.builder.MultiLineToStringStyleTest
Tests run: 8, Failures: 0, Errors: 0, Skipped: 0, Time elapsed: 0.011 sec - in org.apache.commons.lang3.builder.MultiLineToStringStyleTest
Running org.apache.commons.lang3.builder.ToStringStyleConcurrencyTest
Tests run: 3, Failures: 0, Errors: 0, Skipped: 0, Time elapsed: 5.149 sec - in org.apache.commons.lang3.builder.ToStringStyleConcurrencyTest
Running org.apache.commons.lang3.builder.ReflectionToStringBuilderMutateInspectConcurrencyTest
Tests run: 1, Failures: 0, Errors: 0, Skipped: 1, Time elapsed: 0 sec - in org.apache.commons.lang3.builder.ReflectionToStringBuilderMutateInspectConcurrencyTest
Running org.apache.commons.lang3.builder.ToStringBuilderTest
Tests run: 74, Failures: 0, Errors: 0, Skipped: 1, Time elapsed: 0.058 sec - in org.apache.commons.lang3.builder.ToStringBuilderTest
Running org.apache.commons.lang3.builder.EqualsBuilderTest
Tests run: 48, Failures: 0, Errors: 0, Skipped: 0, Time elapsed: 0.016 sec - in org.apache.commons.lang3.builder.EqualsBuilderTest
Running org.apache.commons.lang3.builder.HashCodeBuilderAndEqualsBuilderTest
Tests run: 4, Failures: 0, Errors: 0, Skipped: 0, Time elapsed: 0.009 sec - in org.apache.commons.lang3.builder.HashCodeBuilderAndEqualsBuilderTest
Running org.apache.commons.lang3.builder.ReflectionToStringBuilderConcurrencyTest
Tests run: 3, Failures: 0, Errors: 0, Skipped: 3, Time elapsed: 0.002 sec - in org.apache.commons.lang3.builder.ReflectionToStringBuilderConcurrencyTest
Running org.apache.commons.lang3.builder.JsonToStringStyleTest
Tests run: 9, Failures: 0, Errors: 0, Skipped: 0, Time elapsed: 0.006 sec - in org.apache.commons.lang3.builder.JsonToStringStyleTest
Running org.apache.commons.lang3.builder.NoClassNameToStringStyleTest
Tests run: 8, Failures: 0, Errors: 0, Skipped: 0, Time elapsed: 0.007 sec - in org.apache.commons.lang3.builder.NoClassNameToStringStyleTest
Running org.apache.commons.lang3.builder.DiffBuilderTest
Tests run: 30, Failures: 0, Errors: 0, Skipped: 0, Time elapsed: 0.036 sec - in org.apache.commons.lang3.builder.DiffBuilderTest
Running org.apache.commons.lang3.builder.HashCodeBuilderTest
Tests run: 44, Failures: 0, Errors: 0, Skipped: 0, Time elapsed: 0.013 sec - in org.apache.commons.lang3.builder.HashCodeBuilderTest
Running org.apache.commons.lang3.concurrent.AtomicInitializerTest
Tests run: 3, Failures: 0, Errors: 0, Skipped: 0, Time elapsed: 0.004 sec - in org.apache.commons.lang3.concurrent.AtomicInitializerTest
Running org.apache.commons.lang3.concurrent.CallableBackgroundInitializerTest
Tests run: 4, Failures: 0, Errors: 0, Skipped: 0, Time elapsed: 0.002 sec - in org.apache.commons.lang3.concurrent.CallableBackgroundInitializerTest
Running org.apache.commons.lang3.concurrent.BackgroundInitializerTest
Tests run: 15, Failures: 0, Errors: 0, Skipped: 0, Time elapsed: 0.02 sec - in org.apache.commons.lang3.concurrent.BackgroundInitializerTest
Running org.apache.commons.lang3.concurrent.LazyInitializerTest
Tests run: 3, Failures: 0, Errors: 0, Skipped: 0, Time elapsed: 0.009 sec - in org.apache.commons.lang3.concurrent.LazyInitializerTest
Running org.apache.commons.lang3.concurrent.BasicThreadFactoryTest
Tests run: 15, Failures: 0, Errors: 0, Skipped: 0, Time elapsed: 0.036 sec - in org.apache.commons.lang3.concurrent.BasicThreadFactoryTest
Running org.apache.commons.lang3.concurrent.ConstantInitializerTest
Tests run: 7, Failures: 0, Errors: 0, Skipped: 0, Time elapsed: 0.002 sec - in org.apache.commons.lang3.concurrent.ConstantInitializerTest
Running org.apache.commons.lang3.concurrent.MultiBackgroundInitializerTest
Tests run: 17, Failures: 0, Errors: 0, Skipped: 0, Time elapsed: 0.058 sec - in org.apache.commons.lang3.concurrent.MultiBackgroundInitializerTest
Running org.apache.commons.lang3.concurrent.AtomicSafeInitializerTest
Tests run: 4, Failures: 0, Errors: 0, Skipped: 0, Time elapsed: 0.006 sec - in org.apache.commons.lang3.concurrent.AtomicSafeInitializerTest
Running org.apache.commons.lang3.concurrent.ConcurrentUtilsTest
Tests run: 40, Failures: 0, Errors: 0, Skipped: 0, Time elapsed: 0.014 sec - in org.apache.commons.lang3.concurrent.ConcurrentUtilsTest
Running org.apache.commons.lang3.concurrent.TimedSemaphoreTest
Tests run: 15, Failures: 0, Errors: 0, Skipped: 0, Time elapsed: 1.175 sec - in org.apache.commons.lang3.concurrent.TimedSemaphoreTest
Running org.apache.commons.lang3.StringUtilsSubstringTest
Tests run: 14, Failures: 0, Errors: 0, Skipped: 0, Time elapsed: 0.004 sec - in org.apache.commons.lang3.StringUtilsSubstringTest
Running org.apache.commons.lang3.SystemUtilsTest
Tests run: 12, Failures: 0, Errors: 0, Skipped: 0, Time elapsed: 0.003 sec - in org.apache.commons.lang3.SystemUtilsTest
Running org.apache.commons.lang3.CharRangeTest
Tests run: 16, Failures: 0, Errors: 0, Skipped: 0, Time elapsed: 0.038 sec - in org.apache.commons.lang3.CharRangeTest
Running org.apache.commons.lang3.CharSetTest
Tests run: 14, Failures: 0, Errors: 0, Skipped: 0, Time elapsed: 0.011 sec - in org.apache.commons.lang3.CharSetTest
Running org.apache.commons.lang3.StringUtilsStartsEndsWithTest
Tests run: 6, Failures: 0, Errors: 0, Skipped: 0, Time elapsed: 0.005 sec - in org.apache.commons.lang3.StringUtilsStartsEndsWithTest
Running org.apache.commons.lang3.RandomStringUtilsTest
Tests run: 11, Failures: 0, Errors: 0, Skipped: 0, Time elapsed: 0.037 sec - in org.apache.commons.lang3.RandomStringUtilsTest
Running org.apache.commons.lang3.SerializationUtilsTest
Tests run: 26, Failures: 0, Errors: 0, Skipped: 0, Time elapsed: 0.053 sec - in org.apache.commons.lang3.SerializationUtilsTest
Running org.apache.commons.lang3.time.StopWatchTest
Tests run: 8, Failures: 0, Errors: 0, Skipped: 0, Time elapsed: 4.759 sec - in org.apache.commons.lang3.time.StopWatchTest
Running org.apache.commons.lang3.time.DateUtilsRoundingTest
Tests run: 22, Failures: 0, Errors: 0, Skipped: 0, Time elapsed: 0.173 sec - in org.apache.commons.lang3.time.DateUtilsRoundingTest
Running org.apache.commons.lang3.time.FastDateParserTest
Tests run: 33, Failures: 0, Errors: 0, Skipped: 0, Time elapsed: 2.452 sec - in org.apache.commons.lang3.time.FastDateParserTest
Running org.apache.commons.lang3.time.FastDateFormat_ParserTest
Tests run: 33, Failures: 0, Errors: 0, Skipped: 0, Time elapsed: 0.766 sec - in org.apache.commons.lang3.time.FastDateFormat_ParserTest
Running org.apache.commons.lang3.time.DurationFormatUtilsTest
Tests run: 25, Failures: 0, Errors: 0, Skipped: 0, Time elapsed: 0.633 sec - in org.apache.commons.lang3.time.DurationFormatUtilsTest
Running org.apache.commons.lang3.time.DateFormatUtilsTest
Tests run: 10, Failures: 0, Errors: 0, Skipped: 0, Time elapsed: 0.001 sec - in org.apache.commons.lang3.time.DateFormatUtilsTest
Running org.apache.commons.lang3.time.DateUtilsFragmentTest
Tests run: 57, Failures: 0, Errors: 0, Skipped: 0, Time elapsed: 0.011 sec - in org.apache.commons.lang3.time.DateUtilsFragmentTest
Running org.apache.commons.lang3.time.FastDatePrinterTimeZonesTest
Tests run: 617, Failures: 0, Errors: 0, Skipped: 0, Time elapsed: 0.236 sec - in org.apache.commons.lang3.time.FastDatePrinterTimeZonesTest
Running org.apache.commons.lang3.time.FastDateFormatTest
>>FastDateFormatTest: FastDateParser:19816  SimpleDateFormat:4223
Tests run: 14, Failures: 0, Errors: 0, Skipped: 0, Time elapsed: 2.642 sec - in org.apache.commons.lang3.time.FastDateFormatTest
Running org.apache.commons.lang3.time.FastDateFormat_PrinterTest
Tests run: 17, Failures: 0, Errors: 0, Skipped: 0, Time elapsed: 0.018 sec - in org.apache.commons.lang3.time.FastDateFormat_PrinterTest
Running org.apache.commons.lang3.time.FastDatePrinterTest
Tests run: 17, Failures: 0, Errors: 0, Skipped: 0, Time elapsed: 0.005 sec - in org.apache.commons.lang3.time.FastDatePrinterTest
Running org.apache.commons.lang3.time.FastDateParserSDFTest
Tests run: 276, Failures: 0, Errors: 0, Skipped: 92, Time elapsed: 0.079 sec - in org.apache.commons.lang3.time.FastDateParserSDFTest
Running org.apache.commons.lang3.time.DateUtilsTest
DateUtilsTest: Default Locale=en_US
Tests run: 38, Failures: 0, Errors: 0, Skipped: 0, Time elapsed: 0.031 sec - in org.apache.commons.lang3.time.DateUtilsTest
Running org.apache.commons.lang3.reflect.InheritanceUtilsTest
Tests run: 9, Failures: 0, Errors: 0, Skipped: 0, Time elapsed: 0.001 sec - in org.apache.commons.lang3.reflect.InheritanceUtilsTest
Running org.apache.commons.lang3.reflect.MethodUtilsTest
Tests run: 23, Failures: 0, Errors: 0, Skipped: 0, Time elapsed: 0.031 sec - in org.apache.commons.lang3.reflect.MethodUtilsTest
Running org.apache.commons.lang3.reflect.ConstructorUtilsTest
Tests run: 7, Failures: 0, Errors: 0, Skipped: 0, Time elapsed: 0.003 sec - in org.apache.commons.lang3.reflect.ConstructorUtilsTest
Running org.apache.commons.lang3.reflect.FieldUtilsTest
Tests run: 64, Failures: 0, Errors: 0, Skipped: 0, Time elapsed: 0.027 sec - in org.apache.commons.lang3.reflect.FieldUtilsTest
Running org.apache.commons.lang3.reflect.TypeLiteralTest
Tests run: 4, Failures: 0, Errors: 0, Skipped: 0, Time elapsed: 0 sec - in org.apache.commons.lang3.reflect.TypeLiteralTest
Running org.apache.commons.lang3.reflect.TypeUtilsTest
Tests run: 19, Failures: 0, Errors: 0, Skipped: 0, Time elapsed: 0.034 sec - in org.apache.commons.lang3.reflect.TypeUtilsTest
Running org.apache.commons.lang3.mutable.MutableByteTest
Tests run: 17, Failures: 0, Errors: 0, Skipped: 0, Time elapsed: 0.004 sec - in org.apache.commons.lang3.mutable.MutableByteTest
Running org.apache.commons.lang3.mutable.MutableShortTest
Tests run: 14, Failures: 0, Errors: 0, Skipped: 0, Time elapsed: 0 sec - in org.apache.commons.lang3.mutable.MutableShortTest
Running org.apache.commons.lang3.mutable.MutableIntTest
Tests run: 17, Failures: 0, Errors: 0, Skipped: 0, Time elapsed: 0.003 sec - in org.apache.commons.lang3.mutable.MutableIntTest
Running org.apache.commons.lang3.mutable.MutableDoubleTest
Tests run: 18, Failures: 0, Errors: 0, Skipped: 0, Time elapsed: 0.003 sec - in org.apache.commons.lang3.mutable.MutableDoubleTest
Running org.apache.commons.lang3.mutable.MutableFloatTest
Tests run: 18, Failures: 0, Errors: 0, Skipped: 0, Time elapsed: 0.006 sec - in org.apache.commons.lang3.mutable.MutableFloatTest
Running org.apache.commons.lang3.mutable.MutableLongTest
Tests run: 17, Failures: 0, Errors: 0, Skipped: 0, Time elapsed: 0.001 sec - in org.apache.commons.lang3.mutable.MutableLongTest
Running org.apache.commons.lang3.mutable.MutableBooleanTest
Tests run: 9, Failures: 0, Errors: 0, Skipped: 0, Time elapsed: 0.001 sec - in org.apache.commons.lang3.mutable.MutableBooleanTest
Running org.apache.commons.lang3.mutable.MutableObjectTest
Tests run: 5, Failures: 0, Errors: 0, Skipped: 0, Time elapsed: 0 sec - in org.apache.commons.lang3.mutable.MutableObjectTest
Running org.apache.commons.lang3.text.translate.UnicodeEscaperTest
Tests run: 3, Failures: 0, Errors: 0, Skipped: 0, Time elapsed: 0 sec - in org.apache.commons.lang3.text.translate.UnicodeEscaperTest
Running org.apache.commons.lang3.text.translate.EntityArraysTest
Tests run: 3, Failures: 0, Errors: 0, Skipped: 0, Time elapsed: 0 sec - in org.apache.commons.lang3.text.translate.EntityArraysTest
Running org.apache.commons.lang3.text.translate.UnicodeUnpairedSurrogateRemoverTest
Tests run: 2, Failures: 0, Errors: 0, Skipped: 0, Time elapsed: 0 sec - in org.apache.commons.lang3.text.translate.UnicodeUnpairedSurrogateRemoverTest
Running org.apache.commons.lang3.text.translate.NumericEntityUnescaperTest
Tests run: 3, Failures: 0, Errors: 0, Skipped: 0, Time elapsed: 0 sec - in org.apache.commons.lang3.text.translate.NumericEntityUnescaperTest
Running org.apache.commons.lang3.text.translate.NumericEntityEscaperTest
Tests run: 4, Failures: 0, Errors: 0, Skipped: 0, Time elapsed: 0.002 sec - in org.apache.commons.lang3.text.translate.NumericEntityEscaperTest
Running org.apache.commons.lang3.text.translate.LookupTranslatorTest
Tests run: 2, Failures: 0, Errors: 0, Skipped: 0, Time elapsed: 0.001 sec - in org.apache.commons.lang3.text.translate.LookupTranslatorTest
Running org.apache.commons.lang3.text.translate.UnicodeUnescaperTest
Tests run: 3, Failures: 0, Errors: 0, Skipped: 0, Time elapsed: 0 sec - in org.apache.commons.lang3.text.translate.UnicodeUnescaperTest
Running org.apache.commons.lang3.text.translate.OctalUnescaperTest
Tests run: 1, Failures: 0, Errors: 0, Skipped: 0, Time elapsed: 0.001 sec - in org.apache.commons.lang3.text.translate.OctalUnescaperTest
Running org.apache.commons.lang3.text.StrMatcherTest
Tests run: 14, Failures: 0, Errors: 0, Skipped: 0, Time elapsed: 0 sec - in org.apache.commons.lang3.text.StrMatcherTest
Running org.apache.commons.lang3.text.StrTokenizerTest
Tests run: 55, Failures: 0, Errors: 49, Skipped: 0, Time elapsed: 0.016 sec <<< FAILURE! - in org.apache.commons.lang3.text.StrTokenizerTest
testCSVSimple(org.apache.commons.lang3.text.StrTokenizerTest)  Time elapsed: 0.001 sec  <<< ERROR!
java.lang.ArrayIndexOutOfBoundsException: -1
	at org.apache.commons.lang3.text.StrMatcher$TrimMatcher.isMatch(StrMatcher.java:432)
	at org.apache.commons.lang3.text.StrTokenizer.readNextToken(StrTokenizer.java:133)
	at org.apache.commons.lang3.text.StrTokenizer.tokenize(StrTokenizer.java:127)
	at org.apache.commons.lang3.text.StrTokenizer.checkTokenized(StrTokenizer.java:121)
	at org.apache.commons.lang3.text.StrTokenizer.hasPrevious(StrTokenizer.java:111)
	at org.apache.commons.lang3.text.StrTokenizer.previousToken(StrTokenizer.java:88)
	at org.apache.commons.lang3.text.StrTokenizerTest.testXSVAbc(StrTokenizerTest.java:779)
	at org.apache.commons.lang3.text.StrTokenizerTest.testCSV(StrTokenizerTest.java:512)
	at org.apache.commons.lang3.text.StrTokenizerTest.testCSVSimple(StrTokenizerTest.java:524)

testBasicDelim1(org.apache.commons.lang3.text.StrTokenizerTest)  Time elapsed: 0 sec  <<< ERROR!
java.lang.ArrayIndexOutOfBoundsException: -1
	at org.apache.commons.lang3.text.StrMatcher$CharMatcher.isMatch(StrMatcher.java:334)
	at org.apache.commons.lang3.text.StrTokenizer.readNextToken(StrTokenizer.java:138)
	at org.apache.commons.lang3.text.StrTokenizer.tokenize(StrTokenizer.java:127)
	at org.apache.commons.lang3.text.StrTokenizer.checkTokenized(StrTokenizer.java:121)
	at org.apache.commons.lang3.text.StrTokenizer.hasNext(StrTokenizer.java:106)
	at org.apache.commons.lang3.text.StrTokenizer.next(StrTokenizer.java:108)
	at org.apache.commons.lang3.text.StrTokenizerTest.testBasicDelim1(StrTokenizerTest.java:285)

testBasicDelim2(org.apache.commons.lang3.text.StrTokenizerTest)  Time elapsed: 0 sec  <<< ERROR!
java.lang.ArrayIndexOutOfBoundsException: -1
	at org.apache.commons.lang3.text.StrMatcher$CharMatcher.isMatch(StrMatcher.java:334)
	at org.apache.commons.lang3.text.StrTokenizer.readNextToken(StrTokenizer.java:138)
	at org.apache.commons.lang3.text.StrTokenizer.tokenize(StrTokenizer.java:127)
	at org.apache.commons.lang3.text.StrTokenizer.checkTokenized(StrTokenizer.java:121)
	at org.apache.commons.lang3.text.StrTokenizer.hasNext(StrTokenizer.java:106)
	at org.apache.commons.lang3.text.StrTokenizer.next(StrTokenizer.java:108)
	at org.apache.commons.lang3.text.StrTokenizerTest.testBasicDelim2(StrTokenizerTest.java:295)

testBasicEmpty1(org.apache.commons.lang3.text.StrTokenizerTest)  Time elapsed: 0 sec  <<< ERROR!
java.lang.ArrayIndexOutOfBoundsException: -1
	at org.apache.commons.lang3.text.StrMatcher$CharSetMatcher.isMatch(StrMatcher.java:301)
	at org.apache.commons.lang3.text.StrTokenizer.readNextToken(StrTokenizer.java:138)
	at org.apache.commons.lang3.text.StrTokenizer.tokenize(StrTokenizer.java:127)
	at org.apache.commons.lang3.text.StrTokenizer.checkTokenized(StrTokenizer.java:121)
	at org.apache.commons.lang3.text.StrTokenizer.hasNext(StrTokenizer.java:106)
	at org.apache.commons.lang3.text.StrTokenizer.next(StrTokenizer.java:108)
	at org.apache.commons.lang3.text.StrTokenizerTest.testBasicEmpty1(StrTokenizerTest.java:304)

testBasicEmpty2(org.apache.commons.lang3.text.StrTokenizerTest)  Time elapsed: 0 sec  <<< ERROR!
java.lang.ArrayIndexOutOfBoundsException: -1
	at org.apache.commons.lang3.text.StrMatcher$CharSetMatcher.isMatch(StrMatcher.java:301)
	at org.apache.commons.lang3.text.StrTokenizer.readNextToken(StrTokenizer.java:138)
	at org.apache.commons.lang3.text.StrTokenizer.tokenize(StrTokenizer.java:127)
	at org.apache.commons.lang3.text.StrTokenizer.checkTokenized(StrTokenizer.java:121)
	at org.apache.commons.lang3.text.StrTokenizer.hasNext(StrTokenizer.java:106)
	at org.apache.commons.lang3.text.StrTokenizer.next(StrTokenizer.java:108)
	at org.apache.commons.lang3.text.StrTokenizerTest.testBasicEmpty2(StrTokenizerTest.java:317)

testConstructor_charArray_char(org.apache.commons.lang3.text.StrTokenizerTest)  Time elapsed: 0 sec  <<< ERROR!
java.lang.ArrayIndexOutOfBoundsException: -1
	at org.apache.commons.lang3.text.StrMatcher$CharMatcher.isMatch(StrMatcher.java:334)
	at org.apache.commons.lang3.text.StrTokenizer.readNextToken(StrTokenizer.java:138)
	at org.apache.commons.lang3.text.StrTokenizer.tokenize(StrTokenizer.java:127)
	at org.apache.commons.lang3.text.StrTokenizer.checkTokenized(StrTokenizer.java:121)
	at org.apache.commons.lang3.text.StrTokenizer.hasNext(StrTokenizer.java:106)
	at org.apache.commons.lang3.text.StrTokenizer.next(StrTokenizer.java:108)
	at org.apache.commons.lang3.text.StrTokenizerTest.testConstructor_charArray_char(StrTokenizerTest.java:691)

testTSV(org.apache.commons.lang3.text.StrTokenizerTest)  Time elapsed: 0 sec  <<< ERROR!
java.lang.ArrayIndexOutOfBoundsException: -1
	at org.apache.commons.lang3.text.StrMatcher$TrimMatcher.isMatch(StrMatcher.java:432)
	at org.apache.commons.lang3.text.StrTokenizer.readNextToken(StrTokenizer.java:133)
	at org.apache.commons.lang3.text.StrTokenizer.tokenize(StrTokenizer.java:127)
	at org.apache.commons.lang3.text.StrTokenizer.checkTokenized(StrTokenizer.java:121)
	at org.apache.commons.lang3.text.StrTokenizer.hasPrevious(StrTokenizer.java:111)
	at org.apache.commons.lang3.text.StrTokenizer.previousToken(StrTokenizer.java:88)
	at org.apache.commons.lang3.text.StrTokenizerTest.testXSVAbc(StrTokenizerTest.java:779)
	at org.apache.commons.lang3.text.StrTokenizerTest.testTSV(StrTokenizerTest.java:765)

testIteration(org.apache.commons.lang3.text.StrTokenizerTest)  Time elapsed: 0 sec  <<< ERROR!
java.lang.ArrayIndexOutOfBoundsException: -1
	at org.apache.commons.lang3.text.StrMatcher$CharSetMatcher.isMatch(StrMatcher.java:301)
	at org.apache.commons.lang3.text.StrTokenizer.readNextToken(StrTokenizer.java:138)
	at org.apache.commons.lang3.text.StrTokenizer.tokenize(StrTokenizer.java:127)
	at org.apache.commons.lang3.text.StrTokenizer.checkTokenized(StrTokenizer.java:121)
	at org.apache.commons.lang3.text.StrTokenizer.hasPrevious(StrTokenizer.java:111)
	at org.apache.commons.lang3.text.StrTokenizerTest.testIteration(StrTokenizerTest.java:803)

testConstructor_String_char_char(org.apache.commons.lang3.text.StrTokenizerTest)  Time elapsed: 0 sec  <<< ERROR!
java.lang.ArrayIndexOutOfBoundsException: -1
	at org.apache.commons.lang3.text.StrMatcher$CharMatcher.isMatch(StrMatcher.java:334)
	at org.apache.commons.lang3.text.StrTokenizer.readNextToken(StrTokenizer.java:138)
	at org.apache.commons.lang3.text.StrTokenizer.tokenize(StrTokenizer.java:127)
	at org.apache.commons.lang3.text.StrTokenizer.checkTokenized(StrTokenizer.java:121)
	at org.apache.commons.lang3.text.StrTokenizer.hasNext(StrTokenizer.java:106)
	at org.apache.commons.lang3.text.StrTokenizer.next(StrTokenizer.java:108)
	at org.apache.commons.lang3.text.StrTokenizerTest.testConstructor_String_char_char(StrTokenizerTest.java:660)

testReset(org.apache.commons.lang3.text.StrTokenizerTest)  Time elapsed: 0.001 sec  <<< ERROR!
java.lang.ArrayIndexOutOfBoundsException: -1
	at org.apache.commons.lang3.text.StrMatcher$CharSetMatcher.isMatch(StrMatcher.java:301)
	at org.apache.commons.lang3.text.StrTokenizer.readNextToken(StrTokenizer.java:138)
	at org.apache.commons.lang3.text.StrTokenizer.tokenize(StrTokenizer.java:127)
	at org.apache.commons.lang3.text.StrTokenizer.checkTokenized(StrTokenizer.java:121)
	at org.apache.commons.lang3.text.StrTokenizer.hasNext(StrTokenizer.java:106)
	at org.apache.commons.lang3.text.StrTokenizer.next(StrTokenizer.java:108)
	at org.apache.commons.lang3.text.StrTokenizerTest.testReset(StrTokenizerTest.java:723)

testReset_charArray(org.apache.commons.lang3.text.StrTokenizerTest)  Time elapsed: 0 sec  <<< ERROR!
java.lang.ArrayIndexOutOfBoundsException: -1
	at org.apache.commons.lang3.text.StrMatcher$CharSetMatcher.isMatch(StrMatcher.java:301)
	at org.apache.commons.lang3.text.StrTokenizer.readNextToken(StrTokenizer.java:138)
	at org.apache.commons.lang3.text.StrTokenizer.tokenize(StrTokenizer.java:127)
	at org.apache.commons.lang3.text.StrTokenizer.checkTokenized(StrTokenizer.java:121)
	at org.apache.commons.lang3.text.StrTokenizer.hasNext(StrTokenizer.java:106)
	at org.apache.commons.lang3.text.StrTokenizer.next(StrTokenizer.java:108)
	at org.apache.commons.lang3.text.StrTokenizerTest.testReset_charArray(StrTokenizerTest.java:755)

testToString(org.apache.commons.lang3.text.StrTokenizerTest)  Time elapsed: 0 sec  <<< ERROR!
java.lang.ArrayIndexOutOfBoundsException: -1
	at org.apache.commons.lang3.text.StrMatcher$CharSetMatcher.isMatch(StrMatcher.java:301)
	at org.apache.commons.lang3.text.StrTokenizer.readNextToken(StrTokenizer.java:138)
	at org.apache.commons.lang3.text.StrTokenizer.tokenize(StrTokenizer.java:127)
	at org.apache.commons.lang3.text.StrTokenizer.checkTokenized(StrTokenizer.java:121)
	at org.apache.commons.lang3.text.StrTokenizer.hasNext(StrTokenizer.java:106)
	at org.apache.commons.lang3.text.StrTokenizer.next(StrTokenizer.java:108)
	at org.apache.commons.lang3.text.StrTokenizerTest.testToString(StrTokenizerTest.java:876)

testTokenizeSubclassOutputChange(org.apache.commons.lang3.text.StrTokenizerTest)  Time elapsed: 0 sec  <<< ERROR!
java.lang.ArrayIndexOutOfBoundsException: -1
	at org.apache.commons.lang3.text.StrMatcher$CharSetMatcher.isMatch(StrMatcher.java:301)
	at org.apache.commons.lang3.text.StrTokenizer.readNextToken(StrTokenizer.java:138)
	at org.apache.commons.lang3.text.StrTokenizer.tokenize(StrTokenizer.java:127)
	at org.apache.commons.lang3.text.StrTokenizerTest$3.tokenize(StrTokenizerTest.java:861)
	at org.apache.commons.lang3.text.StrTokenizer.checkTokenized(StrTokenizer.java:121)
	at org.apache.commons.lang3.text.StrTokenizer.hasNext(StrTokenizer.java:106)
	at org.apache.commons.lang3.text.StrTokenizer.next(StrTokenizer.java:108)
	at org.apache.commons.lang3.text.StrTokenizerTest.testTokenizeSubclassOutputChange(StrTokenizerTest.java:866)

testListArray(org.apache.commons.lang3.text.StrTokenizerTest)  Time elapsed: 0 sec  <<< ERROR!
java.lang.ArrayIndexOutOfBoundsException: -1
	at org.apache.commons.lang3.text.StrMatcher$CharSetMatcher.isMatch(StrMatcher.java:301)
	at org.apache.commons.lang3.text.StrTokenizer.readNextToken(StrTokenizer.java:138)
	at org.apache.commons.lang3.text.StrTokenizer.tokenize(StrTokenizer.java:127)
	at org.apache.commons.lang3.text.StrTokenizer.checkTokenized(StrTokenizer.java:121)
	at org.apache.commons.lang3.text.StrTokenizer.getTokenArray(StrTokenizer.java:90)
	at org.apache.commons.lang3.text.StrTokenizerTest.testListArray(StrTokenizerTest.java:503)

testBasicQuoted1(org.apache.commons.lang3.text.StrTokenizerTest)  Time elapsed: 0 sec  <<< ERROR!
java.lang.ArrayIndexOutOfBoundsException: -1
	at org.apache.commons.lang3.text.StrMatcher$CharMatcher.isMatch(StrMatcher.java:334)
	at org.apache.commons.lang3.text.StrTokenizer.readNextToken(StrTokenizer.java:138)
	at org.apache.commons.lang3.text.StrTokenizer.tokenize(StrTokenizer.java:127)
	at org.apache.commons.lang3.text.StrTokenizer.checkTokenized(StrTokenizer.java:121)
	at org.apache.commons.lang3.text.StrTokenizer.hasNext(StrTokenizer.java:106)
	at org.apache.commons.lang3.text.StrTokenizer.next(StrTokenizer.java:108)
	at org.apache.commons.lang3.text.StrTokenizerTest.testBasicQuoted1(StrTokenizerTest.java:328)

testBasicQuoted2(org.apache.commons.lang3.text.StrTokenizerTest)  Time elapsed: 0 sec  <<< ERROR!
java.lang.ArrayIndexOutOfBoundsException: -1
	at org.apache.commons.lang3.text.StrMatcher$CharMatcher.isMatch(StrMatcher.java:334)
	at org.apache.commons.lang3.text.StrTokenizer.readNextToken(StrTokenizer.java:138)
	at org.apache.commons.lang3.text.StrTokenizer.tokenize(StrTokenizer.java:127)
	at org.apache.commons.lang3.text.StrTokenizer.checkTokenized(StrTokenizer.java:121)
	at org.apache.commons.lang3.text.StrTokenizer.hasNext(StrTokenizer.java:106)
	at org.apache.commons.lang3.text.StrTokenizer.next(StrTokenizer.java:108)
	at org.apache.commons.lang3.text.StrTokenizerTest.testBasicQuoted2(StrTokenizerTest.java:340)

testBasicQuoted3(org.apache.commons.lang3.text.StrTokenizerTest)  Time elapsed: 0 sec  <<< ERROR!
java.lang.ArrayIndexOutOfBoundsException: -1
	at org.apache.commons.lang3.text.StrMatcher$CharMatcher.isMatch(StrMatcher.java:334)
	at org.apache.commons.lang3.text.StrTokenizer.readNextToken(StrTokenizer.java:138)
	at org.apache.commons.lang3.text.StrTokenizer.tokenize(StrTokenizer.java:127)
	at org.apache.commons.lang3.text.StrTokenizer.checkTokenized(StrTokenizer.java:121)
	at org.apache.commons.lang3.text.StrTokenizer.hasNext(StrTokenizer.java:106)
	at org.apache.commons.lang3.text.StrTokenizer.next(StrTokenizer.java:108)
	at org.apache.commons.lang3.text.StrTokenizerTest.testBasicQuoted3(StrTokenizerTest.java:352)

testBasicQuoted4(org.apache.commons.lang3.text.StrTokenizerTest)  Time elapsed: 0 sec  <<< ERROR!
java.lang.ArrayIndexOutOfBoundsException: -1
	at org.apache.commons.lang3.text.StrMatcher$TrimMatcher.isMatch(StrMatcher.java:432)
	at org.apache.commons.lang3.text.StrTokenizer.readNextToken(StrTokenizer.java:133)
	at org.apache.commons.lang3.text.StrTokenizer.tokenize(StrTokenizer.java:127)
	at org.apache.commons.lang3.text.StrTokenizer.checkTokenized(StrTokenizer.java:121)
	at org.apache.commons.lang3.text.StrTokenizer.hasNext(StrTokenizer.java:106)
	at org.apache.commons.lang3.text.StrTokenizer.next(StrTokenizer.java:108)
	at org.apache.commons.lang3.text.StrTokenizerTest.testBasicQuoted4(StrTokenizerTest.java:364)

testBasicQuoted5(org.apache.commons.lang3.text.StrTokenizerTest)  Time elapsed: 0 sec  <<< ERROR!
java.lang.ArrayIndexOutOfBoundsException: -1
	at org.apache.commons.lang3.text.StrMatcher$TrimMatcher.isMatch(StrMatcher.java:432)
	at org.apache.commons.lang3.text.StrTokenizer.readNextToken(StrTokenizer.java:133)
	at org.apache.commons.lang3.text.StrTokenizer.tokenize(StrTokenizer.java:127)
	at org.apache.commons.lang3.text.StrTokenizer.checkTokenized(StrTokenizer.java:121)
	at org.apache.commons.lang3.text.StrTokenizer.hasNext(StrTokenizer.java:106)
	at org.apache.commons.lang3.text.StrTokenizer.next(StrTokenizer.java:108)
	at org.apache.commons.lang3.text.StrTokenizerTest.testBasicQuoted5(StrTokenizerTest.java:377)

testBasicQuoted6(org.apache.commons.lang3.text.StrTokenizerTest)  Time elapsed: 0 sec  <<< ERROR!
java.lang.ArrayIndexOutOfBoundsException: -1
	at org.apache.commons.lang3.text.StrMatcher$CharMatcher.isMatch(StrMatcher.java:334)
	at org.apache.commons.lang3.text.StrTokenizer.readNextToken(StrTokenizer.java:138)
	at org.apache.commons.lang3.text.StrTokenizer.tokenize(StrTokenizer.java:127)
	at org.apache.commons.lang3.text.StrTokenizer.checkTokenized(StrTokenizer.java:121)
	at org.apache.commons.lang3.text.StrTokenizer.hasNext(StrTokenizer.java:106)
	at org.apache.commons.lang3.text.StrTokenizer.next(StrTokenizer.java:108)
	at org.apache.commons.lang3.text.StrTokenizerTest.testBasicQuoted6(StrTokenizerTest.java:388)

testBasicQuoted7(org.apache.commons.lang3.text.StrTokenizerTest)  Time elapsed: 0 sec  <<< ERROR!
java.lang.ArrayIndexOutOfBoundsException: -1
	at org.apache.commons.lang3.text.StrMatcher$CharMatcher.isMatch(StrMatcher.java:334)
	at org.apache.commons.lang3.text.StrTokenizer.readNextToken(StrTokenizer.java:138)
	at org.apache.commons.lang3.text.StrTokenizer.tokenize(StrTokenizer.java:127)
	at org.apache.commons.lang3.text.StrTokenizer.checkTokenized(StrTokenizer.java:121)
	at org.apache.commons.lang3.text.StrTokenizer.hasNext(StrTokenizer.java:106)
	at org.apache.commons.lang3.text.StrTokenizer.next(StrTokenizer.java:108)
	at org.apache.commons.lang3.text.StrTokenizerTest.testBasicQuoted7(StrTokenizerTest.java:398)

testReset_String(org.apache.commons.lang3.text.StrTokenizerTest)  Time elapsed: 0 sec  <<< ERROR!
java.lang.ArrayIndexOutOfBoundsException: -1
	at org.apache.commons.lang3.text.StrMatcher$CharSetMatcher.isMatch(StrMatcher.java:301)
	at org.apache.commons.lang3.text.StrTokenizer.readNextToken(StrTokenizer.java:138)
	at org.apache.commons.lang3.text.StrTokenizer.tokenize(StrTokenizer.java:127)
	at org.apache.commons.lang3.text.StrTokenizer.checkTokenized(StrTokenizer.java:121)
	at org.apache.commons.lang3.text.StrTokenizer.hasNext(StrTokenizer.java:106)
	at org.apache.commons.lang3.text.StrTokenizer.next(StrTokenizer.java:108)
	at org.apache.commons.lang3.text.StrTokenizerTest.testReset_String(StrTokenizerTest.java:740)

testConstructor_String(org.apache.commons.lang3.text.StrTokenizerTest)  Time elapsed: 0 sec  <<< ERROR!
java.lang.ArrayIndexOutOfBoundsException: -1
	at org.apache.commons.lang3.text.StrMatcher$CharSetMatcher.isMatch(StrMatcher.java:301)
	at org.apache.commons.lang3.text.StrTokenizer.readNextToken(StrTokenizer.java:138)
	at org.apache.commons.lang3.text.StrTokenizer.tokenize(StrTokenizer.java:127)
	at org.apache.commons.lang3.text.StrTokenizer.checkTokenized(StrTokenizer.java:121)
	at org.apache.commons.lang3.text.StrTokenizer.hasNext(StrTokenizer.java:106)
	at org.apache.commons.lang3.text.StrTokenizer.next(StrTokenizer.java:108)
	at org.apache.commons.lang3.text.StrTokenizerTest.testConstructor_String(StrTokenizerTest.java:627)

test1(org.apache.commons.lang3.text.StrTokenizerTest)  Time elapsed: 0.001 sec  <<< ERROR!
java.lang.ArrayIndexOutOfBoundsException: -1
	at org.apache.commons.lang3.text.StrMatcher$TrimMatcher.isMatch(StrMatcher.java:432)
	at org.apache.commons.lang3.text.StrTokenizer.readNextToken(StrTokenizer.java:133)
	at org.apache.commons.lang3.text.StrTokenizer.tokenize(StrTokenizer.java:127)
	at org.apache.commons.lang3.text.StrTokenizer.checkTokenized(StrTokenizer.java:121)
	at org.apache.commons.lang3.text.StrTokenizer.getTokenArray(StrTokenizer.java:90)
	at org.apache.commons.lang3.text.StrTokenizerTest.test1(StrTokenizerTest.java:56)

test2(org.apache.commons.lang3.text.StrTokenizerTest)  Time elapsed: 0 sec  <<< ERROR!
java.lang.ArrayIndexOutOfBoundsException: -1
	at org.apache.commons.lang3.text.StrMatcher$CharMatcher.isMatch(StrMatcher.java:334)
	at org.apache.commons.lang3.text.StrTokenizer.readNextToken(StrTokenizer.java:138)
	at org.apache.commons.lang3.text.StrTokenizer.tokenize(StrTokenizer.java:127)
	at org.apache.commons.lang3.text.StrTokenizer.checkTokenized(StrTokenizer.java:121)
	at org.apache.commons.lang3.text.StrTokenizer.getTokenArray(StrTokenizer.java:90)
	at org.apache.commons.lang3.text.StrTokenizerTest.test2(StrTokenizerTest.java:77)

test3(org.apache.commons.lang3.text.StrTokenizerTest)  Time elapsed: 0.001 sec  <<< ERROR!
java.lang.ArrayIndexOutOfBoundsException: -1
	at org.apache.commons.lang3.text.StrMatcher$CharMatcher.isMatch(StrMatcher.java:334)
	at org.apache.commons.lang3.text.StrTokenizer.readNextToken(StrTokenizer.java:138)
	at org.apache.commons.lang3.text.StrTokenizer.tokenize(StrTokenizer.java:127)
	at org.apache.commons.lang3.text.StrTokenizer.checkTokenized(StrTokenizer.java:121)
	at org.apache.commons.lang3.text.StrTokenizer.getTokenArray(StrTokenizer.java:90)
	at org.apache.commons.lang3.text.StrTokenizerTest.test3(StrTokenizerTest.java:98)

test4(org.apache.commons.lang3.text.StrTokenizerTest)  Time elapsed: 0 sec  <<< ERROR!
java.lang.ArrayIndexOutOfBoundsException: -1
	at org.apache.commons.lang3.text.StrMatcher$TrimMatcher.isMatch(StrMatcher.java:432)
	at org.apache.commons.lang3.text.StrTokenizer.readNextToken(StrTokenizer.java:133)
	at org.apache.commons.lang3.text.StrTokenizer.tokenize(StrTokenizer.java:127)
	at org.apache.commons.lang3.text.StrTokenizer.checkTokenized(StrTokenizer.java:121)
	at org.apache.commons.lang3.text.StrTokenizer.getTokenArray(StrTokenizer.java:90)
	at org.apache.commons.lang3.text.StrTokenizerTest.test4(StrTokenizerTest.java:119)

test5(org.apache.commons.lang3.text.StrTokenizerTest)  Time elapsed: 0 sec  <<< ERROR!
java.lang.ArrayIndexOutOfBoundsException: -1
	at org.apache.commons.lang3.text.StrMatcher$TrimMatcher.isMatch(StrMatcher.java:432)
	at org.apache.commons.lang3.text.StrTokenizer.readNextToken(StrTokenizer.java:133)
	at org.apache.commons.lang3.text.StrTokenizer.tokenize(StrTokenizer.java:127)
	at org.apache.commons.lang3.text.StrTokenizer.checkTokenized(StrTokenizer.java:121)
	at org.apache.commons.lang3.text.StrTokenizer.getTokenArray(StrTokenizer.java:90)
	at org.apache.commons.lang3.text.StrTokenizerTest.test5(StrTokenizerTest.java:141)

test6(org.apache.commons.lang3.text.StrTokenizerTest)  Time elapsed: 0 sec  <<< ERROR!
java.lang.ArrayIndexOutOfBoundsException: -1
	at org.apache.commons.lang3.text.StrMatcher$TrimMatcher.isMatch(StrMatcher.java:432)
	at org.apache.commons.lang3.text.StrTokenizer.readNextToken(StrTokenizer.java:133)
	at org.apache.commons.lang3.text.StrTokenizer.tokenize(StrTokenizer.java:127)
	at org.apache.commons.lang3.text.StrTokenizer.checkTokenized(StrTokenizer.java:121)
	at org.apache.commons.lang3.text.StrTokenizer.getTokenArray(StrTokenizer.java:90)
	at org.apache.commons.lang3.text.StrTokenizerTest.test6(StrTokenizerTest.java:163)

test7(org.apache.commons.lang3.text.StrTokenizerTest)  Time elapsed: 0.001 sec  <<< ERROR!
java.lang.ArrayIndexOutOfBoundsException: -1
	at org.apache.commons.lang3.text.StrMatcher$CharMatcher.isMatch(StrMatcher.java:334)
	at org.apache.commons.lang3.text.StrTokenizer.readNextToken(StrTokenizer.java:138)
	at org.apache.commons.lang3.text.StrTokenizer.tokenize(StrTokenizer.java:127)
	at org.apache.commons.lang3.text.StrTokenizer.checkTokenized(StrTokenizer.java:121)
	at org.apache.commons.lang3.text.StrTokenizer.getTokenArray(StrTokenizer.java:90)
	at org.apache.commons.lang3.text.StrTokenizerTest.test7(StrTokenizerTest.java:198)

test8(org.apache.commons.lang3.text.StrTokenizerTest)  Time elapsed: 0 sec  <<< ERROR!
java.lang.ArrayIndexOutOfBoundsException: -1
	at org.apache.commons.lang3.text.StrMatcher$CharMatcher.isMatch(StrMatcher.java:334)
	at org.apache.commons.lang3.text.StrTokenizer.readNextToken(StrTokenizer.java:138)
	at org.apache.commons.lang3.text.StrTokenizer.tokenize(StrTokenizer.java:127)
	at org.apache.commons.lang3.text.StrTokenizer.checkTokenized(StrTokenizer.java:121)
	at org.apache.commons.lang3.text.StrTokenizer.getTokenArray(StrTokenizer.java:90)
	at org.apache.commons.lang3.text.StrTokenizerTest.test8(StrTokenizerTest.java:219)

testConstructor_String_char(org.apache.commons.lang3.text.StrTokenizerTest)  Time elapsed: 0.001 sec  <<< ERROR!
java.lang.ArrayIndexOutOfBoundsException: -1
	at org.apache.commons.lang3.text.StrMatcher$CharMatcher.isMatch(StrMatcher.java:334)
	at org.apache.commons.lang3.text.StrTokenizer.readNextToken(StrTokenizer.java:138)
	at org.apache.commons.lang3.text.StrTokenizer.tokenize(StrTokenizer.java:127)
	at org.apache.commons.lang3.text.StrTokenizer.checkTokenized(StrTokenizer.java:121)
	at org.apache.commons.lang3.text.StrTokenizer.hasNext(StrTokenizer.java:106)
	at org.apache.commons.lang3.text.StrTokenizer.next(StrTokenizer.java:108)
	at org.apache.commons.lang3.text.StrTokenizerTest.testConstructor_String_char(StrTokenizerTest.java:643)

testTokenizeSubclassInputChange(org.apache.commons.lang3.text.StrTokenizerTest)  Time elapsed: 0 sec  <<< ERROR!
java.lang.ArrayIndexOutOfBoundsException: -1
	at org.apache.commons.lang3.text.StrMatcher$CharSetMatcher.isMatch(StrMatcher.java:301)
	at org.apache.commons.lang3.text.StrTokenizer.readNextToken(StrTokenizer.java:138)
	at org.apache.commons.lang3.text.StrTokenizer.tokenize(StrTokenizer.java:127)
	at org.apache.commons.lang3.text.StrTokenizerTest$2.tokenize(StrTokenizerTest.java:848)
	at org.apache.commons.lang3.text.StrTokenizer.checkTokenized(StrTokenizer.java:121)
	at org.apache.commons.lang3.text.StrTokenizer.hasNext(StrTokenizer.java:106)
	at org.apache.commons.lang3.text.StrTokenizer.next(StrTokenizer.java:108)
	at org.apache.commons.lang3.text.StrTokenizerTest.testTokenizeSubclassInputChange(StrTokenizerTest.java:851)

testConstructor_charArray(org.apache.commons.lang3.text.StrTokenizerTest)  Time elapsed: 0 sec  <<< ERROR!
java.lang.ArrayIndexOutOfBoundsException: -1
	at org.apache.commons.lang3.text.StrMatcher$CharSetMatcher.isMatch(StrMatcher.java:301)
	at org.apache.commons.lang3.text.StrTokenizer.readNextToken(StrTokenizer.java:138)
	at org.apache.commons.lang3.text.StrTokenizer.tokenize(StrTokenizer.java:127)
	at org.apache.commons.lang3.text.StrTokenizer.checkTokenized(StrTokenizer.java:121)
	at org.apache.commons.lang3.text.StrTokenizer.hasNext(StrTokenizer.java:106)
	at org.apache.commons.lang3.text.StrTokenizer.next(StrTokenizer.java:108)
	at org.apache.commons.lang3.text.StrTokenizerTest.testConstructor_charArray(StrTokenizerTest.java:675)

testConstructor_charArray_char_char(org.apache.commons.lang3.text.StrTokenizerTest)  Time elapsed: 0 sec  <<< ERROR!
java.lang.ArrayIndexOutOfBoundsException: -1
	at org.apache.commons.lang3.text.StrMatcher$CharMatcher.isMatch(StrMatcher.java:334)
	at org.apache.commons.lang3.text.StrTokenizer.readNextToken(StrTokenizer.java:138)
	at org.apache.commons.lang3.text.StrTokenizer.tokenize(StrTokenizer.java:127)
	at org.apache.commons.lang3.text.StrTokenizer.checkTokenized(StrTokenizer.java:121)
	at org.apache.commons.lang3.text.StrTokenizer.hasNext(StrTokenizer.java:106)
	at org.apache.commons.lang3.text.StrTokenizer.next(StrTokenizer.java:108)
	at org.apache.commons.lang3.text.StrTokenizerTest.testConstructor_charArray_char_char(StrTokenizerTest.java:708)

testCSVSimpleNeedsTrim(org.apache.commons.lang3.text.StrTokenizerTest)  Time elapsed: 0 sec  <<< ERROR!
java.lang.ArrayIndexOutOfBoundsException: -1
	at org.apache.commons.lang3.text.StrMatcher$TrimMatcher.isMatch(StrMatcher.java:432)
	at org.apache.commons.lang3.text.StrTokenizer.readNextToken(StrTokenizer.java:133)
	at org.apache.commons.lang3.text.StrTokenizer.tokenize(StrTokenizer.java:127)
	at org.apache.commons.lang3.text.StrTokenizer.checkTokenized(StrTokenizer.java:121)
	at org.apache.commons.lang3.text.StrTokenizer.hasPrevious(StrTokenizer.java:111)
	at org.apache.commons.lang3.text.StrTokenizer.previousToken(StrTokenizer.java:88)
	at org.apache.commons.lang3.text.StrTokenizerTest.testXSVAbc(StrTokenizerTest.java:779)
	at org.apache.commons.lang3.text.StrTokenizerTest.testCSV(StrTokenizerTest.java:512)
	at org.apache.commons.lang3.text.StrTokenizerTest.testCSVSimpleNeedsTrim(StrTokenizerTest.java:529)

testBasicIgnoreTrimmed1(org.apache.commons.lang3.text.StrTokenizerTest)  Time elapsed: 0 sec  <<< ERROR!
java.lang.ArrayIndexOutOfBoundsException: -1
	at org.apache.commons.lang3.text.StrMatcher$StringMatcher.isMatch(StrMatcher.java:372)
	at org.apache.commons.lang3.text.StrTokenizer.readNextToken(StrTokenizer.java:133)
	at org.apache.commons.lang3.text.StrTokenizer.tokenize(StrTokenizer.java:127)
	at org.apache.commons.lang3.text.StrTokenizer.checkTokenized(StrTokenizer.java:121)
	at org.apache.commons.lang3.text.StrTokenizer.hasNext(StrTokenizer.java:106)
	at org.apache.commons.lang3.text.StrTokenizer.next(StrTokenizer.java:108)
	at org.apache.commons.lang3.text.StrTokenizerTest.testBasicIgnoreTrimmed1(StrTokenizerTest.java:451)

testBasicIgnoreTrimmed2(org.apache.commons.lang3.text.StrTokenizerTest)  Time elapsed: 0 sec  <<< ERROR!
java.lang.ArrayIndexOutOfBoundsException: -1
	at org.apache.commons.lang3.text.StrMatcher$StringMatcher.isMatch(StrMatcher.java:372)
	at org.apache.commons.lang3.text.StrTokenizer.readNextToken(StrTokenizer.java:133)
	at org.apache.commons.lang3.text.StrTokenizer.tokenize(StrTokenizer.java:127)
	at org.apache.commons.lang3.text.StrTokenizer.checkTokenized(StrTokenizer.java:121)
	at org.apache.commons.lang3.text.StrTokenizer.hasNext(StrTokenizer.java:106)
	at org.apache.commons.lang3.text.StrTokenizer.next(StrTokenizer.java:108)
	at org.apache.commons.lang3.text.StrTokenizerTest.testBasicIgnoreTrimmed2(StrTokenizerTest.java:465)

testBasicIgnoreTrimmed3(org.apache.commons.lang3.text.StrTokenizerTest)  Time elapsed: 0 sec  <<< ERROR!
java.lang.ArrayIndexOutOfBoundsException: -1
	at org.apache.commons.lang3.text.StrMatcher$StringMatcher.isMatch(StrMatcher.java:372)
	at org.apache.commons.lang3.text.StrTokenizer.readNextToken(StrTokenizer.java:133)
	at org.apache.commons.lang3.text.StrTokenizer.tokenize(StrTokenizer.java:127)
	at org.apache.commons.lang3.text.StrTokenizer.checkTokenized(StrTokenizer.java:121)
	at org.apache.commons.lang3.text.StrTokenizer.hasNext(StrTokenizer.java:106)
	at org.apache.commons.lang3.text.StrTokenizer.next(StrTokenizer.java:108)
	at org.apache.commons.lang3.text.StrTokenizerTest.testBasicIgnoreTrimmed3(StrTokenizerTest.java:478)

testBasicIgnoreTrimmed4(org.apache.commons.lang3.text.StrTokenizerTest)  Time elapsed: 0 sec  <<< ERROR!
java.lang.ArrayIndexOutOfBoundsException: -1
	at org.apache.commons.lang3.text.StrMatcher$StringMatcher.isMatch(StrMatcher.java:372)
	at org.apache.commons.lang3.text.StrTokenizer.readNextToken(StrTokenizer.java:133)
	at org.apache.commons.lang3.text.StrTokenizer.tokenize(StrTokenizer.java:127)
	at org.apache.commons.lang3.text.StrTokenizer.checkTokenized(StrTokenizer.java:121)
	at org.apache.commons.lang3.text.StrTokenizer.hasNext(StrTokenizer.java:106)
	at org.apache.commons.lang3.text.StrTokenizer.next(StrTokenizer.java:108)
	at org.apache.commons.lang3.text.StrTokenizerTest.testBasicIgnoreTrimmed4(StrTokenizerTest.java:492)

testBasicQuotedTrimmed1(org.apache.commons.lang3.text.StrTokenizerTest)  Time elapsed: 0 sec  <<< ERROR!
java.lang.ArrayIndexOutOfBoundsException: -1
	at org.apache.commons.lang3.text.StrMatcher$TrimMatcher.isMatch(StrMatcher.java:432)
	at org.apache.commons.lang3.text.StrTokenizer.readNextToken(StrTokenizer.java:133)
	at org.apache.commons.lang3.text.StrTokenizer.tokenize(StrTokenizer.java:127)
	at org.apache.commons.lang3.text.StrTokenizer.checkTokenized(StrTokenizer.java:121)
	at org.apache.commons.lang3.text.StrTokenizer.hasNext(StrTokenizer.java:106)
	at org.apache.commons.lang3.text.StrTokenizer.next(StrTokenizer.java:108)
	at org.apache.commons.lang3.text.StrTokenizerTest.testBasicQuotedTrimmed1(StrTokenizerTest.java:411)

testBasic1(org.apache.commons.lang3.text.StrTokenizerTest)  Time elapsed: 0 sec  <<< ERROR!
java.lang.ArrayIndexOutOfBoundsException: -1
	at org.apache.commons.lang3.text.StrMatcher$CharSetMatcher.isMatch(StrMatcher.java:301)
	at org.apache.commons.lang3.text.StrTokenizer.readNextToken(StrTokenizer.java:138)
	at org.apache.commons.lang3.text.StrTokenizer.tokenize(StrTokenizer.java:127)
	at org.apache.commons.lang3.text.StrTokenizer.checkTokenized(StrTokenizer.java:121)
	at org.apache.commons.lang3.text.StrTokenizer.hasNext(StrTokenizer.java:106)
	at org.apache.commons.lang3.text.StrTokenizer.next(StrTokenizer.java:108)
	at org.apache.commons.lang3.text.StrTokenizerTest.testBasic1(StrTokenizerTest.java:235)

testBasic2(org.apache.commons.lang3.text.StrTokenizerTest)  Time elapsed: 0 sec  <<< ERROR!
java.lang.ArrayIndexOutOfBoundsException: -1
	at org.apache.commons.lang3.text.StrMatcher$CharSetMatcher.isMatch(StrMatcher.java:301)
	at org.apache.commons.lang3.text.StrTokenizer.readNextToken(StrTokenizer.java:138)
	at org.apache.commons.lang3.text.StrTokenizer.tokenize(StrTokenizer.java:127)
	at org.apache.commons.lang3.text.StrTokenizer.checkTokenized(StrTokenizer.java:121)
	at org.apache.commons.lang3.text.StrTokenizer.hasNext(StrTokenizer.java:106)
	at org.apache.commons.lang3.text.StrTokenizer.next(StrTokenizer.java:108)
	at org.apache.commons.lang3.text.StrTokenizerTest.testBasic2(StrTokenizerTest.java:245)

testBasic3(org.apache.commons.lang3.text.StrTokenizerTest)  Time elapsed: 0 sec  <<< ERROR!
java.lang.ArrayIndexOutOfBoundsException: -1
	at org.apache.commons.lang3.text.StrMatcher$CharSetMatcher.isMatch(StrMatcher.java:301)
	at org.apache.commons.lang3.text.StrTokenizer.readNextToken(StrTokenizer.java:138)
	at org.apache.commons.lang3.text.StrTokenizer.tokenize(StrTokenizer.java:127)
	at org.apache.commons.lang3.text.StrTokenizer.checkTokenized(StrTokenizer.java:121)
	at org.apache.commons.lang3.text.StrTokenizer.hasNext(StrTokenizer.java:106)
	at org.apache.commons.lang3.text.StrTokenizer.next(StrTokenizer.java:108)
	at org.apache.commons.lang3.text.StrTokenizerTest.testBasic3(StrTokenizerTest.java:255)

testBasic4(org.apache.commons.lang3.text.StrTokenizerTest)  Time elapsed: 0.001 sec  <<< ERROR!
java.lang.ArrayIndexOutOfBoundsException: -1
	at org.apache.commons.lang3.text.StrMatcher$CharSetMatcher.isMatch(StrMatcher.java:301)
	at org.apache.commons.lang3.text.StrTokenizer.readNextToken(StrTokenizer.java:138)
	at org.apache.commons.lang3.text.StrTokenizer.tokenize(StrTokenizer.java:127)
	at org.apache.commons.lang3.text.StrTokenizer.checkTokenized(StrTokenizer.java:121)
	at org.apache.commons.lang3.text.StrTokenizer.hasNext(StrTokenizer.java:106)
	at org.apache.commons.lang3.text.StrTokenizer.next(StrTokenizer.java:108)
	at org.apache.commons.lang3.text.StrTokenizerTest.testBasic4(StrTokenizerTest.java:265)

testBasic5(org.apache.commons.lang3.text.StrTokenizerTest)  Time elapsed: 0 sec  <<< ERROR!
java.lang.ArrayIndexOutOfBoundsException: -1
	at org.apache.commons.lang3.text.StrMatcher$CharMatcher.isMatch(StrMatcher.java:334)
	at org.apache.commons.lang3.text.StrTokenizer.readNextToken(StrTokenizer.java:138)
	at org.apache.commons.lang3.text.StrTokenizer.tokenize(StrTokenizer.java:127)
	at org.apache.commons.lang3.text.StrTokenizer.checkTokenized(StrTokenizer.java:121)
	at org.apache.commons.lang3.text.StrTokenizer.hasNext(StrTokenizer.java:106)
	at org.apache.commons.lang3.text.StrTokenizer.next(StrTokenizer.java:108)
	at org.apache.commons.lang3.text.StrTokenizerTest.testBasic5(StrTokenizerTest.java:275)

testCloneReset(org.apache.commons.lang3.text.StrTokenizerTest)  Time elapsed: 0.001 sec  <<< ERROR!
java.lang.ArrayIndexOutOfBoundsException: -1
	at org.apache.commons.lang3.text.StrMatcher$CharSetMatcher.isMatch(StrMatcher.java:301)
	at org.apache.commons.lang3.text.StrTokenizer.readNextToken(StrTokenizer.java:138)
	at org.apache.commons.lang3.text.StrTokenizer.tokenize(StrTokenizer.java:127)
	at org.apache.commons.lang3.text.StrTokenizer.checkTokenized(StrTokenizer.java:121)
	at org.apache.commons.lang3.text.StrTokenizer.hasNext(StrTokenizer.java:106)
	at org.apache.commons.lang3.text.StrTokenizer.nextToken(StrTokenizer.java:86)
	at org.apache.commons.lang3.text.StrTokenizerTest.testCloneReset(StrTokenizerTest.java:612)

testBasicTrimmed1(org.apache.commons.lang3.text.StrTokenizerTest)  Time elapsed: 0 sec  <<< ERROR!
java.lang.ArrayIndexOutOfBoundsException: -1
	at org.apache.commons.lang3.text.StrMatcher$TrimMatcher.isMatch(StrMatcher.java:432)
	at org.apache.commons.lang3.text.StrTokenizer.readNextToken(StrTokenizer.java:133)
	at org.apache.commons.lang3.text.StrTokenizer.tokenize(StrTokenizer.java:127)
	at org.apache.commons.lang3.text.StrTokenizer.checkTokenized(StrTokenizer.java:121)
	at org.apache.commons.lang3.text.StrTokenizer.hasNext(StrTokenizer.java:106)
	at org.apache.commons.lang3.text.StrTokenizer.next(StrTokenizer.java:108)
	at org.apache.commons.lang3.text.StrTokenizerTest.testBasicTrimmed1(StrTokenizerTest.java:424)

testBasicTrimmed2(org.apache.commons.lang3.text.StrTokenizerTest)  Time elapsed: 0.001 sec  <<< ERROR!
java.lang.ArrayIndexOutOfBoundsException: -1
	at org.apache.commons.lang3.text.StrMatcher$StringMatcher.isMatch(StrMatcher.java:372)
	at org.apache.commons.lang3.text.StrTokenizer.readNextToken(StrTokenizer.java:133)
	at org.apache.commons.lang3.text.StrTokenizer.tokenize(StrTokenizer.java:127)
	at org.apache.commons.lang3.text.StrTokenizer.checkTokenized(StrTokenizer.java:121)
	at org.apache.commons.lang3.text.StrTokenizer.hasNext(StrTokenizer.java:106)
	at org.apache.commons.lang3.text.StrTokenizer.next(StrTokenizer.java:108)
	at org.apache.commons.lang3.text.StrTokenizerTest.testBasicTrimmed2(StrTokenizerTest.java:437)

Running org.apache.commons.lang3.text.FormattableUtilsTest
Tests run: 5, Failures: 0, Errors: 0, Skipped: 0, Time elapsed: 0 sec - in org.apache.commons.lang3.text.FormattableUtilsTest
Running org.apache.commons.lang3.text.CompositeFormatTest
Tests run: 2, Failures: 0, Errors: 0, Skipped: 0, Time elapsed: 0 sec - in org.apache.commons.lang3.text.CompositeFormatTest
Running org.apache.commons.lang3.text.WordUtilsTest
Tests run: 12, Failures: 0, Errors: 0, Skipped: 0, Time elapsed: 0.001 sec - in org.apache.commons.lang3.text.WordUtilsTest
Running org.apache.commons.lang3.text.StrLookupTest
Tests run: 5, Failures: 0, Errors: 0, Skipped: 0, Time elapsed: 0.001 sec - in org.apache.commons.lang3.text.StrLookupTest
Running org.apache.commons.lang3.text.StrBuilderAppendInsertTest
Tests run: 51, Failures: 0, Errors: 0, Skipped: 0, Time elapsed: 0.004 sec - in org.apache.commons.lang3.text.StrBuilderAppendInsertTest
Running org.apache.commons.lang3.text.ExtendedMessageFormatTest
Tests run: 10, Failures: 0, Errors: 0, Skipped: 0, Time elapsed: 0.834 sec - in org.apache.commons.lang3.text.ExtendedMessageFormatTest
Running org.apache.commons.lang3.text.StrSubstitutorTest
Tests run: 40, Failures: 0, Errors: 0, Skipped: 0, Time elapsed: 0.038 sec - in org.apache.commons.lang3.text.StrSubstitutorTest
Running org.apache.commons.lang3.text.StrBuilderTest
Tests run: 90, Failures: 0, Errors: 1, Skipped: 0, Time elapsed: 0.056 sec <<< FAILURE! - in org.apache.commons.lang3.text.StrBuilderTest
testAsTokenizer(org.apache.commons.lang3.text.StrBuilderTest)  Time elapsed: 0.001 sec  <<< ERROR!
java.lang.ArrayIndexOutOfBoundsException: -1
	at org.apache.commons.lang3.text.StrMatcher$CharSetMatcher.isMatch(StrMatcher.java:301)
	at org.apache.commons.lang3.text.StrTokenizer.readNextToken(StrTokenizer.java:138)
	at org.apache.commons.lang3.text.StrTokenizer.tokenize(StrTokenizer.java:127)
	at org.apache.commons.lang3.text.StrBuilder$StrBuilderTokenizer.tokenize(StrBuilder.java:2964)
	at org.apache.commons.lang3.text.StrTokenizer.checkTokenized(StrTokenizer.java:119)
	at org.apache.commons.lang3.text.StrTokenizer.getTokenArray(StrTokenizer.java:90)
	at org.apache.commons.lang3.text.StrBuilderTest.testAsTokenizer(StrBuilderTest.java:1665)

Running org.apache.commons.lang3.StringEscapeUtilsTest
Tests run: 28, Failures: 0, Errors: 0, Skipped: 0, Time elapsed: 0.503 sec - in org.apache.commons.lang3.StringEscapeUtilsTest
Running org.apache.commons.lang3.AnnotationUtilsTest
Tests run: 10, Failures: 0, Errors: 0, Skipped: 0, Time elapsed: 0.017 sec - in org.apache.commons.lang3.AnnotationUtilsTest
Running org.apache.commons.lang3.ConversionTest
Tests run: 42, Failures: 0, Errors: 0, Skipped: 0, Time elapsed: 0.012 sec - in org.apache.commons.lang3.ConversionTest
Running org.apache.commons.lang3.StringUtilsTrimEmptyTest
Tests run: 15, Failures: 0, Errors: 0, Skipped: 0, Time elapsed: 0.008 sec - in org.apache.commons.lang3.StringUtilsTrimEmptyTest
Running org.apache.commons.lang3.EnumUtilsTest
Tests run: 34, Failures: 0, Errors: 0, Skipped: 0, Time elapsed: 0.012 sec - in org.apache.commons.lang3.EnumUtilsTest
Running org.apache.commons.lang3.exception.ExceptionUtilsTest
Tests run: 28, Failures: 0, Errors: 0, Skipped: 0, Time elapsed: 0.025 sec - in org.apache.commons.lang3.exception.ExceptionUtilsTest
Running org.apache.commons.lang3.exception.DefaultExceptionContextTest
Tests run: 8, Failures: 0, Errors: 0, Skipped: 0, Time elapsed: 0.004 sec - in org.apache.commons.lang3.exception.DefaultExceptionContextTest
Running org.apache.commons.lang3.exception.ContextedExceptionTest
Tests run: 14, Failures: 0, Errors: 0, Skipped: 0, Time elapsed: 0.011 sec - in org.apache.commons.lang3.exception.ContextedExceptionTest
Running org.apache.commons.lang3.exception.ContextedRuntimeExceptionTest
Tests run: 14, Failures: 0, Errors: 0, Skipped: 0, Time elapsed: 0.012 sec - in org.apache.commons.lang3.exception.ContextedRuntimeExceptionTest
Running org.apache.commons.lang3.BitFieldTest
Tests run: 15, Failures: 0, Errors: 0, Skipped: 0, Time elapsed: 0.002 sec - in org.apache.commons.lang3.BitFieldTest
Running org.apache.commons.lang3.ArrayUtilsRemoveMultipleTest
Tests run: 55, Failures: 0, Errors: 0, Skipped: 0, Time elapsed: 0.013 sec - in org.apache.commons.lang3.ArrayUtilsRemoveMultipleTest
Running org.apache.commons.lang3.HashSetvBitSetTest
Ratio=8% array=100 count=1 extract=22689602 bitset=1937848
Ratio=8% array=100 count=10 extract=21890360 bitset=1903284
Ratio=16% array=100 count=50 extract=10345636 bitset=1741693
Ratio=4% array=100 count=100 extract=10787253 bitset=472711
Ratio=82% array=1000 count=10 extract=6460766 bitset=5309446
Ratio=19% array=1000 count=100 extract=25724631 bitset=4954234
Ratio=8% array=1000 count=500 extract=46113165 bitset=4019326
Ratio=1% array=1000 count=1000 extract=75535457 bitset=795695
Ratio=4% count=0 hash=4882308 bits=197391
Ratio=7% count=5 hash=2871060 bits=215181
Ratio=27% count=10 hash=1052911 bits=290845
Ratio=21% count=200 hash=20751810 bits=4541034
Ratio=15% count=50 hash=8675234 bits=1374266
Ratio=29% count=100 hash=9051068 bits=2706970
Ratio=22% count=1000 hash=78175225 bits=17353333
Ratio=25% count=2000 hash=157790976 bits=40405321
Tests run: 2, Failures: 0, Errors: 0, Skipped: 0, Time elapsed: 0.699 sec - in org.apache.commons.lang3.HashSetvBitSetTest
Running org.apache.commons.lang3.StringUtilsTest
Tests run: 124, Failures: 0, Errors: 0, Skipped: 0, Time elapsed: 0.176 sec - in org.apache.commons.lang3.StringUtilsTest
Running org.apache.commons.lang3.ArrayUtilsRemoveTest
Tests run: 19, Failures: 0, Errors: 0, Skipped: 0, Time elapsed: 0.001 sec - in org.apache.commons.lang3.ArrayUtilsRemoveTest
Running org.apache.commons.lang3.ObjectUtilsTest
Tests run: 36, Failures: 0, Errors: 0, Skipped: 0, Time elapsed: 0.015 sec - in org.apache.commons.lang3.ObjectUtilsTest
Running org.apache.commons.lang3.ClassPathUtilsTest
Tests run: 13, Failures: 0, Errors: 0, Skipped: 0, Time elapsed: 0.002 sec - in org.apache.commons.lang3.ClassPathUtilsTest
Running org.apache.commons.lang3.math.NumberUtilsTest
Tests run: 91, Failures: 0, Errors: 0, Skipped: 0, Time elapsed: 0.042 sec - in org.apache.commons.lang3.math.NumberUtilsTest
Running org.apache.commons.lang3.math.IEEE754rUtilsTest
Tests run: 3, Failures: 0, Errors: 0, Skipped: 0, Time elapsed: 0 sec - in org.apache.commons.lang3.math.IEEE754rUtilsTest
Running org.apache.commons.lang3.math.FractionTest
Tests run: 25, Failures: 0, Errors: 0, Skipped: 0, Time elapsed: 0.141 sec - in org.apache.commons.lang3.math.FractionTest
Running org.apache.commons.lang3.BooleanUtilsTest
Tests run: 72, Failures: 0, Errors: 0, Skipped: 0, Time elapsed: 0.03 sec - in org.apache.commons.lang3.BooleanUtilsTest
Running org.apache.commons.lang3.CharSequenceUtilsTest
Tests run: 2, Failures: 0, Errors: 0, Skipped: 0, Time elapsed: 0.002 sec - in org.apache.commons.lang3.CharSequenceUtilsTest
Running org.apache.commons.lang3.CharSetUtilsTest
Tests run: 11, Failures: 0, Errors: 0, Skipped: 0, Time elapsed: 0.007 sec - in org.apache.commons.lang3.CharSetUtilsTest
Running org.apache.commons.lang3.ArrayUtilsAddTest
Tests run: 13, Failures: 0, Errors: 0, Skipped: 0, Time elapsed: 0.008 sec - in org.apache.commons.lang3.ArrayUtilsAddTest
Running org.apache.commons.lang3.CharEncodingTest
Tests run: 6, Failures: 0, Errors: 0, Skipped: 0, Time elapsed: 0.036 sec - in org.apache.commons.lang3.CharEncodingTest
Running org.apache.commons.lang3.ClassUtilsTest
Tests run: 57, Failures: 0, Errors: 0, Skipped: 0, Time elapsed: 0.045 sec - in org.apache.commons.lang3.ClassUtilsTest
Running org.apache.commons.lang3.RangeTest
Tests run: 24, Failures: 0, Errors: 0, Skipped: 0, Time elapsed: 0.015 sec - in org.apache.commons.lang3.RangeTest
Running org.apache.commons.lang3.event.EventUtilsTest
Tests run: 8, Failures: 0, Errors: 0, Skipped: 0, Time elapsed: 0.022 sec - in org.apache.commons.lang3.event.EventUtilsTest
Running org.apache.commons.lang3.event.EventListenerSupportTest
Tests run: 9, Failures: 0, Errors: 0, Skipped: 0, Time elapsed: 0.026 sec - in org.apache.commons.lang3.event.EventListenerSupportTest
Running org.apache.commons.lang3.ArrayUtilsTest
Tests run: 205, Failures: 0, Errors: 0, Skipped: 0, Time elapsed: 0.079 sec - in org.apache.commons.lang3.ArrayUtilsTest
Running org.apache.commons.lang3.CharUtilsTest
Tests run: 24, Failures: 0, Errors: 0, Skipped: 0, Time elapsed: 0.011 sec - in org.apache.commons.lang3.CharUtilsTest
Running org.apache.commons.lang3.NotImplementedExceptionTest
Tests run: 1, Failures: 0, Errors: 0, Skipped: 0, Time elapsed: 0.001 sec - in org.apache.commons.lang3.NotImplementedExceptionTest
Running org.apache.commons.lang3.StringUtilsEqualsIndexOfTest
Tests run: 50, Failures: 0, Errors: 0, Skipped: 0, Time elapsed: 0.019 sec - in org.apache.commons.lang3.StringUtilsEqualsIndexOfTest
Running org.apache.commons.lang3.RandomUtilsTest
Tests run: 23, Failures: 0, Errors: 0, Skipped: 0, Time elapsed: 0.005 sec - in org.apache.commons.lang3.RandomUtilsTest

Results :


Tests in error: 
  StrBuilderTest.testAsTokenizer:1665 » ArrayIndexOutOfBounds -1
  StrTokenizerTest.test1:56 » ArrayIndexOutOfBounds -1
  StrTokenizerTest.test2:77 » ArrayIndexOutOfBounds -1
  StrTokenizerTest.test3:98 » ArrayIndexOutOfBounds -1
  StrTokenizerTest.test4:119 » ArrayIndexOutOfBounds -1
  StrTokenizerTest.test5:141 » ArrayIndexOutOfBounds -1
  StrTokenizerTest.test6:163 » ArrayIndexOutOfBounds -1
  StrTokenizerTest.test7:198 » ArrayIndexOutOfBounds -1
  StrTokenizerTest.test8:219 » ArrayIndexOutOfBounds -1
  StrTokenizerTest.testBasic1:235 » ArrayIndexOutOfBounds -1
  StrTokenizerTest.testBasic2:245 » ArrayIndexOutOfBounds -1
  StrTokenizerTest.testBasic3:255 » ArrayIndexOutOfBounds -1
  StrTokenizerTest.testBasic4:265 » ArrayIndexOutOfBounds -1
  StrTokenizerTest.testBasic5:275 » ArrayIndexOutOfBounds -1
  StrTokenizerTest.testBasicDelim1:285 » ArrayIndexOutOfBounds -1
  StrTokenizerTest.testBasicDelim2:295 » ArrayIndexOutOfBounds -1
  StrTokenizerTest.testBasicEmpty1:304 » ArrayIndexOutOfBounds -1
  StrTokenizerTest.testBasicEmpty2:317 » ArrayIndexOutOfBounds -1
  StrTokenizerTest.testBasicIgnoreTrimmed1:451 » ArrayIndexOutOfBounds -1
  StrTokenizerTest.testBasicIgnoreTrimmed2:465 » ArrayIndexOutOfBounds -1
  StrTokenizerTest.testBasicIgnoreTrimmed3:478 » ArrayIndexOutOfBounds -1
  StrTokenizerTest.testBasicIgnoreTrimmed4:492 » ArrayIndexOutOfBounds -1
  StrTokenizerTest.testBasicQuoted1:328 » ArrayIndexOutOfBounds -1
  StrTokenizerTest.testBasicQuoted2:340 » ArrayIndexOutOfBounds -1
  StrTokenizerTest.testBasicQuoted3:352 » ArrayIndexOutOfBounds -1
  StrTokenizerTest.testBasicQuoted4:364 » ArrayIndexOutOfBounds -1
  StrTokenizerTest.testBasicQuoted5:377 » ArrayIndexOutOfBounds -1
  StrTokenizerTest.testBasicQuoted6:388 » ArrayIndexOutOfBounds -1
  StrTokenizerTest.testBasicQuoted7:398 » ArrayIndexOutOfBounds -1
  StrTokenizerTest.testBasicQuotedTrimmed1:411 » ArrayIndexOutOfBounds -1
  StrTokenizerTest.testBasicTrimmed1:424 » ArrayIndexOutOfBounds -1
  StrTokenizerTest.testBasicTrimmed2:437 » ArrayIndexOutOfBounds -1
  StrTokenizerTest.testCSVSimple:524->testCSV:512->testXSVAbc:779 » ArrayIndexOutOfBounds
  StrTokenizerTest.testCSVSimpleNeedsTrim:529->testCSV:512->testXSVAbc:779 » ArrayIndexOutOfBounds
  StrTokenizerTest.testCloneReset:612 » ArrayIndexOutOfBounds -1
  StrTokenizerTest.testConstructor_String:627 » ArrayIndexOutOfBounds -1
  StrTokenizerTest.testConstructor_String_char:643 » ArrayIndexOutOfBounds -1
  StrTokenizerTest.testConstructor_String_char_char:660 » ArrayIndexOutOfBounds ...
  StrTokenizerTest.testConstructor_charArray:675 » ArrayIndexOutOfBounds -1
  StrTokenizerTest.testConstructor_charArray_char:691 » ArrayIndexOutOfBounds -1
  StrTokenizerTest.testConstructor_charArray_char_char:708 » ArrayIndexOutOfBounds
  StrTokenizerTest.testIteration:803 » ArrayIndexOutOfBounds -1
  StrTokenizerTest.testListArray:503 » ArrayIndexOutOfBounds -1
  StrTokenizerTest.testReset:723 » ArrayIndexOutOfBounds -1
  StrTokenizerTest.testReset_String:740 » ArrayIndexOutOfBounds -1
  StrTokenizerTest.testReset_charArray:755 » ArrayIndexOutOfBounds -1
  StrTokenizerTest.testTSV:765->testXSVAbc:779 » ArrayIndexOutOfBounds -1
  StrTokenizerTest.testToString:876 » ArrayIndexOutOfBounds -1
  StrTokenizerTest.testTokenizeSubclassInputChange:851 » ArrayIndexOutOfBounds -...
  StrTokenizerTest.testTokenizeSubclassOutputChange:866 » ArrayIndexOutOfBounds ...


Tests run: 3526, Failures: 0, Errors: 50, Skipped: 97

[INFO] ------------------------------------------------------------------------
[INFO] BUILD FAILURE
[INFO] ------------------------------------------------------------------------
[INFO] Total time: 37.827s
[INFO] Finished at: Wed Aug 05 04:07:19 BST 2015
[INFO] Final Memory: 26M/500M
[INFO] ------------------------------------------------------------------------
[ERROR] Failed to execute goal org.apache.maven.plugins:maven-surefire-plugin:2.18:test (default-test) on project commons-lang3: There are test failures.
[ERROR] 
[ERROR] Please refer to /home/perham/Study/LittleDarwin/Cases/commons-lang3-3.4-src/target/surefire-reports for the individual test results.
[ERROR] -> [Help 1]
[ERROR] 
[ERROR] To see the full stack trace of the errors, re-run Maven with the -e switch.
[ERROR] Re-run Maven using the -X switch to enable full debug logging.
[ERROR] 
[ERROR] For more information about the errors and possible solutions, please read the following articles:
[ERROR] [Help 1] http://cwiki.apache.org/confluence/display/MAVEN/MojoFailureException
