[INFO] Scanning for projects...
[INFO]                                                                         
[INFO] ------------------------------------------------------------------------
[INFO] Building Apache Commons Lang 3.4
[INFO] ------------------------------------------------------------------------
[INFO] 
[INFO] --- maven-enforcer-plugin:1.3.1:enforce (enforce-maven-3) @ commons-lang3 ---
[INFO] 
[INFO] --- build-helper-maven-plugin:1.8:parse-version (parse-version) @ commons-lang3 ---
[INFO] 
[INFO] --- maven-antrun-plugin:1.8:run (javadoc.resources) @ commons-lang3 ---
[INFO] Executing tasks

main:
[INFO] Executed tasks
[INFO] 
[INFO] --- maven-remote-resources-plugin:1.5:process (default) @ commons-lang3 ---
[INFO] 
[INFO] --- buildnumber-maven-plugin:1.3:create (default) @ commons-lang3 ---
[INFO] Executing: /bin/sh -c cd /home/perham/Study/LittleDarwin/Cases/commons-lang3-3.4-src && svn --non-interactive info
[INFO] Working directory: /home/perham/Study/LittleDarwin/Cases/commons-lang3-3.4-src
[INFO] Storing buildNumber: ?????? at timestamp: 1438743764391
[INFO] Executing: /bin/sh -c cd /home/perham/Study/LittleDarwin/Cases/commons-lang3-3.4-src && svn --non-interactive info
[INFO] Working directory: /home/perham/Study/LittleDarwin/Cases/commons-lang3-3.4-src
[INFO] Storing buildScmBranch: UNKNOWN_BRANCH
[INFO] 
[INFO] --- maven-resources-plugin:2.7:resources (default-resources) @ commons-lang3 ---
[INFO] Using 'ISO-8859-1' encoding to copy filtered resources.
[INFO] Copying 0 resource
[INFO] Copying 2 resources to META-INF
[INFO] 
[INFO] --- maven-compiler-plugin:3.2:compile (default-compile) @ commons-lang3 ---
[INFO] Changes detected - recompiling the module!
[INFO] Compiling 133 source files to /home/perham/Study/LittleDarwin/Cases/commons-lang3-3.4-src/target/classes
[INFO] /home/perham/Study/LittleDarwin/Cases/commons-lang3-3.4-src/src/main/java/org/apache/commons/lang3/SerializationUtils.java: /home/perham/Study/LittleDarwin/Cases/commons-lang3-3.4-src/src/main/java/org/apache/commons/lang3/SerializationUtils.java uses unchecked or unsafe operations.
[INFO] /home/perham/Study/LittleDarwin/Cases/commons-lang3-3.4-src/src/main/java/org/apache/commons/lang3/SerializationUtils.java: Recompile with -Xlint:unchecked for details.
[INFO] 
[INFO] --- maven-bundle-plugin:2.5.3:manifest (bundle-manifest) @ commons-lang3 ---
[INFO] 
[INFO] --- animal-sniffer-maven-plugin:1.13:check (checkAPIcompatibility) @ commons-lang3 ---
[INFO] Checking unresolved references to org.codehaus.mojo.signature:java16:1.0
[INFO] 
[INFO] --- maven-resources-plugin:2.7:testResources (default-testResources) @ commons-lang3 ---
[INFO] Using 'ISO-8859-1' encoding to copy filtered resources.
[INFO] Copying 2 resources
[INFO] Copying 2 resources to META-INF
[INFO] 
[INFO] --- maven-compiler-plugin:3.2:testCompile (default-testCompile) @ commons-lang3 ---
[INFO] Nothing to compile - all classes are up to date
[INFO] 
[INFO] --- maven-surefire-plugin:2.18:test (default-test) @ commons-lang3 ---
[INFO] Surefire report directory: /home/perham/Study/LittleDarwin/Cases/commons-lang3-3.4-src/target/surefire-reports

-------------------------------------------------------
 T E S T S
-------------------------------------------------------
Running org.apache.commons.lang3.ValidateTest
Tests run: 63, Failures: 0, Errors: 0, Skipped: 0, Time elapsed: 0.039 sec - in org.apache.commons.lang3.ValidateTest
Running org.apache.commons.lang3.LocaleUtilsTest
Tests run: 15, Failures: 0, Errors: 0, Skipped: 0, Time elapsed: 0.029 sec - in org.apache.commons.lang3.LocaleUtilsTest
Running org.apache.commons.lang3.tuple.MutableTripleTest
Tests run: 8, Failures: 0, Errors: 0, Skipped: 0, Time elapsed: 0.001 sec - in org.apache.commons.lang3.tuple.MutableTripleTest
Running org.apache.commons.lang3.tuple.TripleTest
Tests run: 10, Failures: 0, Errors: 0, Skipped: 0, Time elapsed: 0.002 sec - in org.apache.commons.lang3.tuple.TripleTest
Running org.apache.commons.lang3.tuple.ImmutablePairTest
Tests run: 6, Failures: 0, Errors: 0, Skipped: 0, Time elapsed: 0.003 sec - in org.apache.commons.lang3.tuple.ImmutablePairTest
Running org.apache.commons.lang3.tuple.MutablePairTest
Tests run: 8, Failures: 0, Errors: 0, Skipped: 0, Time elapsed: 0.001 sec - in org.apache.commons.lang3.tuple.MutablePairTest
Running org.apache.commons.lang3.tuple.ImmutableTripleTest
Tests run: 6, Failures: 0, Errors: 0, Skipped: 0, Time elapsed: 0 sec - in org.apache.commons.lang3.tuple.ImmutableTripleTest
Running org.apache.commons.lang3.tuple.PairTest
Tests run: 9, Failures: 0, Errors: 0, Skipped: 0, Time elapsed: 0.006 sec - in org.apache.commons.lang3.tuple.PairTest
Running org.apache.commons.lang3.StringUtilsIsTest
Tests run: 8, Failures: 0, Errors: 0, Skipped: 0, Time elapsed: 0.014 sec - in org.apache.commons.lang3.StringUtilsIsTest
Running org.apache.commons.lang3.JavaVersionTest
Tests run: 3, Failures: 0, Errors: 0, Skipped: 0, Time elapsed: 0 sec - in org.apache.commons.lang3.JavaVersionTest
Running org.apache.commons.lang3.builder.NoFieldNamesToStringStyleTest
Tests run: 8, Failures: 0, Errors: 0, Skipped: 0, Time elapsed: 0.016 sec - in org.apache.commons.lang3.builder.NoFieldNamesToStringStyleTest
Running org.apache.commons.lang3.builder.ShortPrefixToStringStyleTest
Tests run: 8, Failures: 0, Errors: 0, Skipped: 0, Time elapsed: 0.006 sec - in org.apache.commons.lang3.builder.ShortPrefixToStringStyleTest
Running org.apache.commons.lang3.builder.DiffResultTest
Tests run: 9, Failures: 0, Errors: 0, Skipped: 0, Time elapsed: 0.01 sec - in org.apache.commons.lang3.builder.DiffResultTest
Running org.apache.commons.lang3.builder.CompareToBuilderTest
Tests run: 48, Failures: 0, Errors: 0, Skipped: 0, Time elapsed: 0.025 sec - in org.apache.commons.lang3.builder.CompareToBuilderTest
Running org.apache.commons.lang3.builder.MultilineRecursiveToStringStyleTest
Tests run: 10, Failures: 0, Errors: 0, Skipped: 0, Time elapsed: 0.006 sec - in org.apache.commons.lang3.builder.MultilineRecursiveToStringStyleTest
Running org.apache.commons.lang3.builder.RecursiveToStringStyleTest
Tests run: 8, Failures: 0, Errors: 0, Skipped: 0, Time elapsed: 0.003 sec - in org.apache.commons.lang3.builder.RecursiveToStringStyleTest
Running org.apache.commons.lang3.builder.DefaultToStringStyleTest
Tests run: 8, Failures: 0, Errors: 0, Skipped: 0, Time elapsed: 0 sec - in org.apache.commons.lang3.builder.DefaultToStringStyleTest
Running org.apache.commons.lang3.builder.ReflectionToStringBuilderExcludeTest
Tests run: 11, Failures: 0, Errors: 0, Skipped: 0, Time elapsed: 0.003 sec - in org.apache.commons.lang3.builder.ReflectionToStringBuilderExcludeTest
Running org.apache.commons.lang3.builder.StandardToStringStyleTest
Tests run: 8, Failures: 0, Errors: 0, Skipped: 0, Time elapsed: 0.003 sec - in org.apache.commons.lang3.builder.StandardToStringStyleTest
Running org.apache.commons.lang3.builder.ToStringStyleTest
Tests run: 12, Failures: 0, Errors: 0, Skipped: 0, Time elapsed: 0.002 sec - in org.apache.commons.lang3.builder.ToStringStyleTest
Running org.apache.commons.lang3.builder.DiffTest
Tests run: 4, Failures: 0, Errors: 0, Skipped: 0, Time elapsed: 0 sec - in org.apache.commons.lang3.builder.DiffTest
Running org.apache.commons.lang3.builder.SimpleToStringStyleTest
Tests run: 8, Failures: 0, Errors: 0, Skipped: 0, Time elapsed: 0.003 sec - in org.apache.commons.lang3.builder.SimpleToStringStyleTest
Running org.apache.commons.lang3.builder.MultiLineToStringStyleTest
Tests run: 8, Failures: 0, Errors: 0, Skipped: 0, Time elapsed: 0.007 sec - in org.apache.commons.lang3.builder.MultiLineToStringStyleTest
Running org.apache.commons.lang3.builder.ToStringStyleConcurrencyTest
Tests run: 3, Failures: 0, Errors: 0, Skipped: 0, Time elapsed: 5.032 sec - in org.apache.commons.lang3.builder.ToStringStyleConcurrencyTest
Running org.apache.commons.lang3.builder.ReflectionToStringBuilderMutateInspectConcurrencyTest
Tests run: 1, Failures: 0, Errors: 0, Skipped: 1, Time elapsed: 0 sec - in org.apache.commons.lang3.builder.ReflectionToStringBuilderMutateInspectConcurrencyTest
Running org.apache.commons.lang3.builder.ToStringBuilderTest
Tests run: 74, Failures: 0, Errors: 0, Skipped: 1, Time elapsed: 0.098 sec - in org.apache.commons.lang3.builder.ToStringBuilderTest
Running org.apache.commons.lang3.builder.EqualsBuilderTest
Tests run: 48, Failures: 0, Errors: 0, Skipped: 0, Time elapsed: 0.037 sec - in org.apache.commons.lang3.builder.EqualsBuilderTest
Running org.apache.commons.lang3.builder.HashCodeBuilderAndEqualsBuilderTest
Tests run: 4, Failures: 0, Errors: 0, Skipped: 0, Time elapsed: 0.01 sec - in org.apache.commons.lang3.builder.HashCodeBuilderAndEqualsBuilderTest
Running org.apache.commons.lang3.builder.ReflectionToStringBuilderConcurrencyTest
Tests run: 3, Failures: 0, Errors: 0, Skipped: 3, Time elapsed: 0.004 sec - in org.apache.commons.lang3.builder.ReflectionToStringBuilderConcurrencyTest
Running org.apache.commons.lang3.builder.JsonToStringStyleTest
Tests run: 9, Failures: 0, Errors: 0, Skipped: 0, Time elapsed: 0.005 sec - in org.apache.commons.lang3.builder.JsonToStringStyleTest
Running org.apache.commons.lang3.builder.NoClassNameToStringStyleTest
Tests run: 8, Failures: 0, Errors: 0, Skipped: 0, Time elapsed: 0.01 sec - in org.apache.commons.lang3.builder.NoClassNameToStringStyleTest
Running org.apache.commons.lang3.builder.DiffBuilderTest
Tests run: 30, Failures: 0, Errors: 0, Skipped: 0, Time elapsed: 0.038 sec - in org.apache.commons.lang3.builder.DiffBuilderTest
Running org.apache.commons.lang3.builder.HashCodeBuilderTest
Tests run: 44, Failures: 0, Errors: 0, Skipped: 0, Time elapsed: 0.022 sec - in org.apache.commons.lang3.builder.HashCodeBuilderTest
Running org.apache.commons.lang3.concurrent.AtomicInitializerTest
Tests run: 3, Failures: 0, Errors: 0, Skipped: 0, Time elapsed: 0.008 sec - in org.apache.commons.lang3.concurrent.AtomicInitializerTest
Running org.apache.commons.lang3.concurrent.CallableBackgroundInitializerTest
Tests run: 4, Failures: 0, Errors: 0, Skipped: 0, Time elapsed: 0.003 sec - in org.apache.commons.lang3.concurrent.CallableBackgroundInitializerTest
Running org.apache.commons.lang3.concurrent.BackgroundInitializerTest
Tests run: 15, Failures: 0, Errors: 0, Skipped: 0, Time elapsed: 0.031 sec - in org.apache.commons.lang3.concurrent.BackgroundInitializerTest
Running org.apache.commons.lang3.concurrent.LazyInitializerTest
Tests run: 3, Failures: 0, Errors: 0, Skipped: 0, Time elapsed: 0.011 sec - in org.apache.commons.lang3.concurrent.LazyInitializerTest
Running org.apache.commons.lang3.concurrent.BasicThreadFactoryTest
Tests run: 15, Failures: 0, Errors: 0, Skipped: 0, Time elapsed: 0.041 sec - in org.apache.commons.lang3.concurrent.BasicThreadFactoryTest
Running org.apache.commons.lang3.concurrent.ConstantInitializerTest
Tests run: 7, Failures: 0, Errors: 0, Skipped: 0, Time elapsed: 0.001 sec - in org.apache.commons.lang3.concurrent.ConstantInitializerTest
Running org.apache.commons.lang3.concurrent.MultiBackgroundInitializerTest
Tests run: 17, Failures: 0, Errors: 0, Skipped: 0, Time elapsed: 0.099 sec - in org.apache.commons.lang3.concurrent.MultiBackgroundInitializerTest
Running org.apache.commons.lang3.concurrent.AtomicSafeInitializerTest
Tests run: 4, Failures: 0, Errors: 0, Skipped: 0, Time elapsed: 0.038 sec - in org.apache.commons.lang3.concurrent.AtomicSafeInitializerTest
Running org.apache.commons.lang3.concurrent.ConcurrentUtilsTest
Tests run: 40, Failures: 0, Errors: 0, Skipped: 0, Time elapsed: 0.029 sec - in org.apache.commons.lang3.concurrent.ConcurrentUtilsTest
Running org.apache.commons.lang3.concurrent.TimedSemaphoreTest
Tests run: 15, Failures: 0, Errors: 0, Skipped: 0, Time elapsed: 1.212 sec - in org.apache.commons.lang3.concurrent.TimedSemaphoreTest
Running org.apache.commons.lang3.StringUtilsSubstringTest
Tests run: 14, Failures: 0, Errors: 0, Skipped: 0, Time elapsed: 0.006 sec - in org.apache.commons.lang3.StringUtilsSubstringTest
Running org.apache.commons.lang3.SystemUtilsTest
Tests run: 12, Failures: 0, Errors: 0, Skipped: 0, Time elapsed: 0.003 sec - in org.apache.commons.lang3.SystemUtilsTest
Running org.apache.commons.lang3.CharRangeTest
Tests run: 16, Failures: 0, Errors: 0, Skipped: 0, Time elapsed: 0.041 sec - in org.apache.commons.lang3.CharRangeTest
Running org.apache.commons.lang3.CharSetTest
Tests run: 14, Failures: 0, Errors: 0, Skipped: 0, Time elapsed: 0.012 sec - in org.apache.commons.lang3.CharSetTest
Running org.apache.commons.lang3.StringUtilsStartsEndsWithTest
Tests run: 6, Failures: 0, Errors: 0, Skipped: 0, Time elapsed: 0.005 sec - in org.apache.commons.lang3.StringUtilsStartsEndsWithTest
Running org.apache.commons.lang3.RandomStringUtilsTest
Tests run: 11, Failures: 0, Errors: 0, Skipped: 0, Time elapsed: 0.036 sec - in org.apache.commons.lang3.RandomStringUtilsTest
Running org.apache.commons.lang3.SerializationUtilsTest
Tests run: 26, Failures: 0, Errors: 0, Skipped: 0, Time elapsed: 0.054 sec - in org.apache.commons.lang3.SerializationUtilsTest
Running org.apache.commons.lang3.time.StopWatchTest
Tests run: 8, Failures: 0, Errors: 0, Skipped: 0, Time elapsed: 4.76 sec - in org.apache.commons.lang3.time.StopWatchTest
Running org.apache.commons.lang3.time.DateUtilsRoundingTest
Tests run: 22, Failures: 0, Errors: 0, Skipped: 0, Time elapsed: 0.177 sec - in org.apache.commons.lang3.time.DateUtilsRoundingTest
Running org.apache.commons.lang3.time.FastDateParserTest
Tests run: 33, Failures: 0, Errors: 0, Skipped: 0, Time elapsed: 2.46 sec - in org.apache.commons.lang3.time.FastDateParserTest
Running org.apache.commons.lang3.time.FastDateFormat_ParserTest
Tests run: 33, Failures: 0, Errors: 0, Skipped: 0, Time elapsed: 0.783 sec - in org.apache.commons.lang3.time.FastDateFormat_ParserTest
Running org.apache.commons.lang3.time.DurationFormatUtilsTest
Tests run: 25, Failures: 0, Errors: 0, Skipped: 0, Time elapsed: 0.993 sec - in org.apache.commons.lang3.time.DurationFormatUtilsTest
Running org.apache.commons.lang3.time.DateFormatUtilsTest
Tests run: 10, Failures: 0, Errors: 0, Skipped: 0, Time elapsed: 0.002 sec - in org.apache.commons.lang3.time.DateFormatUtilsTest
Running org.apache.commons.lang3.time.DateUtilsFragmentTest
Tests run: 57, Failures: 0, Errors: 0, Skipped: 0, Time elapsed: 0.013 sec - in org.apache.commons.lang3.time.DateUtilsFragmentTest
Running org.apache.commons.lang3.time.FastDatePrinterTimeZonesTest
Tests run: 617, Failures: 0, Errors: 0, Skipped: 0, Time elapsed: 0.239 sec - in org.apache.commons.lang3.time.FastDatePrinterTimeZonesTest
Running org.apache.commons.lang3.time.FastDateFormatTest
>>FastDateFormatTest: FastDateParser:19214  SimpleDateFormat:3778
Tests run: 14, Failures: 0, Errors: 0, Skipped: 0, Time elapsed: 2.618 sec - in org.apache.commons.lang3.time.FastDateFormatTest
Running org.apache.commons.lang3.time.FastDateFormat_PrinterTest
Tests run: 17, Failures: 0, Errors: 0, Skipped: 0, Time elapsed: 0.01 sec - in org.apache.commons.lang3.time.FastDateFormat_PrinterTest
Running org.apache.commons.lang3.time.FastDatePrinterTest
Tests run: 17, Failures: 0, Errors: 0, Skipped: 0, Time elapsed: 0.005 sec - in org.apache.commons.lang3.time.FastDatePrinterTest
Running org.apache.commons.lang3.time.FastDateParserSDFTest
Tests run: 276, Failures: 0, Errors: 0, Skipped: 92, Time elapsed: 0.08 sec - in org.apache.commons.lang3.time.FastDateParserSDFTest
Running org.apache.commons.lang3.time.DateUtilsTest
DateUtilsTest: Default Locale=en_US
Tests run: 38, Failures: 0, Errors: 0, Skipped: 0, Time elapsed: 0.023 sec - in org.apache.commons.lang3.time.DateUtilsTest
Running org.apache.commons.lang3.reflect.InheritanceUtilsTest
Tests run: 9, Failures: 0, Errors: 0, Skipped: 0, Time elapsed: 0.002 sec - in org.apache.commons.lang3.reflect.InheritanceUtilsTest
Running org.apache.commons.lang3.reflect.MethodUtilsTest
Tests run: 23, Failures: 0, Errors: 0, Skipped: 0, Time elapsed: 0.034 sec - in org.apache.commons.lang3.reflect.MethodUtilsTest
Running org.apache.commons.lang3.reflect.ConstructorUtilsTest
Tests run: 7, Failures: 0, Errors: 0, Skipped: 0, Time elapsed: 0.012 sec - in org.apache.commons.lang3.reflect.ConstructorUtilsTest
Running org.apache.commons.lang3.reflect.FieldUtilsTest
Tests run: 64, Failures: 0, Errors: 0, Skipped: 0, Time elapsed: 0.028 sec - in org.apache.commons.lang3.reflect.FieldUtilsTest
Running org.apache.commons.lang3.reflect.TypeLiteralTest
Tests run: 4, Failures: 0, Errors: 0, Skipped: 0, Time elapsed: 0.003 sec - in org.apache.commons.lang3.reflect.TypeLiteralTest
Running org.apache.commons.lang3.reflect.TypeUtilsTest
Tests run: 19, Failures: 0, Errors: 0, Skipped: 0, Time elapsed: 0.046 sec - in org.apache.commons.lang3.reflect.TypeUtilsTest
Running org.apache.commons.lang3.mutable.MutableByteTest
Tests run: 17, Failures: 0, Errors: 0, Skipped: 0, Time elapsed: 0.003 sec - in org.apache.commons.lang3.mutable.MutableByteTest
Running org.apache.commons.lang3.mutable.MutableShortTest
Tests run: 14, Failures: 0, Errors: 0, Skipped: 0, Time elapsed: 0.002 sec - in org.apache.commons.lang3.mutable.MutableShortTest
Running org.apache.commons.lang3.mutable.MutableIntTest
Tests run: 17, Failures: 0, Errors: 0, Skipped: 0, Time elapsed: 0.002 sec - in org.apache.commons.lang3.mutable.MutableIntTest
Running org.apache.commons.lang3.mutable.MutableDoubleTest
Tests run: 18, Failures: 0, Errors: 0, Skipped: 0, Time elapsed: 0.002 sec - in org.apache.commons.lang3.mutable.MutableDoubleTest
Running org.apache.commons.lang3.mutable.MutableFloatTest
Tests run: 18, Failures: 0, Errors: 0, Skipped: 0, Time elapsed: 0.004 sec - in org.apache.commons.lang3.mutable.MutableFloatTest
Running org.apache.commons.lang3.mutable.MutableLongTest
Tests run: 17, Failures: 0, Errors: 0, Skipped: 0, Time elapsed: 0.001 sec - in org.apache.commons.lang3.mutable.MutableLongTest
Running org.apache.commons.lang3.mutable.MutableBooleanTest
Tests run: 9, Failures: 0, Errors: 0, Skipped: 0, Time elapsed: 0.001 sec - in org.apache.commons.lang3.mutable.MutableBooleanTest
Running org.apache.commons.lang3.mutable.MutableObjectTest
Tests run: 5, Failures: 0, Errors: 0, Skipped: 0, Time elapsed: 0 sec - in org.apache.commons.lang3.mutable.MutableObjectTest
Running org.apache.commons.lang3.text.translate.UnicodeEscaperTest
Tests run: 3, Failures: 0, Errors: 0, Skipped: 0, Time elapsed: 0.001 sec - in org.apache.commons.lang3.text.translate.UnicodeEscaperTest
Running org.apache.commons.lang3.text.translate.EntityArraysTest
Tests run: 3, Failures: 0, Errors: 0, Skipped: 0, Time elapsed: 0 sec - in org.apache.commons.lang3.text.translate.EntityArraysTest
Running org.apache.commons.lang3.text.translate.UnicodeUnpairedSurrogateRemoverTest
Tests run: 2, Failures: 0, Errors: 0, Skipped: 0, Time elapsed: 0 sec - in org.apache.commons.lang3.text.translate.UnicodeUnpairedSurrogateRemoverTest
Running org.apache.commons.lang3.text.translate.NumericEntityUnescaperTest
Tests run: 3, Failures: 0, Errors: 0, Skipped: 0, Time elapsed: 0.001 sec - in org.apache.commons.lang3.text.translate.NumericEntityUnescaperTest
Running org.apache.commons.lang3.text.translate.NumericEntityEscaperTest
Tests run: 4, Failures: 0, Errors: 0, Skipped: 0, Time elapsed: 0 sec - in org.apache.commons.lang3.text.translate.NumericEntityEscaperTest
Running org.apache.commons.lang3.text.translate.LookupTranslatorTest
Tests run: 2, Failures: 0, Errors: 0, Skipped: 0, Time elapsed: 0 sec - in org.apache.commons.lang3.text.translate.LookupTranslatorTest
Running org.apache.commons.lang3.text.translate.UnicodeUnescaperTest
Tests run: 3, Failures: 0, Errors: 0, Skipped: 0, Time elapsed: 0 sec - in org.apache.commons.lang3.text.translate.UnicodeUnescaperTest
Running org.apache.commons.lang3.text.translate.OctalUnescaperTest
Tests run: 1, Failures: 0, Errors: 0, Skipped: 0, Time elapsed: 0 sec - in org.apache.commons.lang3.text.translate.OctalUnescaperTest
Running org.apache.commons.lang3.text.StrMatcherTest
Tests run: 14, Failures: 0, Errors: 0, Skipped: 0, Time elapsed: 0.002 sec - in org.apache.commons.lang3.text.StrMatcherTest
Running org.apache.commons.lang3.text.StrTokenizerTest
Tests run: 55, Failures: 11, Errors: 29, Skipped: 0, Time elapsed: 0.009 sec <<< FAILURE! - in org.apache.commons.lang3.text.StrTokenizerTest
testBasicDelim1(org.apache.commons.lang3.text.StrTokenizerTest)  Time elapsed: 0.003 sec  <<< ERROR!
java.util.NoSuchElementException: null
	at org.apache.commons.lang3.text.StrTokenizer.next(StrTokenizer.java:109)
	at org.apache.commons.lang3.text.StrTokenizerTest.testBasicDelim1(StrTokenizerTest.java:285)

testBasicDelim2(org.apache.commons.lang3.text.StrTokenizerTest)  Time elapsed: 0.001 sec  <<< ERROR!
java.util.NoSuchElementException: null
	at org.apache.commons.lang3.text.StrTokenizer.next(StrTokenizer.java:109)
	at org.apache.commons.lang3.text.StrTokenizerTest.testBasicDelim2(StrTokenizerTest.java:295)

testBasicEmpty1(org.apache.commons.lang3.text.StrTokenizerTest)  Time elapsed: 0 sec  <<< ERROR!
java.util.NoSuchElementException: null
	at org.apache.commons.lang3.text.StrTokenizer.next(StrTokenizer.java:109)
	at org.apache.commons.lang3.text.StrTokenizerTest.testBasicEmpty1(StrTokenizerTest.java:304)

testBasicEmpty2(org.apache.commons.lang3.text.StrTokenizerTest)  Time elapsed: 0 sec  <<< ERROR!
java.util.NoSuchElementException: null
	at org.apache.commons.lang3.text.StrTokenizer.next(StrTokenizer.java:109)
	at org.apache.commons.lang3.text.StrTokenizerTest.testBasicEmpty2(StrTokenizerTest.java:317)

testIteration(org.apache.commons.lang3.text.StrTokenizerTest)  Time elapsed: 0 sec  <<< FAILURE!
java.lang.AssertionError: null
	at org.junit.Assert.fail(Assert.java:86)
	at org.junit.Assert.assertTrue(Assert.java:41)
	at org.junit.Assert.assertTrue(Assert.java:52)
	at org.apache.commons.lang3.text.StrTokenizerTest.testIteration(StrTokenizerTest.java:808)

testConstructor_String_char_char(org.apache.commons.lang3.text.StrTokenizerTest)  Time elapsed: 0 sec  <<< ERROR!
java.util.NoSuchElementException: null
	at org.apache.commons.lang3.text.StrTokenizer.next(StrTokenizer.java:109)
	at org.apache.commons.lang3.text.StrTokenizerTest.testConstructor_String_char_char(StrTokenizerTest.java:660)

testReset(org.apache.commons.lang3.text.StrTokenizerTest)  Time elapsed: 0 sec  <<< ERROR!
java.util.NoSuchElementException: null
	at org.apache.commons.lang3.text.StrTokenizer.next(StrTokenizer.java:109)
	at org.apache.commons.lang3.text.StrTokenizerTest.testReset(StrTokenizerTest.java:723)

testToString(org.apache.commons.lang3.text.StrTokenizerTest)  Time elapsed: 0 sec  <<< ERROR!
java.util.NoSuchElementException: null
	at org.apache.commons.lang3.text.StrTokenizer.next(StrTokenizer.java:109)
	at org.apache.commons.lang3.text.StrTokenizerTest.testToString(StrTokenizerTest.java:876)

testTokenizeSubclassOutputChange(org.apache.commons.lang3.text.StrTokenizerTest)  Time elapsed: 0 sec  <<< ERROR!
java.util.NoSuchElementException: null
	at org.apache.commons.lang3.text.StrTokenizer.next(StrTokenizer.java:109)
	at org.apache.commons.lang3.text.StrTokenizerTest.testTokenizeSubclassOutputChange(StrTokenizerTest.java:866)

testListArray(org.apache.commons.lang3.text.StrTokenizerTest)  Time elapsed: 0 sec  <<< FAILURE!
java.lang.AssertionError: expected:<3> but was:<0>
	at org.junit.Assert.fail(Assert.java:88)
	at org.junit.Assert.failNotEquals(Assert.java:834)
	at org.junit.Assert.assertEquals(Assert.java:645)
	at org.junit.Assert.assertEquals(Assert.java:631)
	at org.apache.commons.lang3.text.StrTokenizerTest.testListArray(StrTokenizerTest.java:507)

testBasicQuoted1(org.apache.commons.lang3.text.StrTokenizerTest)  Time elapsed: 0 sec  <<< ERROR!
java.util.NoSuchElementException: null
	at org.apache.commons.lang3.text.StrTokenizer.next(StrTokenizer.java:109)
	at org.apache.commons.lang3.text.StrTokenizerTest.testBasicQuoted1(StrTokenizerTest.java:328)

testBasicQuoted2(org.apache.commons.lang3.text.StrTokenizerTest)  Time elapsed: 0 sec  <<< ERROR!
java.util.NoSuchElementException: null
	at org.apache.commons.lang3.text.StrTokenizer.next(StrTokenizer.java:109)
	at org.apache.commons.lang3.text.StrTokenizerTest.testBasicQuoted2(StrTokenizerTest.java:340)

testBasicQuoted3(org.apache.commons.lang3.text.StrTokenizerTest)  Time elapsed: 0 sec  <<< ERROR!
java.util.NoSuchElementException: null
	at org.apache.commons.lang3.text.StrTokenizer.next(StrTokenizer.java:109)
	at org.apache.commons.lang3.text.StrTokenizerTest.testBasicQuoted3(StrTokenizerTest.java:352)

testBasicQuoted4(org.apache.commons.lang3.text.StrTokenizerTest)  Time elapsed: 0 sec  <<< ERROR!
java.util.NoSuchElementException: null
	at org.apache.commons.lang3.text.StrTokenizer.next(StrTokenizer.java:109)
	at org.apache.commons.lang3.text.StrTokenizerTest.testBasicQuoted4(StrTokenizerTest.java:364)

testBasicQuoted5(org.apache.commons.lang3.text.StrTokenizerTest)  Time elapsed: 0 sec  <<< ERROR!
java.util.NoSuchElementException: null
	at org.apache.commons.lang3.text.StrTokenizer.next(StrTokenizer.java:109)
	at org.apache.commons.lang3.text.StrTokenizerTest.testBasicQuoted5(StrTokenizerTest.java:377)

testBasicQuoted6(org.apache.commons.lang3.text.StrTokenizerTest)  Time elapsed: 0 sec  <<< ERROR!
java.util.NoSuchElementException: null
	at org.apache.commons.lang3.text.StrTokenizer.next(StrTokenizer.java:109)
	at org.apache.commons.lang3.text.StrTokenizerTest.testBasicQuoted6(StrTokenizerTest.java:388)

testBasicQuoted7(org.apache.commons.lang3.text.StrTokenizerTest)  Time elapsed: 0 sec  <<< ERROR!
java.util.NoSuchElementException: null
	at org.apache.commons.lang3.text.StrTokenizer.next(StrTokenizer.java:109)
	at org.apache.commons.lang3.text.StrTokenizerTest.testBasicQuoted7(StrTokenizerTest.java:398)

testConstructor_String(org.apache.commons.lang3.text.StrTokenizerTest)  Time elapsed: 0 sec  <<< ERROR!
java.util.NoSuchElementException: null
	at org.apache.commons.lang3.text.StrTokenizer.next(StrTokenizer.java:109)
	at org.apache.commons.lang3.text.StrTokenizerTest.testConstructor_String(StrTokenizerTest.java:627)

test1(org.apache.commons.lang3.text.StrTokenizerTest)  Time elapsed: 0 sec  <<< FAILURE!
java.lang.AssertionError: {} expected:<8> but was:<0>
	at org.junit.Assert.fail(Assert.java:88)
	at org.junit.Assert.failNotEquals(Assert.java:834)
	at org.junit.Assert.assertEquals(Assert.java:645)
	at org.apache.commons.lang3.text.StrTokenizerTest.test1(StrTokenizerTest.java:60)

test2(org.apache.commons.lang3.text.StrTokenizerTest)  Time elapsed: 0 sec  <<< FAILURE!
java.lang.AssertionError: {} expected:<8> but was:<0>
	at org.junit.Assert.fail(Assert.java:88)
	at org.junit.Assert.failNotEquals(Assert.java:834)
	at org.junit.Assert.assertEquals(Assert.java:645)
	at org.apache.commons.lang3.text.StrTokenizerTest.test2(StrTokenizerTest.java:81)

test3(org.apache.commons.lang3.text.StrTokenizerTest)  Time elapsed: 0 sec  <<< FAILURE!
java.lang.AssertionError: {} expected:<8> but was:<0>
	at org.junit.Assert.fail(Assert.java:88)
	at org.junit.Assert.failNotEquals(Assert.java:834)
	at org.junit.Assert.assertEquals(Assert.java:645)
	at org.apache.commons.lang3.text.StrTokenizerTest.test3(StrTokenizerTest.java:102)

test4(org.apache.commons.lang3.text.StrTokenizerTest)  Time elapsed: 0 sec  <<< FAILURE!
java.lang.AssertionError: {} expected:<5> but was:<0>
	at org.junit.Assert.fail(Assert.java:88)
	at org.junit.Assert.failNotEquals(Assert.java:834)
	at org.junit.Assert.assertEquals(Assert.java:645)
	at org.apache.commons.lang3.text.StrTokenizerTest.test4(StrTokenizerTest.java:123)

test5(org.apache.commons.lang3.text.StrTokenizerTest)  Time elapsed: 0 sec  <<< FAILURE!
java.lang.AssertionError: {} expected:<8> but was:<0>
	at org.junit.Assert.fail(Assert.java:88)
	at org.junit.Assert.failNotEquals(Assert.java:834)
	at org.junit.Assert.assertEquals(Assert.java:645)
	at org.apache.commons.lang3.text.StrTokenizerTest.test5(StrTokenizerTest.java:145)

test6(org.apache.commons.lang3.text.StrTokenizerTest)  Time elapsed: 0 sec  <<< FAILURE!
java.lang.AssertionError: {} expected:<8> but was:<0>
	at org.junit.Assert.fail(Assert.java:88)
	at org.junit.Assert.failNotEquals(Assert.java:834)
	at org.junit.Assert.assertEquals(Assert.java:645)
	at org.apache.commons.lang3.text.StrTokenizerTest.test6(StrTokenizerTest.java:179)

test7(org.apache.commons.lang3.text.StrTokenizerTest)  Time elapsed: 0 sec  <<< FAILURE!
java.lang.AssertionError: {} expected:<8> but was:<0>
	at org.junit.Assert.fail(Assert.java:88)
	at org.junit.Assert.failNotEquals(Assert.java:834)
	at org.junit.Assert.assertEquals(Assert.java:645)
	at org.apache.commons.lang3.text.StrTokenizerTest.test7(StrTokenizerTest.java:202)

test8(org.apache.commons.lang3.text.StrTokenizerTest)  Time elapsed: 0 sec  <<< FAILURE!
java.lang.AssertionError: {} expected:<5> but was:<0>
	at org.junit.Assert.fail(Assert.java:88)
	at org.junit.Assert.failNotEquals(Assert.java:834)
	at org.junit.Assert.assertEquals(Assert.java:645)
	at org.apache.commons.lang3.text.StrTokenizerTest.test8(StrTokenizerTest.java:223)

testConstructor_String_char(org.apache.commons.lang3.text.StrTokenizerTest)  Time elapsed: 0 sec  <<< ERROR!
java.util.NoSuchElementException: null
	at org.apache.commons.lang3.text.StrTokenizer.next(StrTokenizer.java:109)
	at org.apache.commons.lang3.text.StrTokenizerTest.testConstructor_String_char(StrTokenizerTest.java:643)

testBasicIgnoreTrimmed1(org.apache.commons.lang3.text.StrTokenizerTest)  Time elapsed: 0 sec  <<< ERROR!
java.util.NoSuchElementException: null
	at org.apache.commons.lang3.text.StrTokenizer.next(StrTokenizer.java:109)
	at org.apache.commons.lang3.text.StrTokenizerTest.testBasicIgnoreTrimmed1(StrTokenizerTest.java:451)

testBasicIgnoreTrimmed2(org.apache.commons.lang3.text.StrTokenizerTest)  Time elapsed: 0 sec  <<< ERROR!
java.util.NoSuchElementException: null
	at org.apache.commons.lang3.text.StrTokenizer.next(StrTokenizer.java:109)
	at org.apache.commons.lang3.text.StrTokenizerTest.testBasicIgnoreTrimmed2(StrTokenizerTest.java:465)

testBasicIgnoreTrimmed3(org.apache.commons.lang3.text.StrTokenizerTest)  Time elapsed: 0 sec  <<< ERROR!
java.util.NoSuchElementException: null
	at org.apache.commons.lang3.text.StrTokenizer.next(StrTokenizer.java:109)
	at org.apache.commons.lang3.text.StrTokenizerTest.testBasicIgnoreTrimmed3(StrTokenizerTest.java:478)

testBasicIgnoreTrimmed4(org.apache.commons.lang3.text.StrTokenizerTest)  Time elapsed: 0 sec  <<< ERROR!
java.util.NoSuchElementException: null
	at org.apache.commons.lang3.text.StrTokenizer.next(StrTokenizer.java:109)
	at org.apache.commons.lang3.text.StrTokenizerTest.testBasicIgnoreTrimmed4(StrTokenizerTest.java:492)

testBasicQuotedTrimmed1(org.apache.commons.lang3.text.StrTokenizerTest)  Time elapsed: 0 sec  <<< ERROR!
java.util.NoSuchElementException: null
	at org.apache.commons.lang3.text.StrTokenizer.next(StrTokenizer.java:109)
	at org.apache.commons.lang3.text.StrTokenizerTest.testBasicQuotedTrimmed1(StrTokenizerTest.java:411)

testBasic1(org.apache.commons.lang3.text.StrTokenizerTest)  Time elapsed: 0 sec  <<< ERROR!
java.util.NoSuchElementException: null
	at org.apache.commons.lang3.text.StrTokenizer.next(StrTokenizer.java:109)
	at org.apache.commons.lang3.text.StrTokenizerTest.testBasic1(StrTokenizerTest.java:235)

testBasic2(org.apache.commons.lang3.text.StrTokenizerTest)  Time elapsed: 0 sec  <<< ERROR!
java.util.NoSuchElementException: null
	at org.apache.commons.lang3.text.StrTokenizer.next(StrTokenizer.java:109)
	at org.apache.commons.lang3.text.StrTokenizerTest.testBasic2(StrTokenizerTest.java:245)

testBasic3(org.apache.commons.lang3.text.StrTokenizerTest)  Time elapsed: 0 sec  <<< ERROR!
java.util.NoSuchElementException: null
	at org.apache.commons.lang3.text.StrTokenizer.next(StrTokenizer.java:109)
	at org.apache.commons.lang3.text.StrTokenizerTest.testBasic3(StrTokenizerTest.java:255)

testBasic4(org.apache.commons.lang3.text.StrTokenizerTest)  Time elapsed: 0.001 sec  <<< ERROR!
java.util.NoSuchElementException: null
	at org.apache.commons.lang3.text.StrTokenizer.next(StrTokenizer.java:109)
	at org.apache.commons.lang3.text.StrTokenizerTest.testBasic4(StrTokenizerTest.java:265)

testBasic5(org.apache.commons.lang3.text.StrTokenizerTest)  Time elapsed: 0 sec  <<< ERROR!
java.util.NoSuchElementException: null
	at org.apache.commons.lang3.text.StrTokenizer.next(StrTokenizer.java:109)
	at org.apache.commons.lang3.text.StrTokenizerTest.testBasic5(StrTokenizerTest.java:275)

testGetContent(org.apache.commons.lang3.text.StrTokenizerTest)  Time elapsed: 0 sec  <<< FAILURE!
java.lang.AssertionError: expected:<a   b c "d e" f > but was:<null>
	at org.junit.Assert.fail(Assert.java:88)
	at org.junit.Assert.failNotEquals(Assert.java:834)
	at org.junit.Assert.assertEquals(Assert.java:118)
	at org.junit.Assert.assertEquals(Assert.java:144)
	at org.apache.commons.lang3.text.StrTokenizerTest.testGetContent(StrTokenizerTest.java:550)

testBasicTrimmed1(org.apache.commons.lang3.text.StrTokenizerTest)  Time elapsed: 0 sec  <<< ERROR!
java.util.NoSuchElementException: null
	at org.apache.commons.lang3.text.StrTokenizer.next(StrTokenizer.java:109)
	at org.apache.commons.lang3.text.StrTokenizerTest.testBasicTrimmed1(StrTokenizerTest.java:424)

testBasicTrimmed2(org.apache.commons.lang3.text.StrTokenizerTest)  Time elapsed: 0 sec  <<< ERROR!
java.util.NoSuchElementException: null
	at org.apache.commons.lang3.text.StrTokenizer.next(StrTokenizer.java:109)
	at org.apache.commons.lang3.text.StrTokenizerTest.testBasicTrimmed2(StrTokenizerTest.java:437)

Running org.apache.commons.lang3.text.FormattableUtilsTest
Tests run: 5, Failures: 0, Errors: 0, Skipped: 0, Time elapsed: 0 sec - in org.apache.commons.lang3.text.FormattableUtilsTest
Running org.apache.commons.lang3.text.CompositeFormatTest
Tests run: 2, Failures: 0, Errors: 0, Skipped: 0, Time elapsed: 0 sec - in org.apache.commons.lang3.text.CompositeFormatTest
Running org.apache.commons.lang3.text.WordUtilsTest
Tests run: 12, Failures: 0, Errors: 0, Skipped: 0, Time elapsed: 0.001 sec - in org.apache.commons.lang3.text.WordUtilsTest
Running org.apache.commons.lang3.text.StrLookupTest
Tests run: 5, Failures: 0, Errors: 0, Skipped: 0, Time elapsed: 0.001 sec - in org.apache.commons.lang3.text.StrLookupTest
Running org.apache.commons.lang3.text.StrBuilderAppendInsertTest
Tests run: 51, Failures: 0, Errors: 0, Skipped: 0, Time elapsed: 0.013 sec - in org.apache.commons.lang3.text.StrBuilderAppendInsertTest
Running org.apache.commons.lang3.text.ExtendedMessageFormatTest
Tests run: 10, Failures: 0, Errors: 0, Skipped: 0, Time elapsed: 0.885 sec - in org.apache.commons.lang3.text.ExtendedMessageFormatTest
Running org.apache.commons.lang3.text.StrSubstitutorTest
Tests run: 40, Failures: 0, Errors: 0, Skipped: 0, Time elapsed: 0.039 sec - in org.apache.commons.lang3.text.StrSubstitutorTest
Running org.apache.commons.lang3.text.StrBuilderTest
Tests run: 90, Failures: 0, Errors: 0, Skipped: 0, Time elapsed: 0.062 sec - in org.apache.commons.lang3.text.StrBuilderTest
Running org.apache.commons.lang3.StringEscapeUtilsTest
Tests run: 28, Failures: 0, Errors: 0, Skipped: 0, Time elapsed: 0.488 sec - in org.apache.commons.lang3.StringEscapeUtilsTest
Running org.apache.commons.lang3.AnnotationUtilsTest
Tests run: 10, Failures: 0, Errors: 0, Skipped: 0, Time elapsed: 0.018 sec - in org.apache.commons.lang3.AnnotationUtilsTest
Running org.apache.commons.lang3.ConversionTest
Tests run: 42, Failures: 0, Errors: 0, Skipped: 0, Time elapsed: 0.011 sec - in org.apache.commons.lang3.ConversionTest
Running org.apache.commons.lang3.StringUtilsTrimEmptyTest
Tests run: 15, Failures: 0, Errors: 0, Skipped: 0, Time elapsed: 0.007 sec - in org.apache.commons.lang3.StringUtilsTrimEmptyTest
Running org.apache.commons.lang3.EnumUtilsTest
Tests run: 34, Failures: 0, Errors: 0, Skipped: 0, Time elapsed: 0.009 sec - in org.apache.commons.lang3.EnumUtilsTest
Running org.apache.commons.lang3.exception.ExceptionUtilsTest
Tests run: 28, Failures: 0, Errors: 0, Skipped: 0, Time elapsed: 0.03 sec - in org.apache.commons.lang3.exception.ExceptionUtilsTest
Running org.apache.commons.lang3.exception.DefaultExceptionContextTest
Tests run: 8, Failures: 0, Errors: 0, Skipped: 0, Time elapsed: 0.004 sec - in org.apache.commons.lang3.exception.DefaultExceptionContextTest
Running org.apache.commons.lang3.exception.ContextedExceptionTest
Tests run: 14, Failures: 0, Errors: 0, Skipped: 0, Time elapsed: 0.011 sec - in org.apache.commons.lang3.exception.ContextedExceptionTest
Running org.apache.commons.lang3.exception.ContextedRuntimeExceptionTest
Tests run: 14, Failures: 0, Errors: 0, Skipped: 0, Time elapsed: 0.01 sec - in org.apache.commons.lang3.exception.ContextedRuntimeExceptionTest
Running org.apache.commons.lang3.BitFieldTest
Tests run: 15, Failures: 0, Errors: 0, Skipped: 0, Time elapsed: 0.002 sec - in org.apache.commons.lang3.BitFieldTest
Running org.apache.commons.lang3.ArrayUtilsRemoveMultipleTest
Tests run: 55, Failures: 0, Errors: 0, Skipped: 0, Time elapsed: 0.013 sec - in org.apache.commons.lang3.ArrayUtilsRemoveMultipleTest
Running org.apache.commons.lang3.HashSetvBitSetTest
Ratio=8% array=100 count=1 extract=23153119 bitset=1941803
Ratio=9% array=100 count=10 extract=19442122 bitset=1863946
Ratio=14% array=100 count=50 extract=11640223 bitset=1742754
Ratio=4% array=100 count=100 extract=10617017 bitset=465295
Ratio=82% array=1000 count=10 extract=6278879 bitset=5172908
Ratio=21% array=1000 count=100 extract=22121707 bitset=4773768
Ratio=6% array=1000 count=500 extract=45680742 bitset=3160847
Ratio=1% array=1000 count=1000 extract=75515270 bitset=789588
Ratio=4% count=0 hash=4939101 bits=203278
Ratio=3% count=5 hash=5315724 bits=205843
Ratio=29% count=10 hash=964722 bits=287053
Ratio=23% count=200 hash=19617368 bits=4519111
Ratio=15% count=50 hash=8733955 bits=1392068
Ratio=24% count=100 hash=9618286 bits=2311176
Ratio=21% count=1000 hash=78969099 bits=17038764
Ratio=25% count=2000 hash=158984924 bits=39889457
Tests run: 2, Failures: 0, Errors: 0, Skipped: 0, Time elapsed: 0.701 sec - in org.apache.commons.lang3.HashSetvBitSetTest
Running org.apache.commons.lang3.StringUtilsTest
Tests run: 124, Failures: 0, Errors: 0, Skipped: 0, Time elapsed: 0.257 sec - in org.apache.commons.lang3.StringUtilsTest
Running org.apache.commons.lang3.ArrayUtilsRemoveTest
Tests run: 19, Failures: 0, Errors: 0, Skipped: 0, Time elapsed: 0.01 sec - in org.apache.commons.lang3.ArrayUtilsRemoveTest
Running org.apache.commons.lang3.ObjectUtilsTest
Tests run: 36, Failures: 0, Errors: 0, Skipped: 0, Time elapsed: 0.022 sec - in org.apache.commons.lang3.ObjectUtilsTest
Running org.apache.commons.lang3.ClassPathUtilsTest
Tests run: 13, Failures: 0, Errors: 0, Skipped: 0, Time elapsed: 0.019 sec - in org.apache.commons.lang3.ClassPathUtilsTest
Running org.apache.commons.lang3.math.NumberUtilsTest
Tests run: 91, Failures: 0, Errors: 0, Skipped: 0, Time elapsed: 0.051 sec - in org.apache.commons.lang3.math.NumberUtilsTest
Running org.apache.commons.lang3.math.IEEE754rUtilsTest
Tests run: 3, Failures: 0, Errors: 0, Skipped: 0, Time elapsed: 0.001 sec - in org.apache.commons.lang3.math.IEEE754rUtilsTest
Running org.apache.commons.lang3.math.FractionTest
Tests run: 25, Failures: 0, Errors: 0, Skipped: 0, Time elapsed: 0.09 sec - in org.apache.commons.lang3.math.FractionTest
Running org.apache.commons.lang3.BooleanUtilsTest
Tests run: 72, Failures: 0, Errors: 0, Skipped: 0, Time elapsed: 0.013 sec - in org.apache.commons.lang3.BooleanUtilsTest
Running org.apache.commons.lang3.CharSequenceUtilsTest
Tests run: 2, Failures: 0, Errors: 0, Skipped: 0, Time elapsed: 0 sec - in org.apache.commons.lang3.CharSequenceUtilsTest
Running org.apache.commons.lang3.CharSetUtilsTest
Tests run: 11, Failures: 0, Errors: 0, Skipped: 0, Time elapsed: 0.001 sec - in org.apache.commons.lang3.CharSetUtilsTest
Running org.apache.commons.lang3.ArrayUtilsAddTest
Tests run: 13, Failures: 0, Errors: 0, Skipped: 0, Time elapsed: 0.003 sec - in org.apache.commons.lang3.ArrayUtilsAddTest
Running org.apache.commons.lang3.CharEncodingTest
Tests run: 6, Failures: 0, Errors: 0, Skipped: 0, Time elapsed: 0.023 sec - in org.apache.commons.lang3.CharEncodingTest
Running org.apache.commons.lang3.ClassUtilsTest
Tests run: 57, Failures: 0, Errors: 0, Skipped: 0, Time elapsed: 0.034 sec - in org.apache.commons.lang3.ClassUtilsTest
Running org.apache.commons.lang3.RangeTest
Tests run: 24, Failures: 0, Errors: 0, Skipped: 0, Time elapsed: 0.016 sec - in org.apache.commons.lang3.RangeTest
Running org.apache.commons.lang3.event.EventUtilsTest
Tests run: 8, Failures: 0, Errors: 0, Skipped: 0, Time elapsed: 0.021 sec - in org.apache.commons.lang3.event.EventUtilsTest
Running org.apache.commons.lang3.event.EventListenerSupportTest
Tests run: 9, Failures: 0, Errors: 0, Skipped: 0, Time elapsed: 0.024 sec - in org.apache.commons.lang3.event.EventListenerSupportTest
Running org.apache.commons.lang3.ArrayUtilsTest
Tests run: 205, Failures: 0, Errors: 0, Skipped: 0, Time elapsed: 0.054 sec - in org.apache.commons.lang3.ArrayUtilsTest
Running org.apache.commons.lang3.CharUtilsTest
Tests run: 24, Failures: 0, Errors: 0, Skipped: 0, Time elapsed: 0.006 sec - in org.apache.commons.lang3.CharUtilsTest
Running org.apache.commons.lang3.NotImplementedExceptionTest
Tests run: 1, Failures: 0, Errors: 0, Skipped: 0, Time elapsed: 0 sec - in org.apache.commons.lang3.NotImplementedExceptionTest
Running org.apache.commons.lang3.StringUtilsEqualsIndexOfTest
Tests run: 50, Failures: 0, Errors: 0, Skipped: 0, Time elapsed: 0.003 sec - in org.apache.commons.lang3.StringUtilsEqualsIndexOfTest
Running org.apache.commons.lang3.RandomUtilsTest
Tests run: 23, Failures: 0, Errors: 0, Skipped: 0, Time elapsed: 0.01 sec - in org.apache.commons.lang3.RandomUtilsTest

Results :

Failed tests: 
  StrTokenizerTest.test1:60 {} expected:<8> but was:<0>
  StrTokenizerTest.test2:81 {} expected:<8> but was:<0>
  StrTokenizerTest.test3:102 {} expected:<8> but was:<0>
  StrTokenizerTest.test4:123 {} expected:<5> but was:<0>
  StrTokenizerTest.test5:145 {} expected:<8> but was:<0>
  StrTokenizerTest.test6:179 {} expected:<8> but was:<0>
  StrTokenizerTest.test7:202 {} expected:<8> but was:<0>
  StrTokenizerTest.test8:223 {} expected:<5> but was:<0>
  StrTokenizerTest.testGetContent:550 expected:<a   b c "d e" f > but was:<null>
  StrTokenizerTest.testIteration:808 null
  StrTokenizerTest.testListArray:507 expected:<3> but was:<0>

Tests in error: 
  StrTokenizerTest.testBasic1:235 » NoSuchElement
  StrTokenizerTest.testBasic2:245 » NoSuchElement
  StrTokenizerTest.testBasic3:255 » NoSuchElement
  StrTokenizerTest.testBasic4:265 » NoSuchElement
  StrTokenizerTest.testBasic5:275 » NoSuchElement
  StrTokenizerTest.testBasicDelim1:285 » NoSuchElement
  StrTokenizerTest.testBasicDelim2:295 » NoSuchElement
  StrTokenizerTest.testBasicEmpty1:304 » NoSuchElement
  StrTokenizerTest.testBasicEmpty2:317 » NoSuchElement
  StrTokenizerTest.testBasicIgnoreTrimmed1:451 » NoSuchElement
  StrTokenizerTest.testBasicIgnoreTrimmed2:465 » NoSuchElement
  StrTokenizerTest.testBasicIgnoreTrimmed3:478 » NoSuchElement
  StrTokenizerTest.testBasicIgnoreTrimmed4:492 » NoSuchElement
  StrTokenizerTest.testBasicQuoted1:328 » NoSuchElement
  StrTokenizerTest.testBasicQuoted2:340 » NoSuchElement
  StrTokenizerTest.testBasicQuoted3:352 » NoSuchElement
  StrTokenizerTest.testBasicQuoted4:364 » NoSuchElement
  StrTokenizerTest.testBasicQuoted5:377 » NoSuchElement
  StrTokenizerTest.testBasicQuoted6:388 » NoSuchElement
  StrTokenizerTest.testBasicQuoted7:398 » NoSuchElement
  StrTokenizerTest.testBasicQuotedTrimmed1:411 » NoSuchElement
  StrTokenizerTest.testBasicTrimmed1:424 » NoSuchElement
  StrTokenizerTest.testBasicTrimmed2:437 » NoSuchElement
  StrTokenizerTest.testConstructor_String:627 » NoSuchElement
  StrTokenizerTest.testConstructor_String_char:643 » NoSuchElement
  StrTokenizerTest.testConstructor_String_char_char:660 » NoSuchElement
  StrTokenizerTest.testReset:723 » NoSuchElement
  StrTokenizerTest.testToString:876 » NoSuchElement
  StrTokenizerTest.testTokenizeSubclassOutputChange:866 » NoSuchElement


Tests run: 3526, Failures: 11, Errors: 29, Skipped: 97

[INFO] ------------------------------------------------------------------------
[INFO] BUILD FAILURE
[INFO] ------------------------------------------------------------------------
[INFO] Total time: 37.703s
[INFO] Finished at: Wed Aug 05 04:03:19 BST 2015
[INFO] Final Memory: 24M/414M
[INFO] ------------------------------------------------------------------------
[ERROR] Failed to execute goal org.apache.maven.plugins:maven-surefire-plugin:2.18:test (default-test) on project commons-lang3: There are test failures.
[ERROR] 
[ERROR] Please refer to /home/perham/Study/LittleDarwin/Cases/commons-lang3-3.4-src/target/surefire-reports for the individual test results.
[ERROR] -> [Help 1]
[ERROR] 
[ERROR] To see the full stack trace of the errors, re-run Maven with the -e switch.
[ERROR] Re-run Maven using the -X switch to enable full debug logging.
[ERROR] 
[ERROR] For more information about the errors and possible solutions, please read the following articles:
[ERROR] [Help 1] http://cwiki.apache.org/confluence/display/MAVEN/MojoFailureException
