[INFO] Scanning for projects...
[INFO]                                                                         
[INFO] ------------------------------------------------------------------------
[INFO] Building Apache Commons Lang 3.4
[INFO] ------------------------------------------------------------------------
[INFO] 
[INFO] --- maven-enforcer-plugin:1.3.1:enforce (enforce-maven-3) @ commons-lang3 ---
[INFO] 
[INFO] --- build-helper-maven-plugin:1.8:parse-version (parse-version) @ commons-lang3 ---
[INFO] 
[INFO] --- maven-antrun-plugin:1.8:run (javadoc.resources) @ commons-lang3 ---
[INFO] Executing tasks

main:
[INFO] Executed tasks
[INFO] 
[INFO] --- maven-remote-resources-plugin:1.5:process (default) @ commons-lang3 ---
[INFO] 
[INFO] --- buildnumber-maven-plugin:1.3:create (default) @ commons-lang3 ---
[INFO] Executing: /bin/sh -c cd /home/perham/Study/LittleDarwin/Cases/commons-lang3-3.4-src && svn --non-interactive info
[INFO] Working directory: /home/perham/Study/LittleDarwin/Cases/commons-lang3-3.4-src
[INFO] Storing buildNumber: ?????? at timestamp: 1438739168097
[INFO] Executing: /bin/sh -c cd /home/perham/Study/LittleDarwin/Cases/commons-lang3-3.4-src && svn --non-interactive info
[INFO] Working directory: /home/perham/Study/LittleDarwin/Cases/commons-lang3-3.4-src
[INFO] Storing buildScmBranch: UNKNOWN_BRANCH
[INFO] 
[INFO] --- maven-resources-plugin:2.7:resources (default-resources) @ commons-lang3 ---
[INFO] Using 'ISO-8859-1' encoding to copy filtered resources.
[INFO] Copying 0 resource
[INFO] Copying 2 resources to META-INF
[INFO] 
[INFO] --- maven-compiler-plugin:3.2:compile (default-compile) @ commons-lang3 ---
[INFO] Changes detected - recompiling the module!
[INFO] Compiling 133 source files to /home/perham/Study/LittleDarwin/Cases/commons-lang3-3.4-src/target/classes
[INFO] /home/perham/Study/LittleDarwin/Cases/commons-lang3-3.4-src/src/main/java/org/apache/commons/lang3/SerializationUtils.java: /home/perham/Study/LittleDarwin/Cases/commons-lang3-3.4-src/src/main/java/org/apache/commons/lang3/SerializationUtils.java uses unchecked or unsafe operations.
[INFO] /home/perham/Study/LittleDarwin/Cases/commons-lang3-3.4-src/src/main/java/org/apache/commons/lang3/SerializationUtils.java: Recompile with -Xlint:unchecked for details.
[INFO] 
[INFO] --- maven-bundle-plugin:2.5.3:manifest (bundle-manifest) @ commons-lang3 ---
[INFO] 
[INFO] --- animal-sniffer-maven-plugin:1.13:check (checkAPIcompatibility) @ commons-lang3 ---
[INFO] Checking unresolved references to org.codehaus.mojo.signature:java16:1.0
[INFO] 
[INFO] --- maven-resources-plugin:2.7:testResources (default-testResources) @ commons-lang3 ---
[INFO] Using 'ISO-8859-1' encoding to copy filtered resources.
[INFO] Copying 2 resources
[INFO] Copying 2 resources to META-INF
[INFO] 
[INFO] --- maven-compiler-plugin:3.2:testCompile (default-testCompile) @ commons-lang3 ---
[INFO] Nothing to compile - all classes are up to date
[INFO] 
[INFO] --- maven-surefire-plugin:2.18:test (default-test) @ commons-lang3 ---
[INFO] Surefire report directory: /home/perham/Study/LittleDarwin/Cases/commons-lang3-3.4-src/target/surefire-reports

-------------------------------------------------------
 T E S T S
-------------------------------------------------------
Running org.apache.commons.lang3.ValidateTest
Tests run: 63, Failures: 0, Errors: 0, Skipped: 0, Time elapsed: 0.096 sec - in org.apache.commons.lang3.ValidateTest
Running org.apache.commons.lang3.LocaleUtilsTest
Tests run: 15, Failures: 0, Errors: 0, Skipped: 0, Time elapsed: 0.056 sec - in org.apache.commons.lang3.LocaleUtilsTest
Running org.apache.commons.lang3.tuple.MutableTripleTest
Tests run: 8, Failures: 0, Errors: 0, Skipped: 0, Time elapsed: 0.018 sec - in org.apache.commons.lang3.tuple.MutableTripleTest
Running org.apache.commons.lang3.tuple.TripleTest
Tests run: 10, Failures: 0, Errors: 0, Skipped: 0, Time elapsed: 0.009 sec - in org.apache.commons.lang3.tuple.TripleTest
Running org.apache.commons.lang3.tuple.ImmutablePairTest
Tests run: 6, Failures: 0, Errors: 0, Skipped: 0, Time elapsed: 0 sec - in org.apache.commons.lang3.tuple.ImmutablePairTest
Running org.apache.commons.lang3.tuple.MutablePairTest
Tests run: 8, Failures: 0, Errors: 0, Skipped: 0, Time elapsed: 0 sec - in org.apache.commons.lang3.tuple.MutablePairTest
Running org.apache.commons.lang3.tuple.ImmutableTripleTest
Tests run: 6, Failures: 0, Errors: 0, Skipped: 0, Time elapsed: 0 sec - in org.apache.commons.lang3.tuple.ImmutableTripleTest
Running org.apache.commons.lang3.tuple.PairTest
Tests run: 9, Failures: 0, Errors: 0, Skipped: 0, Time elapsed: 0.001 sec - in org.apache.commons.lang3.tuple.PairTest
Running org.apache.commons.lang3.StringUtilsIsTest
Tests run: 8, Failures: 0, Errors: 0, Skipped: 0, Time elapsed: 0.007 sec - in org.apache.commons.lang3.StringUtilsIsTest
Running org.apache.commons.lang3.JavaVersionTest
Tests run: 3, Failures: 0, Errors: 0, Skipped: 0, Time elapsed: 0 sec - in org.apache.commons.lang3.JavaVersionTest
Running org.apache.commons.lang3.builder.NoFieldNamesToStringStyleTest
Tests run: 8, Failures: 0, Errors: 0, Skipped: 0, Time elapsed: 0.001 sec - in org.apache.commons.lang3.builder.NoFieldNamesToStringStyleTest
Running org.apache.commons.lang3.builder.ShortPrefixToStringStyleTest
Tests run: 8, Failures: 0, Errors: 0, Skipped: 0, Time elapsed: 0.005 sec - in org.apache.commons.lang3.builder.ShortPrefixToStringStyleTest
Running org.apache.commons.lang3.builder.DiffResultTest
Tests run: 9, Failures: 0, Errors: 0, Skipped: 0, Time elapsed: 0.012 sec - in org.apache.commons.lang3.builder.DiffResultTest
Running org.apache.commons.lang3.builder.CompareToBuilderTest
Tests run: 48, Failures: 0, Errors: 0, Skipped: 0, Time elapsed: 0.026 sec - in org.apache.commons.lang3.builder.CompareToBuilderTest
Running org.apache.commons.lang3.builder.MultilineRecursiveToStringStyleTest
Tests run: 10, Failures: 0, Errors: 0, Skipped: 0, Time elapsed: 0.001 sec - in org.apache.commons.lang3.builder.MultilineRecursiveToStringStyleTest
Running org.apache.commons.lang3.builder.RecursiveToStringStyleTest
Tests run: 8, Failures: 0, Errors: 0, Skipped: 0, Time elapsed: 0.012 sec - in org.apache.commons.lang3.builder.RecursiveToStringStyleTest
Running org.apache.commons.lang3.builder.DefaultToStringStyleTest
Tests run: 8, Failures: 0, Errors: 0, Skipped: 0, Time elapsed: 0.001 sec - in org.apache.commons.lang3.builder.DefaultToStringStyleTest
Running org.apache.commons.lang3.builder.ReflectionToStringBuilderExcludeTest
Tests run: 11, Failures: 0, Errors: 0, Skipped: 0, Time elapsed: 0.001 sec - in org.apache.commons.lang3.builder.ReflectionToStringBuilderExcludeTest
Running org.apache.commons.lang3.builder.StandardToStringStyleTest
Tests run: 8, Failures: 0, Errors: 0, Skipped: 0, Time elapsed: 0.001 sec - in org.apache.commons.lang3.builder.StandardToStringStyleTest
Running org.apache.commons.lang3.builder.ToStringStyleTest
Tests run: 12, Failures: 0, Errors: 0, Skipped: 0, Time elapsed: 0.003 sec - in org.apache.commons.lang3.builder.ToStringStyleTest
Running org.apache.commons.lang3.builder.DiffTest
Tests run: 4, Failures: 0, Errors: 0, Skipped: 0, Time elapsed: 0.001 sec - in org.apache.commons.lang3.builder.DiffTest
Running org.apache.commons.lang3.builder.SimpleToStringStyleTest
Tests run: 8, Failures: 0, Errors: 0, Skipped: 0, Time elapsed: 0.002 sec - in org.apache.commons.lang3.builder.SimpleToStringStyleTest
Running org.apache.commons.lang3.builder.MultiLineToStringStyleTest
Tests run: 8, Failures: 0, Errors: 0, Skipped: 0, Time elapsed: 0.012 sec - in org.apache.commons.lang3.builder.MultiLineToStringStyleTest
Running org.apache.commons.lang3.builder.ToStringStyleConcurrencyTest
Tests run: 3, Failures: 0, Errors: 0, Skipped: 0, Time elapsed: 5.31 sec - in org.apache.commons.lang3.builder.ToStringStyleConcurrencyTest
Running org.apache.commons.lang3.builder.ReflectionToStringBuilderMutateInspectConcurrencyTest
Tests run: 1, Failures: 0, Errors: 0, Skipped: 1, Time elapsed: 0 sec - in org.apache.commons.lang3.builder.ReflectionToStringBuilderMutateInspectConcurrencyTest
Running org.apache.commons.lang3.builder.ToStringBuilderTest
Tests run: 74, Failures: 0, Errors: 0, Skipped: 1, Time elapsed: 0.053 sec - in org.apache.commons.lang3.builder.ToStringBuilderTest
Running org.apache.commons.lang3.builder.EqualsBuilderTest
Tests run: 48, Failures: 0, Errors: 0, Skipped: 0, Time elapsed: 0.012 sec - in org.apache.commons.lang3.builder.EqualsBuilderTest
Running org.apache.commons.lang3.builder.HashCodeBuilderAndEqualsBuilderTest
Tests run: 4, Failures: 0, Errors: 0, Skipped: 0, Time elapsed: 0.009 sec - in org.apache.commons.lang3.builder.HashCodeBuilderAndEqualsBuilderTest
Running org.apache.commons.lang3.builder.ReflectionToStringBuilderConcurrencyTest
Tests run: 3, Failures: 0, Errors: 0, Skipped: 3, Time elapsed: 0.001 sec - in org.apache.commons.lang3.builder.ReflectionToStringBuilderConcurrencyTest
Running org.apache.commons.lang3.builder.JsonToStringStyleTest
Tests run: 9, Failures: 0, Errors: 0, Skipped: 0, Time elapsed: 0.004 sec - in org.apache.commons.lang3.builder.JsonToStringStyleTest
Running org.apache.commons.lang3.builder.NoClassNameToStringStyleTest
Tests run: 8, Failures: 0, Errors: 0, Skipped: 0, Time elapsed: 0.004 sec - in org.apache.commons.lang3.builder.NoClassNameToStringStyleTest
Running org.apache.commons.lang3.builder.DiffBuilderTest
Tests run: 30, Failures: 0, Errors: 0, Skipped: 0, Time elapsed: 0.031 sec - in org.apache.commons.lang3.builder.DiffBuilderTest
Running org.apache.commons.lang3.builder.HashCodeBuilderTest
Tests run: 44, Failures: 0, Errors: 0, Skipped: 0, Time elapsed: 0.022 sec - in org.apache.commons.lang3.builder.HashCodeBuilderTest
Running org.apache.commons.lang3.concurrent.AtomicInitializerTest
Tests run: 3, Failures: 0, Errors: 0, Skipped: 0, Time elapsed: 0.005 sec - in org.apache.commons.lang3.concurrent.AtomicInitializerTest
Running org.apache.commons.lang3.concurrent.CallableBackgroundInitializerTest
Tests run: 4, Failures: 0, Errors: 0, Skipped: 0, Time elapsed: 0.001 sec - in org.apache.commons.lang3.concurrent.CallableBackgroundInitializerTest
Running org.apache.commons.lang3.concurrent.BackgroundInitializerTest
Tests run: 15, Failures: 0, Errors: 0, Skipped: 0, Time elapsed: 0.027 sec - in org.apache.commons.lang3.concurrent.BackgroundInitializerTest
Running org.apache.commons.lang3.concurrent.LazyInitializerTest
Tests run: 3, Failures: 0, Errors: 0, Skipped: 0, Time elapsed: 0.008 sec - in org.apache.commons.lang3.concurrent.LazyInitializerTest
Running org.apache.commons.lang3.concurrent.BasicThreadFactoryTest
Tests run: 15, Failures: 0, Errors: 0, Skipped: 0, Time elapsed: 0.033 sec - in org.apache.commons.lang3.concurrent.BasicThreadFactoryTest
Running org.apache.commons.lang3.concurrent.ConstantInitializerTest
Tests run: 7, Failures: 0, Errors: 0, Skipped: 0, Time elapsed: 0.001 sec - in org.apache.commons.lang3.concurrent.ConstantInitializerTest
Running org.apache.commons.lang3.concurrent.MultiBackgroundInitializerTest
Tests run: 17, Failures: 0, Errors: 0, Skipped: 0, Time elapsed: 0.087 sec - in org.apache.commons.lang3.concurrent.MultiBackgroundInitializerTest
Running org.apache.commons.lang3.concurrent.AtomicSafeInitializerTest
Tests run: 4, Failures: 0, Errors: 0, Skipped: 0, Time elapsed: 0.009 sec - in org.apache.commons.lang3.concurrent.AtomicSafeInitializerTest
Running org.apache.commons.lang3.concurrent.ConcurrentUtilsTest
Tests run: 40, Failures: 0, Errors: 0, Skipped: 0, Time elapsed: 0.013 sec - in org.apache.commons.lang3.concurrent.ConcurrentUtilsTest
Running org.apache.commons.lang3.concurrent.TimedSemaphoreTest
Tests run: 15, Failures: 0, Errors: 0, Skipped: 0, Time elapsed: 1.178 sec - in org.apache.commons.lang3.concurrent.TimedSemaphoreTest
Running org.apache.commons.lang3.StringUtilsSubstringTest
Tests run: 14, Failures: 0, Errors: 0, Skipped: 0, Time elapsed: 0.004 sec - in org.apache.commons.lang3.StringUtilsSubstringTest
Running org.apache.commons.lang3.SystemUtilsTest
Tests run: 12, Failures: 0, Errors: 0, Skipped: 0, Time elapsed: 0.002 sec - in org.apache.commons.lang3.SystemUtilsTest
Running org.apache.commons.lang3.CharRangeTest
Tests run: 16, Failures: 0, Errors: 0, Skipped: 0, Time elapsed: 0.033 sec - in org.apache.commons.lang3.CharRangeTest
Running org.apache.commons.lang3.CharSetTest
Tests run: 14, Failures: 0, Errors: 0, Skipped: 0, Time elapsed: 0.01 sec - in org.apache.commons.lang3.CharSetTest
Running org.apache.commons.lang3.StringUtilsStartsEndsWithTest
Tests run: 6, Failures: 0, Errors: 0, Skipped: 0, Time elapsed: 0.003 sec - in org.apache.commons.lang3.StringUtilsStartsEndsWithTest
Running org.apache.commons.lang3.RandomStringUtilsTest
Tests run: 11, Failures: 0, Errors: 0, Skipped: 0, Time elapsed: 0.034 sec - in org.apache.commons.lang3.RandomStringUtilsTest
Running org.apache.commons.lang3.SerializationUtilsTest
Tests run: 26, Failures: 0, Errors: 0, Skipped: 0, Time elapsed: 0.056 sec - in org.apache.commons.lang3.SerializationUtilsTest
Running org.apache.commons.lang3.time.StopWatchTest
Tests run: 8, Failures: 0, Errors: 0, Skipped: 0, Time elapsed: 4.761 sec - in org.apache.commons.lang3.time.StopWatchTest
Running org.apache.commons.lang3.time.DateUtilsRoundingTest
Tests run: 22, Failures: 0, Errors: 0, Skipped: 0, Time elapsed: 0.168 sec - in org.apache.commons.lang3.time.DateUtilsRoundingTest
Running org.apache.commons.lang3.time.FastDateParserTest
Tests run: 33, Failures: 0, Errors: 0, Skipped: 0, Time elapsed: 2.469 sec - in org.apache.commons.lang3.time.FastDateParserTest
Running org.apache.commons.lang3.time.FastDateFormat_ParserTest
Tests run: 33, Failures: 0, Errors: 0, Skipped: 0, Time elapsed: 0.86 sec - in org.apache.commons.lang3.time.FastDateFormat_ParserTest
Running org.apache.commons.lang3.time.DurationFormatUtilsTest
Tests run: 25, Failures: 0, Errors: 0, Skipped: 0, Time elapsed: 1.04 sec - in org.apache.commons.lang3.time.DurationFormatUtilsTest
Running org.apache.commons.lang3.time.DateFormatUtilsTest
Tests run: 10, Failures: 0, Errors: 0, Skipped: 0, Time elapsed: 0.003 sec - in org.apache.commons.lang3.time.DateFormatUtilsTest
Running org.apache.commons.lang3.time.DateUtilsFragmentTest
Tests run: 57, Failures: 0, Errors: 0, Skipped: 0, Time elapsed: 0.012 sec - in org.apache.commons.lang3.time.DateUtilsFragmentTest
Running org.apache.commons.lang3.time.FastDatePrinterTimeZonesTest
Tests run: 617, Failures: 0, Errors: 0, Skipped: 0, Time elapsed: 0.27 sec - in org.apache.commons.lang3.time.FastDatePrinterTimeZonesTest
Running org.apache.commons.lang3.time.FastDateFormatTest
>>FastDateFormatTest: FastDateParser:20050  SimpleDateFormat:4517
Tests run: 14, Failures: 0, Errors: 0, Skipped: 0, Time elapsed: 2.742 sec - in org.apache.commons.lang3.time.FastDateFormatTest
Running org.apache.commons.lang3.time.FastDateFormat_PrinterTest
Tests run: 17, Failures: 0, Errors: 0, Skipped: 0, Time elapsed: 0.013 sec - in org.apache.commons.lang3.time.FastDateFormat_PrinterTest
Running org.apache.commons.lang3.time.FastDatePrinterTest
Tests run: 17, Failures: 0, Errors: 0, Skipped: 0, Time elapsed: 0.004 sec - in org.apache.commons.lang3.time.FastDatePrinterTest
Running org.apache.commons.lang3.time.FastDateParserSDFTest
Tests run: 276, Failures: 0, Errors: 0, Skipped: 92, Time elapsed: 0.077 sec - in org.apache.commons.lang3.time.FastDateParserSDFTest
Running org.apache.commons.lang3.time.DateUtilsTest
DateUtilsTest: Default Locale=en_US
Tests run: 38, Failures: 0, Errors: 0, Skipped: 0, Time elapsed: 0.027 sec - in org.apache.commons.lang3.time.DateUtilsTest
Running org.apache.commons.lang3.reflect.InheritanceUtilsTest
Tests run: 9, Failures: 0, Errors: 0, Skipped: 0, Time elapsed: 0.003 sec - in org.apache.commons.lang3.reflect.InheritanceUtilsTest
Running org.apache.commons.lang3.reflect.MethodUtilsTest
Tests run: 23, Failures: 0, Errors: 0, Skipped: 0, Time elapsed: 0.058 sec - in org.apache.commons.lang3.reflect.MethodUtilsTest
Running org.apache.commons.lang3.reflect.ConstructorUtilsTest
Tests run: 7, Failures: 0, Errors: 0, Skipped: 0, Time elapsed: 0.005 sec - in org.apache.commons.lang3.reflect.ConstructorUtilsTest
Running org.apache.commons.lang3.reflect.FieldUtilsTest
Tests run: 64, Failures: 0, Errors: 0, Skipped: 0, Time elapsed: 0.039 sec - in org.apache.commons.lang3.reflect.FieldUtilsTest
Running org.apache.commons.lang3.reflect.TypeLiteralTest
Tests run: 4, Failures: 0, Errors: 0, Skipped: 0, Time elapsed: 0.022 sec - in org.apache.commons.lang3.reflect.TypeLiteralTest
Running org.apache.commons.lang3.reflect.TypeUtilsTest
Tests run: 19, Failures: 0, Errors: 0, Skipped: 0, Time elapsed: 0.046 sec - in org.apache.commons.lang3.reflect.TypeUtilsTest
Running org.apache.commons.lang3.mutable.MutableByteTest
Tests run: 17, Failures: 0, Errors: 0, Skipped: 0, Time elapsed: 0.007 sec - in org.apache.commons.lang3.mutable.MutableByteTest
Running org.apache.commons.lang3.mutable.MutableShortTest
Tests run: 14, Failures: 0, Errors: 0, Skipped: 0, Time elapsed: 0.006 sec - in org.apache.commons.lang3.mutable.MutableShortTest
Running org.apache.commons.lang3.mutable.MutableIntTest
Tests run: 17, Failures: 0, Errors: 0, Skipped: 0, Time elapsed: 0.007 sec - in org.apache.commons.lang3.mutable.MutableIntTest
Running org.apache.commons.lang3.mutable.MutableDoubleTest
Tests run: 18, Failures: 0, Errors: 0, Skipped: 0, Time elapsed: 0.008 sec - in org.apache.commons.lang3.mutable.MutableDoubleTest
Running org.apache.commons.lang3.mutable.MutableFloatTest
Tests run: 18, Failures: 0, Errors: 0, Skipped: 0, Time elapsed: 0.006 sec - in org.apache.commons.lang3.mutable.MutableFloatTest
Running org.apache.commons.lang3.mutable.MutableLongTest
Tests run: 17, Failures: 0, Errors: 0, Skipped: 0, Time elapsed: 0.004 sec - in org.apache.commons.lang3.mutable.MutableLongTest
Running org.apache.commons.lang3.mutable.MutableBooleanTest
Tests run: 9, Failures: 0, Errors: 0, Skipped: 0, Time elapsed: 0.001 sec - in org.apache.commons.lang3.mutable.MutableBooleanTest
Running org.apache.commons.lang3.mutable.MutableObjectTest
Tests run: 5, Failures: 0, Errors: 0, Skipped: 0, Time elapsed: 0 sec - in org.apache.commons.lang3.mutable.MutableObjectTest
Running org.apache.commons.lang3.text.translate.UnicodeEscaperTest
Tests run: 3, Failures: 0, Errors: 0, Skipped: 0, Time elapsed: 0 sec - in org.apache.commons.lang3.text.translate.UnicodeEscaperTest
Running org.apache.commons.lang3.text.translate.EntityArraysTest
Tests run: 3, Failures: 0, Errors: 0, Skipped: 0, Time elapsed: 0.001 sec - in org.apache.commons.lang3.text.translate.EntityArraysTest
Running org.apache.commons.lang3.text.translate.UnicodeUnpairedSurrogateRemoverTest
Tests run: 2, Failures: 0, Errors: 0, Skipped: 0, Time elapsed: 0.001 sec - in org.apache.commons.lang3.text.translate.UnicodeUnpairedSurrogateRemoverTest
Running org.apache.commons.lang3.text.translate.NumericEntityUnescaperTest
Tests run: 3, Failures: 0, Errors: 0, Skipped: 0, Time elapsed: 0 sec - in org.apache.commons.lang3.text.translate.NumericEntityUnescaperTest
Running org.apache.commons.lang3.text.translate.NumericEntityEscaperTest
Tests run: 4, Failures: 0, Errors: 0, Skipped: 0, Time elapsed: 0 sec - in org.apache.commons.lang3.text.translate.NumericEntityEscaperTest
Running org.apache.commons.lang3.text.translate.LookupTranslatorTest
Tests run: 2, Failures: 0, Errors: 0, Skipped: 0, Time elapsed: 0 sec - in org.apache.commons.lang3.text.translate.LookupTranslatorTest
Running org.apache.commons.lang3.text.translate.UnicodeUnescaperTest
Tests run: 3, Failures: 0, Errors: 0, Skipped: 0, Time elapsed: 0.001 sec - in org.apache.commons.lang3.text.translate.UnicodeUnescaperTest
Running org.apache.commons.lang3.text.translate.OctalUnescaperTest
Tests run: 1, Failures: 0, Errors: 0, Skipped: 0, Time elapsed: 0 sec - in org.apache.commons.lang3.text.translate.OctalUnescaperTest
Running org.apache.commons.lang3.text.StrMatcherTest
Tests run: 14, Failures: 0, Errors: 0, Skipped: 0, Time elapsed: 0 sec - in org.apache.commons.lang3.text.StrMatcherTest
Running org.apache.commons.lang3.text.StrTokenizerTest
Tests run: 55, Failures: 0, Errors: 0, Skipped: 0, Time elapsed: 0.011 sec - in org.apache.commons.lang3.text.StrTokenizerTest
Running org.apache.commons.lang3.text.FormattableUtilsTest
Tests run: 5, Failures: 0, Errors: 0, Skipped: 0, Time elapsed: 0 sec - in org.apache.commons.lang3.text.FormattableUtilsTest
Running org.apache.commons.lang3.text.CompositeFormatTest
Tests run: 2, Failures: 0, Errors: 0, Skipped: 0, Time elapsed: 0.002 sec - in org.apache.commons.lang3.text.CompositeFormatTest
Running org.apache.commons.lang3.text.WordUtilsTest
Tests run: 12, Failures: 0, Errors: 0, Skipped: 0, Time elapsed: 0.003 sec - in org.apache.commons.lang3.text.WordUtilsTest
Running org.apache.commons.lang3.text.StrLookupTest
Tests run: 5, Failures: 0, Errors: 0, Skipped: 0, Time elapsed: 0.002 sec - in org.apache.commons.lang3.text.StrLookupTest
Running org.apache.commons.lang3.text.StrBuilderAppendInsertTest
Tests run: 51, Failures: 0, Errors: 0, Skipped: 0, Time elapsed: 0.019 sec - in org.apache.commons.lang3.text.StrBuilderAppendInsertTest
Running org.apache.commons.lang3.text.ExtendedMessageFormatTest
Tests run: 10, Failures: 0, Errors: 0, Skipped: 0, Time elapsed: 0.909 sec - in org.apache.commons.lang3.text.ExtendedMessageFormatTest
Running org.apache.commons.lang3.text.StrSubstitutorTest
Tests run: 40, Failures: 0, Errors: 40, Skipped: 0, Time elapsed: 0.051 sec <<< FAILURE! - in org.apache.commons.lang3.text.StrSubstitutorTest
testReplaceEscaping(org.apache.commons.lang3.text.StrSubstitutorTest)  Time elapsed: 0.009 sec  <<< ERROR!
java.lang.IllegalArgumentException: Variable prefix matcher must not be null!
	at org.apache.commons.lang3.text.StrSubstitutor.setVariablePrefixMatcher(StrSubstitutor.java:196)
	at org.apache.commons.lang3.text.StrSubstitutor.<init>(StrSubstitutor.java:54)
	at org.apache.commons.lang3.text.StrSubstitutor.<init>(StrSubstitutor.java:52)
	at org.apache.commons.lang3.text.StrSubstitutor.<init>(StrSubstitutor.java:37)
	at org.apache.commons.lang3.text.StrSubstitutorTest.doTestReplace(StrSubstitutorTest.java:631)
	at org.apache.commons.lang3.text.StrSubstitutorTest.testReplaceEscaping(StrSubstitutorTest.java:163)

testReplaceSoloEscaping(org.apache.commons.lang3.text.StrSubstitutorTest)  Time elapsed: 0 sec  <<< ERROR!
java.lang.IllegalArgumentException: Variable prefix matcher must not be null!
	at org.apache.commons.lang3.text.StrSubstitutor.setVariablePrefixMatcher(StrSubstitutor.java:196)
	at org.apache.commons.lang3.text.StrSubstitutor.<init>(StrSubstitutor.java:54)
	at org.apache.commons.lang3.text.StrSubstitutor.<init>(StrSubstitutor.java:52)
	at org.apache.commons.lang3.text.StrSubstitutor.<init>(StrSubstitutor.java:37)
	at org.apache.commons.lang3.text.StrSubstitutorTest.doTestReplace(StrSubstitutorTest.java:631)
	at org.apache.commons.lang3.text.StrSubstitutorTest.testReplaceSoloEscaping(StrSubstitutorTest.java:171)

testSubstituteDefaultProperties(org.apache.commons.lang3.text.StrSubstitutorTest)  Time elapsed: 0.001 sec  <<< ERROR!
java.lang.IllegalArgumentException: Variable prefix matcher must not be null!
	at org.apache.commons.lang3.text.StrSubstitutor.setVariablePrefixMatcher(StrSubstitutor.java:196)
	at org.apache.commons.lang3.text.StrSubstitutor.<init>(StrSubstitutor.java:54)
	at org.apache.commons.lang3.text.StrSubstitutor.<init>(StrSubstitutor.java:52)
	at org.apache.commons.lang3.text.StrSubstitutor.<init>(StrSubstitutor.java:37)
	at org.apache.commons.lang3.text.StrSubstitutor.replace(StrSubstitutor.java:26)
	at org.apache.commons.lang3.text.StrSubstitutor.replace(StrSubstitutor.java:34)
	at org.apache.commons.lang3.text.StrSubstitutorTest.testSubstituteDefaultProperties(StrSubstitutorTest.java:615)

testReplaceNoPrefixSuffix(org.apache.commons.lang3.text.StrSubstitutorTest)  Time elapsed: 0.001 sec  <<< ERROR!
java.lang.IllegalArgumentException: Variable prefix matcher must not be null!
	at org.apache.commons.lang3.text.StrSubstitutor.setVariablePrefixMatcher(StrSubstitutor.java:196)
	at org.apache.commons.lang3.text.StrSubstitutor.<init>(StrSubstitutor.java:54)
	at org.apache.commons.lang3.text.StrSubstitutor.<init>(StrSubstitutor.java:52)
	at org.apache.commons.lang3.text.StrSubstitutor.<init>(StrSubstitutor.java:37)
	at org.apache.commons.lang3.text.StrSubstitutorTest.doTestReplace(StrSubstitutorTest.java:631)
	at org.apache.commons.lang3.text.StrSubstitutorTest.testReplaceNoPrefixSuffix(StrSubstitutorTest.java:212)

testCyclicReplacement(org.apache.commons.lang3.text.StrSubstitutorTest)  Time elapsed: 0.001 sec  <<< ERROR!
java.lang.IllegalArgumentException: Variable prefix matcher must not be null!
	at org.apache.commons.lang3.text.StrSubstitutor.setVariablePrefixMatcher(StrSubstitutor.java:196)
	at org.apache.commons.lang3.text.StrSubstitutor.<init>(StrSubstitutor.java:54)
	at org.apache.commons.lang3.text.StrSubstitutor.<init>(StrSubstitutor.java:52)
	at org.apache.commons.lang3.text.StrSubstitutor.<init>(StrSubstitutor.java:37)
	at org.apache.commons.lang3.text.StrSubstitutorTest.testCyclicReplacement(StrSubstitutorTest.java:249)

testReplaceToIdentical(org.apache.commons.lang3.text.StrSubstitutorTest)  Time elapsed: 0.001 sec  <<< ERROR!
java.lang.IllegalArgumentException: Variable prefix matcher must not be null!
	at org.apache.commons.lang3.text.StrSubstitutor.setVariablePrefixMatcher(StrSubstitutor.java:196)
	at org.apache.commons.lang3.text.StrSubstitutor.<init>(StrSubstitutor.java:54)
	at org.apache.commons.lang3.text.StrSubstitutor.<init>(StrSubstitutor.java:52)
	at org.apache.commons.lang3.text.StrSubstitutor.<init>(StrSubstitutor.java:37)
	at org.apache.commons.lang3.text.StrSubstitutorTest.doTestReplace(StrSubstitutorTest.java:631)
	at org.apache.commons.lang3.text.StrSubstitutorTest.testReplaceToIdentical(StrSubstitutorTest.java:231)

testReplaceSimple(org.apache.commons.lang3.text.StrSubstitutorTest)  Time elapsed: 0.001 sec  <<< ERROR!
java.lang.IllegalArgumentException: Variable prefix matcher must not be null!
	at org.apache.commons.lang3.text.StrSubstitutor.setVariablePrefixMatcher(StrSubstitutor.java:196)
	at org.apache.commons.lang3.text.StrSubstitutor.<init>(StrSubstitutor.java:54)
	at org.apache.commons.lang3.text.StrSubstitutor.<init>(StrSubstitutor.java:52)
	at org.apache.commons.lang3.text.StrSubstitutor.<init>(StrSubstitutor.java:37)
	at org.apache.commons.lang3.text.StrSubstitutorTest.doTestReplace(StrSubstitutorTest.java:631)
	at org.apache.commons.lang3.text.StrSubstitutorTest.testReplaceSimple(StrSubstitutorTest.java:63)

testStaticReplacePrefixSuffix(org.apache.commons.lang3.text.StrSubstitutorTest)  Time elapsed: 0.001 sec  <<< ERROR!
java.lang.IllegalArgumentException: Variable prefix matcher must not be null!
	at org.apache.commons.lang3.text.StrSubstitutor.setVariablePrefixMatcher(StrSubstitutor.java:196)
	at org.apache.commons.lang3.text.StrSubstitutor.setVariablePrefix(StrSubstitutor.java:201)
	at org.apache.commons.lang3.text.StrSubstitutor.<init>(StrSubstitutor.java:43)
	at org.apache.commons.lang3.text.StrSubstitutor.<init>(StrSubstitutor.java:38)
	at org.apache.commons.lang3.text.StrSubstitutor.replace(StrSubstitutor.java:27)
	at org.apache.commons.lang3.text.StrSubstitutorTest.testStaticReplacePrefixSuffix(StrSubstitutorTest.java:573)

testReplaceRecursive(org.apache.commons.lang3.text.StrSubstitutorTest)  Time elapsed: 0.001 sec  <<< ERROR!
java.lang.IllegalArgumentException: Variable prefix matcher must not be null!
	at org.apache.commons.lang3.text.StrSubstitutor.setVariablePrefixMatcher(StrSubstitutor.java:196)
	at org.apache.commons.lang3.text.StrSubstitutor.<init>(StrSubstitutor.java:54)
	at org.apache.commons.lang3.text.StrSubstitutor.<init>(StrSubstitutor.java:52)
	at org.apache.commons.lang3.text.StrSubstitutor.<init>(StrSubstitutor.java:37)
	at org.apache.commons.lang3.text.StrSubstitutorTest.doTestReplace(StrSubstitutorTest.java:631)
	at org.apache.commons.lang3.text.StrSubstitutorTest.testReplaceRecursive(StrSubstitutorTest.java:152)

testConstructorMapPrefixSuffix(org.apache.commons.lang3.text.StrSubstitutorTest)  Time elapsed: 0.001 sec  <<< ERROR!
java.lang.IllegalArgumentException: Variable prefix matcher must not be null!
	at org.apache.commons.lang3.text.StrSubstitutor.setVariablePrefixMatcher(StrSubstitutor.java:196)
	at org.apache.commons.lang3.text.StrSubstitutor.setVariablePrefix(StrSubstitutor.java:201)
	at org.apache.commons.lang3.text.StrSubstitutor.<init>(StrSubstitutor.java:43)
	at org.apache.commons.lang3.text.StrSubstitutor.<init>(StrSubstitutor.java:38)
	at org.apache.commons.lang3.text.StrSubstitutorTest.testConstructorMapPrefixSuffix(StrSubstitutorTest.java:440)

testSamePrefixAndSuffix(org.apache.commons.lang3.text.StrSubstitutorTest)  Time elapsed: 0 sec  <<< ERROR!
java.lang.IllegalArgumentException: Variable prefix matcher must not be null!
	at org.apache.commons.lang3.text.StrSubstitutor.setVariablePrefixMatcher(StrSubstitutor.java:196)
	at org.apache.commons.lang3.text.StrSubstitutor.setVariablePrefix(StrSubstitutor.java:201)
	at org.apache.commons.lang3.text.StrSubstitutor.<init>(StrSubstitutor.java:43)
	at org.apache.commons.lang3.text.StrSubstitutor.<init>(StrSubstitutor.java:38)
	at org.apache.commons.lang3.text.StrSubstitutor.replace(StrSubstitutor.java:27)
	at org.apache.commons.lang3.text.StrSubstitutorTest.testSamePrefixAndSuffix(StrSubstitutorTest.java:624)

testStaticReplace(org.apache.commons.lang3.text.StrSubstitutorTest)  Time elapsed: 0 sec  <<< ERROR!
java.lang.IllegalArgumentException: Variable prefix matcher must not be null!
	at org.apache.commons.lang3.text.StrSubstitutor.setVariablePrefixMatcher(StrSubstitutor.java:196)
	at org.apache.commons.lang3.text.StrSubstitutor.<init>(StrSubstitutor.java:54)
	at org.apache.commons.lang3.text.StrSubstitutor.<init>(StrSubstitutor.java:52)
	at org.apache.commons.lang3.text.StrSubstitutor.<init>(StrSubstitutor.java:37)
	at org.apache.commons.lang3.text.StrSubstitutor.replace(StrSubstitutor.java:26)
	at org.apache.commons.lang3.text.StrSubstitutorTest.testStaticReplace(StrSubstitutorTest.java:563)

testReplaceUnknownKey(org.apache.commons.lang3.text.StrSubstitutorTest)  Time elapsed: 0 sec  <<< ERROR!
java.lang.IllegalArgumentException: Variable prefix matcher must not be null!
	at org.apache.commons.lang3.text.StrSubstitutor.setVariablePrefixMatcher(StrSubstitutor.java:196)
	at org.apache.commons.lang3.text.StrSubstitutor.<init>(StrSubstitutor.java:54)
	at org.apache.commons.lang3.text.StrSubstitutor.<init>(StrSubstitutor.java:52)
	at org.apache.commons.lang3.text.StrSubstitutor.<init>(StrSubstitutor.java:37)
	at org.apache.commons.lang3.text.StrSubstitutorTest.doTestReplace(StrSubstitutorTest.java:631)
	at org.apache.commons.lang3.text.StrSubstitutorTest.testReplaceUnknownKey(StrSubstitutorTest.java:113)

testReplaceNoPrefixNoSuffix(org.apache.commons.lang3.text.StrSubstitutorTest)  Time elapsed: 0 sec  <<< ERROR!
java.lang.IllegalArgumentException: Variable prefix matcher must not be null!
	at org.apache.commons.lang3.text.StrSubstitutor.setVariablePrefixMatcher(StrSubstitutor.java:196)
	at org.apache.commons.lang3.text.StrSubstitutor.<init>(StrSubstitutor.java:54)
	at org.apache.commons.lang3.text.StrSubstitutor.<init>(StrSubstitutor.java:52)
	at org.apache.commons.lang3.text.StrSubstitutor.<init>(StrSubstitutor.java:37)
	at org.apache.commons.lang3.text.StrSubstitutorTest.doTestReplace(StrSubstitutorTest.java:631)
	at org.apache.commons.lang3.text.StrSubstitutorTest.testReplaceNoPrefixNoSuffix(StrSubstitutorTest.java:188)

testStaticReplaceSystemProperties(org.apache.commons.lang3.text.StrSubstitutorTest)  Time elapsed: 0.001 sec  <<< ERROR!
java.lang.IllegalArgumentException: Variable prefix matcher must not be null!
	at org.apache.commons.lang3.text.StrSubstitutor.setVariablePrefixMatcher(StrSubstitutor.java:196)
	at org.apache.commons.lang3.text.StrSubstitutor.<init>(StrSubstitutor.java:54)
	at org.apache.commons.lang3.text.StrSubstitutor.<init>(StrSubstitutor.java:52)
	at org.apache.commons.lang3.text.StrSubstitutor.<init>(StrSubstitutor.java:41)
	at org.apache.commons.lang3.text.StrSubstitutor.replaceSystemProperties(StrSubstitutor.java:35)
	at org.apache.commons.lang3.text.StrSubstitutorTest.testStaticReplaceSystemProperties(StrSubstitutorTest.java:587)

testReplaceInVariableRecursive(org.apache.commons.lang3.text.StrSubstitutorTest)  Time elapsed: 0.001 sec  <<< ERROR!
java.lang.IllegalArgumentException: Variable prefix matcher must not be null!
	at org.apache.commons.lang3.text.StrSubstitutor.setVariablePrefixMatcher(StrSubstitutor.java:196)
	at org.apache.commons.lang3.text.StrSubstitutor.<init>(StrSubstitutor.java:54)
	at org.apache.commons.lang3.text.StrSubstitutor.<init>(StrSubstitutor.java:52)
	at org.apache.commons.lang3.text.StrSubstitutor.<init>(StrSubstitutor.java:37)
	at org.apache.commons.lang3.text.StrSubstitutorTest.testReplaceInVariableRecursive(StrSubstitutorTest.java:355)

testConstructorNoArgs(org.apache.commons.lang3.text.StrSubstitutorTest)  Time elapsed: 0 sec  <<< ERROR!
java.lang.IllegalArgumentException: Variable prefix matcher must not be null!
	at org.apache.commons.lang3.text.StrSubstitutor.setVariablePrefixMatcher(StrSubstitutor.java:196)
	at org.apache.commons.lang3.text.StrSubstitutor.<init>(StrSubstitutor.java:54)
	at org.apache.commons.lang3.text.StrSubstitutor.<init>(StrSubstitutor.java:52)
	at org.apache.commons.lang3.text.StrSubstitutor.<init>(StrSubstitutor.java:36)
	at org.apache.commons.lang3.text.StrSubstitutorTest.testConstructorNoArgs(StrSubstitutorTest.java:429)

testReplaceAdjacentAtEnd(org.apache.commons.lang3.text.StrSubstitutorTest)  Time elapsed: 0 sec  <<< ERROR!
java.lang.IllegalArgumentException: Variable prefix matcher must not be null!
	at org.apache.commons.lang3.text.StrSubstitutor.setVariablePrefixMatcher(StrSubstitutor.java:196)
	at org.apache.commons.lang3.text.StrSubstitutor.<init>(StrSubstitutor.java:54)
	at org.apache.commons.lang3.text.StrSubstitutor.<init>(StrSubstitutor.java:52)
	at org.apache.commons.lang3.text.StrSubstitutor.<init>(StrSubstitutor.java:37)
	at org.apache.commons.lang3.text.StrSubstitutorTest.testReplaceAdjacentAtEnd(StrSubstitutorTest.java:135)

testReplaceNull(org.apache.commons.lang3.text.StrSubstitutorTest)  Time elapsed: 0 sec  <<< ERROR!
java.lang.IllegalArgumentException: Variable prefix matcher must not be null!
	at org.apache.commons.lang3.text.StrSubstitutor.setVariablePrefixMatcher(StrSubstitutor.java:196)
	at org.apache.commons.lang3.text.StrSubstitutor.<init>(StrSubstitutor.java:54)
	at org.apache.commons.lang3.text.StrSubstitutor.<init>(StrSubstitutor.java:52)
	at org.apache.commons.lang3.text.StrSubstitutor.<init>(StrSubstitutor.java:37)
	at org.apache.commons.lang3.text.StrSubstitutorTest.doTestNoReplace(StrSubstitutorTest.java:703)
	at org.apache.commons.lang3.text.StrSubstitutorTest.testReplaceNull(StrSubstitutorTest.java:87)

testReplaceSolo(org.apache.commons.lang3.text.StrSubstitutorTest)  Time elapsed: 0 sec  <<< ERROR!
java.lang.IllegalArgumentException: Variable prefix matcher must not be null!
	at org.apache.commons.lang3.text.StrSubstitutor.setVariablePrefixMatcher(StrSubstitutor.java:196)
	at org.apache.commons.lang3.text.StrSubstitutor.<init>(StrSubstitutor.java:54)
	at org.apache.commons.lang3.text.StrSubstitutor.<init>(StrSubstitutor.java:52)
	at org.apache.commons.lang3.text.StrSubstitutor.<init>(StrSubstitutor.java:37)
	at org.apache.commons.lang3.text.StrSubstitutorTest.doTestReplace(StrSubstitutorTest.java:631)
	at org.apache.commons.lang3.text.StrSubstitutorTest.testReplaceSolo(StrSubstitutorTest.java:71)

testLANG1055(org.apache.commons.lang3.text.StrSubstitutorTest)  Time elapsed: 0 sec  <<< ERROR!
java.lang.IllegalArgumentException: Variable prefix matcher must not be null!
	at org.apache.commons.lang3.text.StrSubstitutor.setVariablePrefixMatcher(StrSubstitutor.java:196)
	at org.apache.commons.lang3.text.StrSubstitutor.<init>(StrSubstitutor.java:54)
	at org.apache.commons.lang3.text.StrSubstitutor.<init>(StrSubstitutor.java:52)
	at org.apache.commons.lang3.text.StrSubstitutor.<init>(StrSubstitutor.java:37)
	at org.apache.commons.lang3.text.StrSubstitutor.replace(StrSubstitutor.java:26)
	at org.apache.commons.lang3.text.StrSubstitutor.replace(StrSubstitutor.java:34)
	at org.apache.commons.lang3.text.StrSubstitutorTest.testLANG1055(StrSubstitutorTest.java:599)

testReplaceChangedMap(org.apache.commons.lang3.text.StrSubstitutorTest)  Time elapsed: 0 sec  <<< ERROR!
java.lang.IllegalArgumentException: Variable prefix matcher must not be null!
	at org.apache.commons.lang3.text.StrSubstitutor.setVariablePrefixMatcher(StrSubstitutor.java:196)
	at org.apache.commons.lang3.text.StrSubstitutor.<init>(StrSubstitutor.java:54)
	at org.apache.commons.lang3.text.StrSubstitutor.<init>(StrSubstitutor.java:52)
	at org.apache.commons.lang3.text.StrSubstitutor.<init>(StrSubstitutor.java:37)
	at org.apache.commons.lang3.text.StrSubstitutorTest.testReplaceChangedMap(StrSubstitutorTest.java:103)

testReplaceWeirdPattens(org.apache.commons.lang3.text.StrSubstitutorTest)  Time elapsed: 0 sec  <<< ERROR!
java.lang.IllegalArgumentException: Variable prefix matcher must not be null!
	at org.apache.commons.lang3.text.StrSubstitutor.setVariablePrefixMatcher(StrSubstitutor.java:196)
	at org.apache.commons.lang3.text.StrSubstitutor.<init>(StrSubstitutor.java:54)
	at org.apache.commons.lang3.text.StrSubstitutor.<init>(StrSubstitutor.java:52)
	at org.apache.commons.lang3.text.StrSubstitutor.<init>(StrSubstitutor.java:37)
	at org.apache.commons.lang3.text.StrSubstitutorTest.doTestNoReplace(StrSubstitutorTest.java:703)
	at org.apache.commons.lang3.text.StrSubstitutorTest.testReplaceWeirdPattens(StrSubstitutorTest.java:273)

testReplaceEmptyKeys(org.apache.commons.lang3.text.StrSubstitutorTest)  Time elapsed: 0 sec  <<< ERROR!
java.lang.IllegalArgumentException: Variable prefix matcher must not be null!
	at org.apache.commons.lang3.text.StrSubstitutor.setVariablePrefixMatcher(StrSubstitutor.java:196)
	at org.apache.commons.lang3.text.StrSubstitutor.<init>(StrSubstitutor.java:54)
	at org.apache.commons.lang3.text.StrSubstitutor.<init>(StrSubstitutor.java:52)
	at org.apache.commons.lang3.text.StrSubstitutor.<init>(StrSubstitutor.java:37)
	at org.apache.commons.lang3.text.StrSubstitutorTest.doTestReplace(StrSubstitutorTest.java:631)
	at org.apache.commons.lang3.text.StrSubstitutorTest.testReplaceEmptyKeys(StrSubstitutorTest.java:220)

testDefaultValueDelimiters(org.apache.commons.lang3.text.StrSubstitutorTest)  Time elapsed: 0.001 sec  <<< ERROR!
java.lang.IllegalArgumentException: Variable prefix matcher must not be null!
	at org.apache.commons.lang3.text.StrSubstitutor.setVariablePrefixMatcher(StrSubstitutor.java:196)
	at org.apache.commons.lang3.text.StrSubstitutor.setVariablePrefix(StrSubstitutor.java:201)
	at org.apache.commons.lang3.text.StrSubstitutor.<init>(StrSubstitutor.java:43)
	at org.apache.commons.lang3.text.StrSubstitutor.<init>(StrSubstitutor.java:39)
	at org.apache.commons.lang3.text.StrSubstitutorTest.testDefaultValueDelimiters(StrSubstitutorTest.java:373)

testReplaceNoVariables(org.apache.commons.lang3.text.StrSubstitutorTest)  Time elapsed: 0.001 sec  <<< ERROR!
java.lang.IllegalArgumentException: Variable prefix matcher must not be null!
	at org.apache.commons.lang3.text.StrSubstitutor.setVariablePrefixMatcher(StrSubstitutor.java:196)
	at org.apache.commons.lang3.text.StrSubstitutor.<init>(StrSubstitutor.java:54)
	at org.apache.commons.lang3.text.StrSubstitutor.<init>(StrSubstitutor.java:52)
	at org.apache.commons.lang3.text.StrSubstitutor.<init>(StrSubstitutor.java:37)
	at org.apache.commons.lang3.text.StrSubstitutorTest.doTestNoReplace(StrSubstitutorTest.java:703)
	at org.apache.commons.lang3.text.StrSubstitutorTest.testReplaceNoVariables(StrSubstitutorTest.java:79)

testReplaceComplexEscaping(org.apache.commons.lang3.text.StrSubstitutorTest)  Time elapsed: 0.001 sec  <<< ERROR!
java.lang.IllegalArgumentException: Variable prefix matcher must not be null!
	at org.apache.commons.lang3.text.StrSubstitutor.setVariablePrefixMatcher(StrSubstitutor.java:196)
	at org.apache.commons.lang3.text.StrSubstitutor.<init>(StrSubstitutor.java:54)
	at org.apache.commons.lang3.text.StrSubstitutor.<init>(StrSubstitutor.java:52)
	at org.apache.commons.lang3.text.StrSubstitutor.<init>(StrSubstitutor.java:37)
	at org.apache.commons.lang3.text.StrSubstitutorTest.doTestReplace(StrSubstitutorTest.java:631)
	at org.apache.commons.lang3.text.StrSubstitutorTest.testReplaceComplexEscaping(StrSubstitutorTest.java:179)

testReplaceInVariable(org.apache.commons.lang3.text.StrSubstitutorTest)  Time elapsed: 0 sec  <<< ERROR!
java.lang.IllegalArgumentException: Variable prefix matcher must not be null!
	at org.apache.commons.lang3.text.StrSubstitutor.setVariablePrefixMatcher(StrSubstitutor.java:196)
	at org.apache.commons.lang3.text.StrSubstitutor.<init>(StrSubstitutor.java:54)
	at org.apache.commons.lang3.text.StrSubstitutor.<init>(StrSubstitutor.java:52)
	at org.apache.commons.lang3.text.StrSubstitutor.<init>(StrSubstitutor.java:37)
	at org.apache.commons.lang3.text.StrSubstitutorTest.testReplaceInVariable(StrSubstitutorTest.java:309)

testReplacePrefixNoSuffix(org.apache.commons.lang3.text.StrSubstitutorTest)  Time elapsed: 0 sec  <<< ERROR!
java.lang.IllegalArgumentException: Variable prefix matcher must not be null!
	at org.apache.commons.lang3.text.StrSubstitutor.setVariablePrefixMatcher(StrSubstitutor.java:196)
	at org.apache.commons.lang3.text.StrSubstitutor.<init>(StrSubstitutor.java:54)
	at org.apache.commons.lang3.text.StrSubstitutor.<init>(StrSubstitutor.java:52)
	at org.apache.commons.lang3.text.StrSubstitutor.<init>(StrSubstitutor.java:37)
	at org.apache.commons.lang3.text.StrSubstitutorTest.doTestReplace(StrSubstitutorTest.java:631)
	at org.apache.commons.lang3.text.StrSubstitutorTest.testReplacePrefixNoSuffix(StrSubstitutorTest.java:204)

testResolveVariable(org.apache.commons.lang3.text.StrSubstitutorTest)  Time elapsed: 0.001 sec  <<< ERROR!
java.lang.IllegalArgumentException: Variable prefix matcher must not be null!
	at org.apache.commons.lang3.text.StrSubstitutor.setVariablePrefixMatcher(StrSubstitutor.java:196)
	at org.apache.commons.lang3.text.StrSubstitutor.<init>(StrSubstitutor.java:54)
	at org.apache.commons.lang3.text.StrSubstitutor.<init>(StrSubstitutor.java:52)
	at org.apache.commons.lang3.text.StrSubstitutor.<init>(StrSubstitutor.java:37)
	at org.apache.commons.lang3.text.StrSubstitutorTest$1.<init>(StrSubstitutorTest.java:409)
	at org.apache.commons.lang3.text.StrSubstitutorTest.testResolveVariable(StrSubstitutorTest.java:409)

testGetSetValueDelimiter(org.apache.commons.lang3.text.StrSubstitutorTest)  Time elapsed: 0.001 sec  <<< ERROR!
java.lang.IllegalArgumentException: Variable prefix matcher must not be null!
	at org.apache.commons.lang3.text.StrSubstitutor.setVariablePrefixMatcher(StrSubstitutor.java:196)
	at org.apache.commons.lang3.text.StrSubstitutor.<init>(StrSubstitutor.java:54)
	at org.apache.commons.lang3.text.StrSubstitutor.<init>(StrSubstitutor.java:52)
	at org.apache.commons.lang3.text.StrSubstitutor.<init>(StrSubstitutor.java:36)
	at org.apache.commons.lang3.text.StrSubstitutorTest.testGetSetValueDelimiter(StrSubstitutorTest.java:538)

testReplaceInVariableDisabled(org.apache.commons.lang3.text.StrSubstitutorTest)  Time elapsed: 0 sec  <<< ERROR!
java.lang.IllegalArgumentException: Variable prefix matcher must not be null!
	at org.apache.commons.lang3.text.StrSubstitutor.setVariablePrefixMatcher(StrSubstitutor.java:196)
	at org.apache.commons.lang3.text.StrSubstitutor.<init>(StrSubstitutor.java:54)
	at org.apache.commons.lang3.text.StrSubstitutor.<init>(StrSubstitutor.java:52)
	at org.apache.commons.lang3.text.StrSubstitutor.<init>(StrSubstitutor.java:37)
	at org.apache.commons.lang3.text.StrSubstitutorTest.testReplaceInVariableDisabled(StrSubstitutorTest.java:334)

testReplaceIncompletePrefix(org.apache.commons.lang3.text.StrSubstitutorTest)  Time elapsed: 0 sec  <<< ERROR!
java.lang.IllegalArgumentException: Variable prefix matcher must not be null!
	at org.apache.commons.lang3.text.StrSubstitutor.setVariablePrefixMatcher(StrSubstitutor.java:196)
	at org.apache.commons.lang3.text.StrSubstitutor.<init>(StrSubstitutor.java:54)
	at org.apache.commons.lang3.text.StrSubstitutor.<init>(StrSubstitutor.java:52)
	at org.apache.commons.lang3.text.StrSubstitutor.<init>(StrSubstitutor.java:37)
	at org.apache.commons.lang3.text.StrSubstitutorTest.doTestReplace(StrSubstitutorTest.java:631)
	at org.apache.commons.lang3.text.StrSubstitutorTest.testReplaceIncompletePrefix(StrSubstitutorTest.java:196)

testGetSetEscape(org.apache.commons.lang3.text.StrSubstitutorTest)  Time elapsed: 0 sec  <<< ERROR!
java.lang.IllegalArgumentException: Variable prefix matcher must not be null!
	at org.apache.commons.lang3.text.StrSubstitutor.setVariablePrefixMatcher(StrSubstitutor.java:196)
	at org.apache.commons.lang3.text.StrSubstitutor.<init>(StrSubstitutor.java:54)
	at org.apache.commons.lang3.text.StrSubstitutor.<init>(StrSubstitutor.java:52)
	at org.apache.commons.lang3.text.StrSubstitutor.<init>(StrSubstitutor.java:36)
	at org.apache.commons.lang3.text.StrSubstitutorTest.testGetSetEscape(StrSubstitutorTest.java:463)

testReplaceAdjacentAtStart(org.apache.commons.lang3.text.StrSubstitutorTest)  Time elapsed: 0.001 sec  <<< ERROR!
java.lang.IllegalArgumentException: Variable prefix matcher must not be null!
	at org.apache.commons.lang3.text.StrSubstitutor.setVariablePrefixMatcher(StrSubstitutor.java:196)
	at org.apache.commons.lang3.text.StrSubstitutor.<init>(StrSubstitutor.java:54)
	at org.apache.commons.lang3.text.StrSubstitutor.<init>(StrSubstitutor.java:52)
	at org.apache.commons.lang3.text.StrSubstitutor.<init>(StrSubstitutor.java:37)
	at org.apache.commons.lang3.text.StrSubstitutorTest.testReplaceAdjacentAtStart(StrSubstitutorTest.java:124)

testReplaceEmpty(org.apache.commons.lang3.text.StrSubstitutorTest)  Time elapsed: 0.001 sec  <<< ERROR!
java.lang.IllegalArgumentException: Variable prefix matcher must not be null!
	at org.apache.commons.lang3.text.StrSubstitutor.setVariablePrefixMatcher(StrSubstitutor.java:196)
	at org.apache.commons.lang3.text.StrSubstitutor.<init>(StrSubstitutor.java:54)
	at org.apache.commons.lang3.text.StrSubstitutor.<init>(StrSubstitutor.java:52)
	at org.apache.commons.lang3.text.StrSubstitutor.<init>(StrSubstitutor.java:37)
	at org.apache.commons.lang3.text.StrSubstitutorTest.doTestNoReplace(StrSubstitutorTest.java:703)
	at org.apache.commons.lang3.text.StrSubstitutorTest.testReplaceEmpty(StrSubstitutorTest.java:95)

testGetSetPrefix(org.apache.commons.lang3.text.StrSubstitutorTest)  Time elapsed: 0 sec  <<< ERROR!
java.lang.IllegalArgumentException: Variable prefix matcher must not be null!
	at org.apache.commons.lang3.text.StrSubstitutor.setVariablePrefixMatcher(StrSubstitutor.java:196)
	at org.apache.commons.lang3.text.StrSubstitutor.<init>(StrSubstitutor.java:54)
	at org.apache.commons.lang3.text.StrSubstitutor.<init>(StrSubstitutor.java:52)
	at org.apache.commons.lang3.text.StrSubstitutor.<init>(StrSubstitutor.java:36)
	at org.apache.commons.lang3.text.StrSubstitutorTest.testGetSetPrefix(StrSubstitutorTest.java:474)

testConstructorMapFull(org.apache.commons.lang3.text.StrSubstitutorTest)  Time elapsed: 0 sec  <<< ERROR!
java.lang.IllegalArgumentException: Variable prefix matcher must not be null!
	at org.apache.commons.lang3.text.StrSubstitutor.setVariablePrefixMatcher(StrSubstitutor.java:196)
	at org.apache.commons.lang3.text.StrSubstitutor.setVariablePrefix(StrSubstitutor.java:201)
	at org.apache.commons.lang3.text.StrSubstitutor.<init>(StrSubstitutor.java:43)
	at org.apache.commons.lang3.text.StrSubstitutor.<init>(StrSubstitutor.java:39)
	at org.apache.commons.lang3.text.StrSubstitutorTest.testConstructorMapFull(StrSubstitutorTest.java:451)

testGetSetSuffix(org.apache.commons.lang3.text.StrSubstitutorTest)  Time elapsed: 0.001 sec  <<< ERROR!
java.lang.IllegalArgumentException: Variable prefix matcher must not be null!
	at org.apache.commons.lang3.text.StrSubstitutor.setVariablePrefixMatcher(StrSubstitutor.java:196)
	at org.apache.commons.lang3.text.StrSubstitutor.<init>(StrSubstitutor.java:54)
	at org.apache.commons.lang3.text.StrSubstitutor.<init>(StrSubstitutor.java:52)
	at org.apache.commons.lang3.text.StrSubstitutor.<init>(StrSubstitutor.java:36)
	at org.apache.commons.lang3.text.StrSubstitutorTest.testGetSetSuffix(StrSubstitutorTest.java:506)

testReplacePartialString_noReplace(org.apache.commons.lang3.text.StrSubstitutorTest)  Time elapsed: 0.001 sec  <<< ERROR!
java.lang.IllegalArgumentException: Variable prefix matcher must not be null!
	at org.apache.commons.lang3.text.StrSubstitutor.setVariablePrefixMatcher(StrSubstitutor.java:196)
	at org.apache.commons.lang3.text.StrSubstitutor.<init>(StrSubstitutor.java:54)
	at org.apache.commons.lang3.text.StrSubstitutor.<init>(StrSubstitutor.java:52)
	at org.apache.commons.lang3.text.StrSubstitutor.<init>(StrSubstitutor.java:36)
	at org.apache.commons.lang3.text.StrSubstitutorTest.testReplacePartialString_noReplace(StrSubstitutorTest.java:297)

Running org.apache.commons.lang3.text.StrBuilderTest
Tests run: 90, Failures: 0, Errors: 0, Skipped: 0, Time elapsed: 0.059 sec - in org.apache.commons.lang3.text.StrBuilderTest
Running org.apache.commons.lang3.StringEscapeUtilsTest
Tests run: 28, Failures: 0, Errors: 0, Skipped: 0, Time elapsed: 0.325 sec - in org.apache.commons.lang3.StringEscapeUtilsTest
Running org.apache.commons.lang3.AnnotationUtilsTest
Tests run: 10, Failures: 0, Errors: 0, Skipped: 0, Time elapsed: 0.015 sec - in org.apache.commons.lang3.AnnotationUtilsTest
Running org.apache.commons.lang3.ConversionTest
Tests run: 42, Failures: 0, Errors: 0, Skipped: 0, Time elapsed: 0.01 sec - in org.apache.commons.lang3.ConversionTest
Running org.apache.commons.lang3.StringUtilsTrimEmptyTest
Tests run: 15, Failures: 0, Errors: 0, Skipped: 0, Time elapsed: 0.005 sec - in org.apache.commons.lang3.StringUtilsTrimEmptyTest
Running org.apache.commons.lang3.EnumUtilsTest
Tests run: 34, Failures: 0, Errors: 0, Skipped: 0, Time elapsed: 0.009 sec - in org.apache.commons.lang3.EnumUtilsTest
Running org.apache.commons.lang3.exception.ExceptionUtilsTest
Tests run: 28, Failures: 0, Errors: 0, Skipped: 0, Time elapsed: 0.027 sec - in org.apache.commons.lang3.exception.ExceptionUtilsTest
Running org.apache.commons.lang3.exception.DefaultExceptionContextTest
Tests run: 8, Failures: 0, Errors: 0, Skipped: 0, Time elapsed: 0.005 sec - in org.apache.commons.lang3.exception.DefaultExceptionContextTest
Running org.apache.commons.lang3.exception.ContextedExceptionTest
Tests run: 14, Failures: 0, Errors: 0, Skipped: 0, Time elapsed: 0.011 sec - in org.apache.commons.lang3.exception.ContextedExceptionTest
Running org.apache.commons.lang3.exception.ContextedRuntimeExceptionTest
Tests run: 14, Failures: 0, Errors: 0, Skipped: 0, Time elapsed: 0.011 sec - in org.apache.commons.lang3.exception.ContextedRuntimeExceptionTest
Running org.apache.commons.lang3.BitFieldTest
Tests run: 15, Failures: 0, Errors: 0, Skipped: 0, Time elapsed: 0.002 sec - in org.apache.commons.lang3.BitFieldTest
Running org.apache.commons.lang3.ArrayUtilsRemoveMultipleTest
Tests run: 55, Failures: 0, Errors: 0, Skipped: 0, Time elapsed: 0.017 sec - in org.apache.commons.lang3.ArrayUtilsRemoveMultipleTest
Running org.apache.commons.lang3.HashSetvBitSetTest
Ratio=9% array=100 count=1 extract=22984559 bitset=2099941
Ratio=9% array=100 count=10 extract=21318620 bitset=1934468
Ratio=18% array=100 count=50 extract=9335061 bitset=1716540
Ratio=4% array=100 count=100 extract=10572329 bitset=460115
Ratio=78% array=1000 count=10 extract=6936310 bitset=5473204
Ratio=32% array=1000 count=100 extract=16307719 bitset=5302323
Ratio=7% array=1000 count=500 extract=45588359 bitset=3358343
Ratio=1% array=1000 count=1000 extract=75170456 bitset=779279
Ratio=4% count=0 hash=5016534 bits=201584
Ratio=10% count=5 hash=2386014 bits=245391
Ratio=32% count=10 hash=1012703 bits=330737
Ratio=23% count=200 hash=19456556 bits=4580227
Ratio=19% count=50 hash=6725572 bits=1336565
Ratio=20% count=100 hash=16460066 bits=3403563
Ratio=20% count=1000 hash=85162662 bits=17051218
Ratio=21% count=2000 hash=156040556 bits=33739434
Tests run: 2, Failures: 0, Errors: 0, Skipped: 0, Time elapsed: 0.702 sec - in org.apache.commons.lang3.HashSetvBitSetTest
Running org.apache.commons.lang3.StringUtilsTest
Tests run: 124, Failures: 0, Errors: 0, Skipped: 0, Time elapsed: 0.187 sec - in org.apache.commons.lang3.StringUtilsTest
Running org.apache.commons.lang3.ArrayUtilsRemoveTest
Tests run: 19, Failures: 0, Errors: 0, Skipped: 0, Time elapsed: 0.002 sec - in org.apache.commons.lang3.ArrayUtilsRemoveTest
Running org.apache.commons.lang3.ObjectUtilsTest
Tests run: 36, Failures: 0, Errors: 0, Skipped: 0, Time elapsed: 0.021 sec - in org.apache.commons.lang3.ObjectUtilsTest
Running org.apache.commons.lang3.ClassPathUtilsTest
Tests run: 13, Failures: 0, Errors: 0, Skipped: 0, Time elapsed: 0.015 sec - in org.apache.commons.lang3.ClassPathUtilsTest
Running org.apache.commons.lang3.math.NumberUtilsTest
Tests run: 91, Failures: 0, Errors: 0, Skipped: 0, Time elapsed: 0.045 sec - in org.apache.commons.lang3.math.NumberUtilsTest
Running org.apache.commons.lang3.math.IEEE754rUtilsTest
Tests run: 3, Failures: 0, Errors: 0, Skipped: 0, Time elapsed: 0.003 sec - in org.apache.commons.lang3.math.IEEE754rUtilsTest
Running org.apache.commons.lang3.math.FractionTest
Tests run: 25, Failures: 0, Errors: 0, Skipped: 0, Time elapsed: 0.148 sec - in org.apache.commons.lang3.math.FractionTest
Running org.apache.commons.lang3.BooleanUtilsTest
Tests run: 72, Failures: 0, Errors: 0, Skipped: 0, Time elapsed: 0.02 sec - in org.apache.commons.lang3.BooleanUtilsTest
Running org.apache.commons.lang3.CharSequenceUtilsTest
Tests run: 2, Failures: 0, Errors: 0, Skipped: 0, Time elapsed: 0 sec - in org.apache.commons.lang3.CharSequenceUtilsTest
Running org.apache.commons.lang3.CharSetUtilsTest
Tests run: 11, Failures: 0, Errors: 0, Skipped: 0, Time elapsed: 0.004 sec - in org.apache.commons.lang3.CharSetUtilsTest
Running org.apache.commons.lang3.ArrayUtilsAddTest
Tests run: 13, Failures: 0, Errors: 0, Skipped: 0, Time elapsed: 0.007 sec - in org.apache.commons.lang3.ArrayUtilsAddTest
Running org.apache.commons.lang3.CharEncodingTest
Tests run: 6, Failures: 0, Errors: 0, Skipped: 0, Time elapsed: 0.054 sec - in org.apache.commons.lang3.CharEncodingTest
Running org.apache.commons.lang3.ClassUtilsTest
Tests run: 57, Failures: 0, Errors: 0, Skipped: 0, Time elapsed: 0.036 sec - in org.apache.commons.lang3.ClassUtilsTest
Running org.apache.commons.lang3.RangeTest
Tests run: 24, Failures: 0, Errors: 0, Skipped: 0, Time elapsed: 0.015 sec - in org.apache.commons.lang3.RangeTest
Running org.apache.commons.lang3.event.EventUtilsTest
Tests run: 8, Failures: 0, Errors: 0, Skipped: 0, Time elapsed: 0.001 sec - in org.apache.commons.lang3.event.EventUtilsTest
Running org.apache.commons.lang3.event.EventListenerSupportTest
Tests run: 9, Failures: 0, Errors: 0, Skipped: 0, Time elapsed: 0.017 sec - in org.apache.commons.lang3.event.EventListenerSupportTest
Running org.apache.commons.lang3.ArrayUtilsTest
Tests run: 205, Failures: 0, Errors: 0, Skipped: 0, Time elapsed: 0.087 sec - in org.apache.commons.lang3.ArrayUtilsTest
Running org.apache.commons.lang3.CharUtilsTest
Tests run: 24, Failures: 0, Errors: 0, Skipped: 0, Time elapsed: 0.008 sec - in org.apache.commons.lang3.CharUtilsTest
Running org.apache.commons.lang3.NotImplementedExceptionTest
Tests run: 1, Failures: 0, Errors: 0, Skipped: 0, Time elapsed: 0 sec - in org.apache.commons.lang3.NotImplementedExceptionTest
Running org.apache.commons.lang3.StringUtilsEqualsIndexOfTest
Tests run: 50, Failures: 0, Errors: 0, Skipped: 0, Time elapsed: 0.016 sec - in org.apache.commons.lang3.StringUtilsEqualsIndexOfTest
Running org.apache.commons.lang3.RandomUtilsTest
Tests run: 23, Failures: 0, Errors: 0, Skipped: 0, Time elapsed: 0.006 sec - in org.apache.commons.lang3.RandomUtilsTest

Results :


Tests in error: 
  StrSubstitutorTest.testConstructorMapFull:451 » IllegalArgument Variable prefi...
  StrSubstitutorTest.testConstructorMapPrefixSuffix:440 » IllegalArgument Variab...
  StrSubstitutorTest.testConstructorNoArgs:429 » IllegalArgument Variable prefix...
  StrSubstitutorTest.testCyclicReplacement:249 » IllegalArgument Variable prefix...
  StrSubstitutorTest.testDefaultValueDelimiters:373 » IllegalArgument Variable p...
  StrSubstitutorTest.testGetSetEscape:463 » IllegalArgument Variable prefix matc...
  StrSubstitutorTest.testGetSetPrefix:474 » IllegalArgument Variable prefix matc...
  StrSubstitutorTest.testGetSetSuffix:506 » IllegalArgument Variable prefix matc...
  StrSubstitutorTest.testGetSetValueDelimiter:538 » IllegalArgument Variable pre...
  StrSubstitutorTest.testLANG1055:599 » IllegalArgument Variable prefix matcher ...
  StrSubstitutorTest.testReplaceAdjacentAtEnd:135 » IllegalArgument Variable pre...
  StrSubstitutorTest.testReplaceAdjacentAtStart:124 » IllegalArgument Variable p...
  StrSubstitutorTest.testReplaceChangedMap:103 » IllegalArgument Variable prefix...
  StrSubstitutorTest.testReplaceComplexEscaping:179->doTestReplace:631 » IllegalArgument
  StrSubstitutorTest.testReplaceEmpty:95->doTestNoReplace:703 » IllegalArgument ...
  StrSubstitutorTest.testReplaceEmptyKeys:220->doTestReplace:631 » IllegalArgument
  StrSubstitutorTest.testReplaceEscaping:163->doTestReplace:631 » IllegalArgument
  StrSubstitutorTest.testReplaceInVariable:309 » IllegalArgument Variable prefix...
  StrSubstitutorTest.testReplaceInVariableDisabled:334 » IllegalArgument Variabl...
  StrSubstitutorTest.testReplaceInVariableRecursive:355 » IllegalArgument Variab...
  StrSubstitutorTest.testReplaceIncompletePrefix:196->doTestReplace:631 » IllegalArgument
  StrSubstitutorTest.testReplaceNoPrefixNoSuffix:188->doTestReplace:631 » IllegalArgument
  StrSubstitutorTest.testReplaceNoPrefixSuffix:212->doTestReplace:631 » IllegalArgument
  StrSubstitutorTest.testReplaceNoVariables:79->doTestNoReplace:703 » IllegalArgument
  StrSubstitutorTest.testReplaceNull:87->doTestNoReplace:703 » IllegalArgument V...
  StrSubstitutorTest.testReplacePartialString_noReplace:297 » IllegalArgument Va...
  StrSubstitutorTest.testReplacePrefixNoSuffix:204->doTestReplace:631 » IllegalArgument
  StrSubstitutorTest.testReplaceRecursive:152->doTestReplace:631 » IllegalArgument
  StrSubstitutorTest.testReplaceSimple:63->doTestReplace:631 » IllegalArgument V...
  StrSubstitutorTest.testReplaceSolo:71->doTestReplace:631 » IllegalArgument Var...
  StrSubstitutorTest.testReplaceSoloEscaping:171->doTestReplace:631 » IllegalArgument
  StrSubstitutorTest.testReplaceToIdentical:231->doTestReplace:631 » IllegalArgument
  StrSubstitutorTest.testReplaceUnknownKey:113->doTestReplace:631 » IllegalArgument
  StrSubstitutorTest.testReplaceWeirdPattens:273->doTestNoReplace:703 » IllegalArgument
  StrSubstitutorTest.testResolveVariable:409 » IllegalArgument Variable prefix m...
  StrSubstitutorTest.testSamePrefixAndSuffix:624 » IllegalArgument Variable pref...
  StrSubstitutorTest.testStaticReplace:563 » IllegalArgument Variable prefix mat...
  StrSubstitutorTest.testStaticReplacePrefixSuffix:573 » IllegalArgument Variabl...
  StrSubstitutorTest.testStaticReplaceSystemProperties:587 » IllegalArgument Var...
  StrSubstitutorTest.testSubstituteDefaultProperties:615 » IllegalArgument Varia...


Tests run: 3526, Failures: 0, Errors: 40, Skipped: 97

[INFO] ------------------------------------------------------------------------
[INFO] BUILD FAILURE
[INFO] ------------------------------------------------------------------------
[INFO] Total time: 38.596s
[INFO] Finished at: Wed Aug 05 02:46:43 BST 2015
[INFO] Final Memory: 24M/412M
[INFO] ------------------------------------------------------------------------
[ERROR] Failed to execute goal org.apache.maven.plugins:maven-surefire-plugin:2.18:test (default-test) on project commons-lang3: There are test failures.
[ERROR] 
[ERROR] Please refer to /home/perham/Study/LittleDarwin/Cases/commons-lang3-3.4-src/target/surefire-reports for the individual test results.
[ERROR] -> [Help 1]
[ERROR] 
[ERROR] To see the full stack trace of the errors, re-run Maven with the -e switch.
[ERROR] Re-run Maven using the -X switch to enable full debug logging.
[ERROR] 
[ERROR] For more information about the errors and possible solutions, please read the following articles:
[ERROR] [Help 1] http://cwiki.apache.org/confluence/display/MAVEN/MojoFailureException
