[INFO] Scanning for projects...
[INFO]                                                                         
[INFO] ------------------------------------------------------------------------
[INFO] Building Apache Commons Lang 3.4
[INFO] ------------------------------------------------------------------------
[INFO] 
[INFO] --- maven-enforcer-plugin:1.3.1:enforce (enforce-maven-3) @ commons-lang3 ---
[INFO] 
[INFO] --- build-helper-maven-plugin:1.8:parse-version (parse-version) @ commons-lang3 ---
[INFO] 
[INFO] --- maven-antrun-plugin:1.8:run (javadoc.resources) @ commons-lang3 ---
[INFO] Executing tasks

main:
[INFO] Executed tasks
[INFO] 
[INFO] --- maven-remote-resources-plugin:1.5:process (default) @ commons-lang3 ---
[INFO] 
[INFO] --- buildnumber-maven-plugin:1.3:create (default) @ commons-lang3 ---
[INFO] Executing: /bin/sh -c cd /home/perham/Study/LittleDarwin/Cases/commons-lang3-3.4-src && svn --non-interactive info
[INFO] Working directory: /home/perham/Study/LittleDarwin/Cases/commons-lang3-3.4-src
[INFO] Storing buildNumber: ?????? at timestamp: 1438737296628
[INFO] Executing: /bin/sh -c cd /home/perham/Study/LittleDarwin/Cases/commons-lang3-3.4-src && svn --non-interactive info
[INFO] Working directory: /home/perham/Study/LittleDarwin/Cases/commons-lang3-3.4-src
[INFO] Storing buildScmBranch: UNKNOWN_BRANCH
[INFO] 
[INFO] --- maven-resources-plugin:2.7:resources (default-resources) @ commons-lang3 ---
[INFO] Using 'ISO-8859-1' encoding to copy filtered resources.
[INFO] Copying 0 resource
[INFO] Copying 2 resources to META-INF
[INFO] 
[INFO] --- maven-compiler-plugin:3.2:compile (default-compile) @ commons-lang3 ---
[INFO] Changes detected - recompiling the module!
[INFO] Compiling 133 source files to /home/perham/Study/LittleDarwin/Cases/commons-lang3-3.4-src/target/classes
[INFO] /home/perham/Study/LittleDarwin/Cases/commons-lang3-3.4-src/src/main/java/org/apache/commons/lang3/SerializationUtils.java: /home/perham/Study/LittleDarwin/Cases/commons-lang3-3.4-src/src/main/java/org/apache/commons/lang3/SerializationUtils.java uses unchecked or unsafe operations.
[INFO] /home/perham/Study/LittleDarwin/Cases/commons-lang3-3.4-src/src/main/java/org/apache/commons/lang3/SerializationUtils.java: Recompile with -Xlint:unchecked for details.
[INFO] 
[INFO] --- maven-bundle-plugin:2.5.3:manifest (bundle-manifest) @ commons-lang3 ---
[INFO] 
[INFO] --- animal-sniffer-maven-plugin:1.13:check (checkAPIcompatibility) @ commons-lang3 ---
[INFO] Checking unresolved references to org.codehaus.mojo.signature:java16:1.0
[INFO] 
[INFO] --- maven-resources-plugin:2.7:testResources (default-testResources) @ commons-lang3 ---
[INFO] Using 'ISO-8859-1' encoding to copy filtered resources.
[INFO] Copying 2 resources
[INFO] Copying 2 resources to META-INF
[INFO] 
[INFO] --- maven-compiler-plugin:3.2:testCompile (default-testCompile) @ commons-lang3 ---
[INFO] Nothing to compile - all classes are up to date
[INFO] 
[INFO] --- maven-surefire-plugin:2.18:test (default-test) @ commons-lang3 ---
[INFO] Surefire report directory: /home/perham/Study/LittleDarwin/Cases/commons-lang3-3.4-src/target/surefire-reports

-------------------------------------------------------
 T E S T S
-------------------------------------------------------
Running org.apache.commons.lang3.ValidateTest
Tests run: 63, Failures: 0, Errors: 0, Skipped: 0, Time elapsed: 0.049 sec - in org.apache.commons.lang3.ValidateTest
Running org.apache.commons.lang3.LocaleUtilsTest
Tests run: 15, Failures: 0, Errors: 0, Skipped: 0, Time elapsed: 0.023 sec - in org.apache.commons.lang3.LocaleUtilsTest
Running org.apache.commons.lang3.tuple.MutableTripleTest
Tests run: 8, Failures: 0, Errors: 0, Skipped: 0, Time elapsed: 0.001 sec - in org.apache.commons.lang3.tuple.MutableTripleTest
Running org.apache.commons.lang3.tuple.TripleTest
Tests run: 10, Failures: 0, Errors: 0, Skipped: 0, Time elapsed: 0.001 sec - in org.apache.commons.lang3.tuple.TripleTest
Running org.apache.commons.lang3.tuple.ImmutablePairTest
Tests run: 6, Failures: 0, Errors: 0, Skipped: 0, Time elapsed: 0.001 sec - in org.apache.commons.lang3.tuple.ImmutablePairTest
Running org.apache.commons.lang3.tuple.MutablePairTest
Tests run: 8, Failures: 0, Errors: 0, Skipped: 0, Time elapsed: 0.001 sec - in org.apache.commons.lang3.tuple.MutablePairTest
Running org.apache.commons.lang3.tuple.ImmutableTripleTest
Tests run: 6, Failures: 0, Errors: 0, Skipped: 0, Time elapsed: 0.001 sec - in org.apache.commons.lang3.tuple.ImmutableTripleTest
Running org.apache.commons.lang3.tuple.PairTest
Tests run: 9, Failures: 0, Errors: 0, Skipped: 0, Time elapsed: 0.001 sec - in org.apache.commons.lang3.tuple.PairTest
Running org.apache.commons.lang3.StringUtilsIsTest
Tests run: 8, Failures: 0, Errors: 0, Skipped: 0, Time elapsed: 0 sec - in org.apache.commons.lang3.StringUtilsIsTest
Running org.apache.commons.lang3.JavaVersionTest
Tests run: 3, Failures: 0, Errors: 0, Skipped: 0, Time elapsed: 0.001 sec - in org.apache.commons.lang3.JavaVersionTest
Running org.apache.commons.lang3.builder.NoFieldNamesToStringStyleTest
Tests run: 8, Failures: 0, Errors: 0, Skipped: 0, Time elapsed: 0 sec - in org.apache.commons.lang3.builder.NoFieldNamesToStringStyleTest
Running org.apache.commons.lang3.builder.ShortPrefixToStringStyleTest
Tests run: 8, Failures: 0, Errors: 0, Skipped: 0, Time elapsed: 0 sec - in org.apache.commons.lang3.builder.ShortPrefixToStringStyleTest
Running org.apache.commons.lang3.builder.DiffResultTest
Tests run: 9, Failures: 0, Errors: 0, Skipped: 0, Time elapsed: 0.001 sec - in org.apache.commons.lang3.builder.DiffResultTest
Running org.apache.commons.lang3.builder.CompareToBuilderTest
Tests run: 48, Failures: 0, Errors: 0, Skipped: 0, Time elapsed: 0.023 sec - in org.apache.commons.lang3.builder.CompareToBuilderTest
Running org.apache.commons.lang3.builder.MultilineRecursiveToStringStyleTest
Tests run: 10, Failures: 0, Errors: 0, Skipped: 0, Time elapsed: 0.015 sec - in org.apache.commons.lang3.builder.MultilineRecursiveToStringStyleTest
Running org.apache.commons.lang3.builder.RecursiveToStringStyleTest
Tests run: 8, Failures: 0, Errors: 0, Skipped: 0, Time elapsed: 0.016 sec - in org.apache.commons.lang3.builder.RecursiveToStringStyleTest
Running org.apache.commons.lang3.builder.DefaultToStringStyleTest
Tests run: 8, Failures: 0, Errors: 0, Skipped: 0, Time elapsed: 0.004 sec - in org.apache.commons.lang3.builder.DefaultToStringStyleTest
Running org.apache.commons.lang3.builder.ReflectionToStringBuilderExcludeTest
Tests run: 11, Failures: 0, Errors: 0, Skipped: 0, Time elapsed: 0.004 sec - in org.apache.commons.lang3.builder.ReflectionToStringBuilderExcludeTest
Running org.apache.commons.lang3.builder.StandardToStringStyleTest
Tests run: 8, Failures: 0, Errors: 0, Skipped: 0, Time elapsed: 0.004 sec - in org.apache.commons.lang3.builder.StandardToStringStyleTest
Running org.apache.commons.lang3.builder.ToStringStyleTest
Tests run: 12, Failures: 0, Errors: 0, Skipped: 0, Time elapsed: 0 sec - in org.apache.commons.lang3.builder.ToStringStyleTest
Running org.apache.commons.lang3.builder.DiffTest
Tests run: 4, Failures: 0, Errors: 0, Skipped: 0, Time elapsed: 0 sec - in org.apache.commons.lang3.builder.DiffTest
Running org.apache.commons.lang3.builder.SimpleToStringStyleTest
Tests run: 8, Failures: 0, Errors: 0, Skipped: 0, Time elapsed: 0.004 sec - in org.apache.commons.lang3.builder.SimpleToStringStyleTest
Running org.apache.commons.lang3.builder.MultiLineToStringStyleTest
Tests run: 8, Failures: 0, Errors: 0, Skipped: 0, Time elapsed: 0.001 sec - in org.apache.commons.lang3.builder.MultiLineToStringStyleTest
Running org.apache.commons.lang3.builder.ToStringStyleConcurrencyTest
Tests run: 3, Failures: 0, Errors: 0, Skipped: 0, Time elapsed: 5.235 sec - in org.apache.commons.lang3.builder.ToStringStyleConcurrencyTest
Running org.apache.commons.lang3.builder.ReflectionToStringBuilderMutateInspectConcurrencyTest
Tests run: 1, Failures: 0, Errors: 0, Skipped: 1, Time elapsed: 0 sec - in org.apache.commons.lang3.builder.ReflectionToStringBuilderMutateInspectConcurrencyTest
Running org.apache.commons.lang3.builder.ToStringBuilderTest
Tests run: 74, Failures: 0, Errors: 0, Skipped: 1, Time elapsed: 0.06 sec - in org.apache.commons.lang3.builder.ToStringBuilderTest
Running org.apache.commons.lang3.builder.EqualsBuilderTest
Tests run: 48, Failures: 0, Errors: 0, Skipped: 0, Time elapsed: 0.036 sec - in org.apache.commons.lang3.builder.EqualsBuilderTest
Running org.apache.commons.lang3.builder.HashCodeBuilderAndEqualsBuilderTest
Tests run: 4, Failures: 0, Errors: 0, Skipped: 0, Time elapsed: 0.009 sec - in org.apache.commons.lang3.builder.HashCodeBuilderAndEqualsBuilderTest
Running org.apache.commons.lang3.builder.ReflectionToStringBuilderConcurrencyTest
Tests run: 3, Failures: 0, Errors: 0, Skipped: 3, Time elapsed: 0 sec - in org.apache.commons.lang3.builder.ReflectionToStringBuilderConcurrencyTest
Running org.apache.commons.lang3.builder.JsonToStringStyleTest
Tests run: 9, Failures: 0, Errors: 0, Skipped: 0, Time elapsed: 0.004 sec - in org.apache.commons.lang3.builder.JsonToStringStyleTest
Running org.apache.commons.lang3.builder.NoClassNameToStringStyleTest
Tests run: 8, Failures: 0, Errors: 0, Skipped: 0, Time elapsed: 0.003 sec - in org.apache.commons.lang3.builder.NoClassNameToStringStyleTest
Running org.apache.commons.lang3.builder.DiffBuilderTest
Tests run: 30, Failures: 0, Errors: 0, Skipped: 0, Time elapsed: 0.022 sec - in org.apache.commons.lang3.builder.DiffBuilderTest
Running org.apache.commons.lang3.builder.HashCodeBuilderTest
Tests run: 44, Failures: 0, Errors: 0, Skipped: 0, Time elapsed: 0.018 sec - in org.apache.commons.lang3.builder.HashCodeBuilderTest
Running org.apache.commons.lang3.concurrent.AtomicInitializerTest
Tests run: 3, Failures: 0, Errors: 0, Skipped: 0, Time elapsed: 0.006 sec - in org.apache.commons.lang3.concurrent.AtomicInitializerTest
Running org.apache.commons.lang3.concurrent.CallableBackgroundInitializerTest
Tests run: 4, Failures: 0, Errors: 0, Skipped: 0, Time elapsed: 0.002 sec - in org.apache.commons.lang3.concurrent.CallableBackgroundInitializerTest
Running org.apache.commons.lang3.concurrent.BackgroundInitializerTest
Tests run: 15, Failures: 0, Errors: 0, Skipped: 0, Time elapsed: 0.018 sec - in org.apache.commons.lang3.concurrent.BackgroundInitializerTest
Running org.apache.commons.lang3.concurrent.LazyInitializerTest
Tests run: 3, Failures: 0, Errors: 0, Skipped: 0, Time elapsed: 0.002 sec - in org.apache.commons.lang3.concurrent.LazyInitializerTest
Running org.apache.commons.lang3.concurrent.BasicThreadFactoryTest
Tests run: 15, Failures: 0, Errors: 0, Skipped: 0, Time elapsed: 0.03 sec - in org.apache.commons.lang3.concurrent.BasicThreadFactoryTest
Running org.apache.commons.lang3.concurrent.ConstantInitializerTest
Tests run: 7, Failures: 0, Errors: 0, Skipped: 0, Time elapsed: 0.001 sec - in org.apache.commons.lang3.concurrent.ConstantInitializerTest
Running org.apache.commons.lang3.concurrent.MultiBackgroundInitializerTest
Tests run: 17, Failures: 0, Errors: 0, Skipped: 0, Time elapsed: 0.07 sec - in org.apache.commons.lang3.concurrent.MultiBackgroundInitializerTest
Running org.apache.commons.lang3.concurrent.AtomicSafeInitializerTest
Tests run: 4, Failures: 0, Errors: 0, Skipped: 0, Time elapsed: 0.005 sec - in org.apache.commons.lang3.concurrent.AtomicSafeInitializerTest
Running org.apache.commons.lang3.concurrent.ConcurrentUtilsTest
Tests run: 40, Failures: 0, Errors: 0, Skipped: 0, Time elapsed: 0.012 sec - in org.apache.commons.lang3.concurrent.ConcurrentUtilsTest
Running org.apache.commons.lang3.concurrent.TimedSemaphoreTest
Tests run: 15, Failures: 0, Errors: 0, Skipped: 0, Time elapsed: 1.178 sec - in org.apache.commons.lang3.concurrent.TimedSemaphoreTest
Running org.apache.commons.lang3.StringUtilsSubstringTest
Tests run: 14, Failures: 0, Errors: 0, Skipped: 0, Time elapsed: 0.002 sec - in org.apache.commons.lang3.StringUtilsSubstringTest
Running org.apache.commons.lang3.SystemUtilsTest
Tests run: 12, Failures: 0, Errors: 0, Skipped: 0, Time elapsed: 0.002 sec - in org.apache.commons.lang3.SystemUtilsTest
Running org.apache.commons.lang3.CharRangeTest
Tests run: 16, Failures: 0, Errors: 0, Skipped: 0, Time elapsed: 0.036 sec - in org.apache.commons.lang3.CharRangeTest
Running org.apache.commons.lang3.CharSetTest
Tests run: 14, Failures: 0, Errors: 0, Skipped: 0, Time elapsed: 0.01 sec - in org.apache.commons.lang3.CharSetTest
Running org.apache.commons.lang3.StringUtilsStartsEndsWithTest
Tests run: 6, Failures: 2, Errors: 0, Skipped: 0, Time elapsed: 0.006 sec <<< FAILURE! - in org.apache.commons.lang3.StringUtilsStartsEndsWithTest
testStartsWithAny(org.apache.commons.lang3.StringUtilsStartsEndsWithTest)  Time elapsed: 0.005 sec  <<< FAILURE!
java.lang.AssertionError: StringUtils.startsWithAny( StrBuilder(abcxyz), StringBuilder(xyz), StringBuffer(abc))
	at org.junit.Assert.fail(Assert.java:88)
	at org.junit.Assert.assertTrue(Assert.java:41)
	at org.apache.commons.lang3.StringUtilsStartsEndsWithTest.testStartsWithAny(StringUtilsStartsEndsWithTest.java:97)

testEndsWithAny(org.apache.commons.lang3.StringUtilsStartsEndsWithTest)  Time elapsed: 0 sec  <<< FAILURE!
java.lang.AssertionError: StringUtils.endsWithAny( StrBuilder(abcxyz), StringBuilder(abc), StringBuffer(xyz))
	at org.junit.Assert.fail(Assert.java:88)
	at org.junit.Assert.assertTrue(Assert.java:41)
	at org.apache.commons.lang3.StringUtilsStartsEndsWithTest.testEndsWithAny(StringUtilsStartsEndsWithTest.java:179)

Running org.apache.commons.lang3.RandomStringUtilsTest
Tests run: 11, Failures: 0, Errors: 0, Skipped: 0, Time elapsed: 0.036 sec - in org.apache.commons.lang3.RandomStringUtilsTest
Running org.apache.commons.lang3.SerializationUtilsTest
Tests run: 26, Failures: 0, Errors: 0, Skipped: 0, Time elapsed: 0.06 sec - in org.apache.commons.lang3.SerializationUtilsTest
Running org.apache.commons.lang3.time.StopWatchTest
Tests run: 8, Failures: 0, Errors: 0, Skipped: 0, Time elapsed: 4.757 sec - in org.apache.commons.lang3.time.StopWatchTest
Running org.apache.commons.lang3.time.DateUtilsRoundingTest
Tests run: 22, Failures: 0, Errors: 0, Skipped: 0, Time elapsed: 0.174 sec - in org.apache.commons.lang3.time.DateUtilsRoundingTest
Running org.apache.commons.lang3.time.FastDateParserTest
Tests run: 33, Failures: 0, Errors: 0, Skipped: 0, Time elapsed: 2.557 sec - in org.apache.commons.lang3.time.FastDateParserTest
Running org.apache.commons.lang3.time.FastDateFormat_ParserTest
Tests run: 33, Failures: 0, Errors: 0, Skipped: 0, Time elapsed: 0.835 sec - in org.apache.commons.lang3.time.FastDateFormat_ParserTest
Running org.apache.commons.lang3.time.DurationFormatUtilsTest
Tests run: 25, Failures: 0, Errors: 0, Skipped: 0, Time elapsed: 0.839 sec - in org.apache.commons.lang3.time.DurationFormatUtilsTest
Running org.apache.commons.lang3.time.DateFormatUtilsTest
Tests run: 10, Failures: 0, Errors: 0, Skipped: 0, Time elapsed: 0.002 sec - in org.apache.commons.lang3.time.DateFormatUtilsTest
Running org.apache.commons.lang3.time.DateUtilsFragmentTest
Tests run: 57, Failures: 0, Errors: 0, Skipped: 0, Time elapsed: 0.013 sec - in org.apache.commons.lang3.time.DateUtilsFragmentTest
Running org.apache.commons.lang3.time.FastDatePrinterTimeZonesTest
Tests run: 617, Failures: 0, Errors: 0, Skipped: 0, Time elapsed: 0.245 sec - in org.apache.commons.lang3.time.FastDatePrinterTimeZonesTest
Running org.apache.commons.lang3.time.FastDateFormatTest
>>FastDateFormatTest: FastDateParser:19829  SimpleDateFormat:4068
Tests run: 14, Failures: 0, Errors: 0, Skipped: 0, Time elapsed: 2.642 sec - in org.apache.commons.lang3.time.FastDateFormatTest
Running org.apache.commons.lang3.time.FastDateFormat_PrinterTest
Tests run: 17, Failures: 0, Errors: 0, Skipped: 0, Time elapsed: 0.011 sec - in org.apache.commons.lang3.time.FastDateFormat_PrinterTest
Running org.apache.commons.lang3.time.FastDatePrinterTest
Tests run: 17, Failures: 0, Errors: 0, Skipped: 0, Time elapsed: 0.005 sec - in org.apache.commons.lang3.time.FastDatePrinterTest
Running org.apache.commons.lang3.time.FastDateParserSDFTest
Tests run: 276, Failures: 0, Errors: 0, Skipped: 92, Time elapsed: 0.079 sec - in org.apache.commons.lang3.time.FastDateParserSDFTest
Running org.apache.commons.lang3.time.DateUtilsTest
DateUtilsTest: Default Locale=en_US
Tests run: 38, Failures: 0, Errors: 0, Skipped: 0, Time elapsed: 0.024 sec - in org.apache.commons.lang3.time.DateUtilsTest
Running org.apache.commons.lang3.reflect.InheritanceUtilsTest
Tests run: 9, Failures: 0, Errors: 0, Skipped: 0, Time elapsed: 0.003 sec - in org.apache.commons.lang3.reflect.InheritanceUtilsTest
Running org.apache.commons.lang3.reflect.MethodUtilsTest
Tests run: 23, Failures: 0, Errors: 0, Skipped: 0, Time elapsed: 0.038 sec - in org.apache.commons.lang3.reflect.MethodUtilsTest
Running org.apache.commons.lang3.reflect.ConstructorUtilsTest
Tests run: 7, Failures: 0, Errors: 0, Skipped: 0, Time elapsed: 0.004 sec - in org.apache.commons.lang3.reflect.ConstructorUtilsTest
Running org.apache.commons.lang3.reflect.FieldUtilsTest
Tests run: 64, Failures: 0, Errors: 0, Skipped: 0, Time elapsed: 0.031 sec - in org.apache.commons.lang3.reflect.FieldUtilsTest
Running org.apache.commons.lang3.reflect.TypeLiteralTest
Tests run: 4, Failures: 0, Errors: 0, Skipped: 0, Time elapsed: 0.013 sec - in org.apache.commons.lang3.reflect.TypeLiteralTest
Running org.apache.commons.lang3.reflect.TypeUtilsTest
Tests run: 19, Failures: 0, Errors: 0, Skipped: 0, Time elapsed: 0.079 sec - in org.apache.commons.lang3.reflect.TypeUtilsTest
Running org.apache.commons.lang3.mutable.MutableByteTest
Tests run: 17, Failures: 0, Errors: 0, Skipped: 0, Time elapsed: 0.008 sec - in org.apache.commons.lang3.mutable.MutableByteTest
Running org.apache.commons.lang3.mutable.MutableShortTest
Tests run: 14, Failures: 0, Errors: 0, Skipped: 0, Time elapsed: 0.007 sec - in org.apache.commons.lang3.mutable.MutableShortTest
Running org.apache.commons.lang3.mutable.MutableIntTest
Tests run: 17, Failures: 0, Errors: 0, Skipped: 0, Time elapsed: 0.01 sec - in org.apache.commons.lang3.mutable.MutableIntTest
Running org.apache.commons.lang3.mutable.MutableDoubleTest
Tests run: 18, Failures: 0, Errors: 0, Skipped: 0, Time elapsed: 0.004 sec - in org.apache.commons.lang3.mutable.MutableDoubleTest
Running org.apache.commons.lang3.mutable.MutableFloatTest
Tests run: 18, Failures: 0, Errors: 0, Skipped: 0, Time elapsed: 0.012 sec - in org.apache.commons.lang3.mutable.MutableFloatTest
Running org.apache.commons.lang3.mutable.MutableLongTest
Tests run: 17, Failures: 0, Errors: 0, Skipped: 0, Time elapsed: 0.002 sec - in org.apache.commons.lang3.mutable.MutableLongTest
Running org.apache.commons.lang3.mutable.MutableBooleanTest
Tests run: 9, Failures: 0, Errors: 0, Skipped: 0, Time elapsed: 0.003 sec - in org.apache.commons.lang3.mutable.MutableBooleanTest
Running org.apache.commons.lang3.mutable.MutableObjectTest
Tests run: 5, Failures: 0, Errors: 0, Skipped: 0, Time elapsed: 0.001 sec - in org.apache.commons.lang3.mutable.MutableObjectTest
Running org.apache.commons.lang3.text.translate.UnicodeEscaperTest
Tests run: 3, Failures: 0, Errors: 0, Skipped: 0, Time elapsed: 0 sec - in org.apache.commons.lang3.text.translate.UnicodeEscaperTest
Running org.apache.commons.lang3.text.translate.EntityArraysTest
Tests run: 3, Failures: 0, Errors: 0, Skipped: 0, Time elapsed: 0 sec - in org.apache.commons.lang3.text.translate.EntityArraysTest
Running org.apache.commons.lang3.text.translate.UnicodeUnpairedSurrogateRemoverTest
Tests run: 2, Failures: 0, Errors: 0, Skipped: 0, Time elapsed: 0 sec - in org.apache.commons.lang3.text.translate.UnicodeUnpairedSurrogateRemoverTest
Running org.apache.commons.lang3.text.translate.NumericEntityUnescaperTest
Tests run: 3, Failures: 0, Errors: 0, Skipped: 0, Time elapsed: 0.001 sec - in org.apache.commons.lang3.text.translate.NumericEntityUnescaperTest
Running org.apache.commons.lang3.text.translate.NumericEntityEscaperTest
Tests run: 4, Failures: 0, Errors: 0, Skipped: 0, Time elapsed: 0 sec - in org.apache.commons.lang3.text.translate.NumericEntityEscaperTest
Running org.apache.commons.lang3.text.translate.LookupTranslatorTest
Tests run: 2, Failures: 0, Errors: 0, Skipped: 0, Time elapsed: 0 sec - in org.apache.commons.lang3.text.translate.LookupTranslatorTest
Running org.apache.commons.lang3.text.translate.UnicodeUnescaperTest
Tests run: 3, Failures: 0, Errors: 0, Skipped: 0, Time elapsed: 0 sec - in org.apache.commons.lang3.text.translate.UnicodeUnescaperTest
Running org.apache.commons.lang3.text.translate.OctalUnescaperTest
Tests run: 1, Failures: 0, Errors: 0, Skipped: 0, Time elapsed: 0 sec - in org.apache.commons.lang3.text.translate.OctalUnescaperTest
Running org.apache.commons.lang3.text.StrMatcherTest
Tests run: 14, Failures: 0, Errors: 0, Skipped: 0, Time elapsed: 0.005 sec - in org.apache.commons.lang3.text.StrMatcherTest
Running org.apache.commons.lang3.text.StrTokenizerTest
Tests run: 55, Failures: 0, Errors: 0, Skipped: 0, Time elapsed: 0.016 sec - in org.apache.commons.lang3.text.StrTokenizerTest
Running org.apache.commons.lang3.text.FormattableUtilsTest
Tests run: 5, Failures: 0, Errors: 0, Skipped: 0, Time elapsed: 0.001 sec - in org.apache.commons.lang3.text.FormattableUtilsTest
Running org.apache.commons.lang3.text.CompositeFormatTest
Tests run: 2, Failures: 0, Errors: 0, Skipped: 0, Time elapsed: 0.002 sec - in org.apache.commons.lang3.text.CompositeFormatTest
Running org.apache.commons.lang3.text.WordUtilsTest
Tests run: 12, Failures: 0, Errors: 0, Skipped: 0, Time elapsed: 0.002 sec - in org.apache.commons.lang3.text.WordUtilsTest
Running org.apache.commons.lang3.text.StrLookupTest
Tests run: 5, Failures: 0, Errors: 0, Skipped: 0, Time elapsed: 0.002 sec - in org.apache.commons.lang3.text.StrLookupTest
Running org.apache.commons.lang3.text.StrBuilderAppendInsertTest
Tests run: 51, Failures: 8, Errors: 37, Skipped: 0, Time elapsed: 0.03 sec <<< FAILURE! - in org.apache.commons.lang3.text.StrBuilderAppendInsertTest
testAppendWithSeparators_Collection(org.apache.commons.lang3.text.StrBuilderAppendInsertTest)  Time elapsed: 0 sec  <<< ERROR!
java.lang.ArrayIndexOutOfBoundsException: null
	at java.lang.String.getChars(String.java:826)
	at org.apache.commons.lang3.text.StrBuilder.append(StrBuilder.java:128)
	at org.apache.commons.lang3.text.StrBuilder.appendWithSeparators(StrBuilder.java:272)
	at org.apache.commons.lang3.text.StrBuilderAppendInsertTest.testAppendWithSeparators_Collection(StrBuilderAppendInsertTest.java:1145)

testInsertWithNullText(org.apache.commons.lang3.text.StrBuilderAppendInsertTest)  Time elapsed: 0 sec  <<< ERROR!
java.lang.StringIndexOutOfBoundsException: String index out of range: -6
	at java.lang.String.<init>(String.java:197)
	at org.apache.commons.lang3.text.StrBuilder.toString(StrBuilder.java:606)
	at org.apache.commons.lang3.text.StrBuilderAppendInsertTest.testInsertWithNullText(StrBuilderAppendInsertTest.java:1557)

testAppendln_PrimitiveNumber(org.apache.commons.lang3.text.StrBuilderAppendInsertTest)  Time elapsed: 0 sec  <<< ERROR!
java.lang.ArrayIndexOutOfBoundsException: null
	at java.lang.String.getChars(String.java:826)
	at org.apache.commons.lang3.text.StrBuilder.append(StrBuilder.java:128)
	at org.apache.commons.lang3.text.StrBuilder.appendNewLine(StrBuilder.java:108)
	at org.apache.commons.lang3.text.StrBuilder.appendln(StrBuilder.java:252)
	at org.apache.commons.lang3.text.StrBuilderAppendInsertTest.testAppendln_PrimitiveNumber(StrBuilderAppendInsertTest.java:840)

testAppendln_Boolean(org.apache.commons.lang3.text.StrBuilderAppendInsertTest)  Time elapsed: 0 sec  <<< FAILURE!
org.junit.ComparisonFailure: expected:<tru[e
]> but was:<tru[]>
	at org.junit.Assert.assertEquals(Assert.java:115)
	at org.junit.Assert.assertEquals(Assert.java:144)
	at org.apache.commons.lang3.text.StrBuilderAppendInsertTest.testAppendln_Boolean(StrBuilderAppendInsertTest.java:829)

testAppend_StrBuilder_int_int(org.apache.commons.lang3.text.StrBuilderAppendInsertTest)  Time elapsed: 0 sec  <<< ERROR!
java.lang.StringIndexOutOfBoundsException: String index out of range: -4
	at java.lang.String.<init>(String.java:197)
	at org.apache.commons.lang3.text.StrBuilder.toString(StrBuilder.java:606)
	at org.apache.commons.lang3.text.StrBuilderAppendInsertTest.testAppend_StrBuilder_int_int(StrBuilderAppendInsertTest.java:385)

testAppendln_CharArray_int_int(org.apache.commons.lang3.text.StrBuilderAppendInsertTest)  Time elapsed: 0 sec  <<< FAILURE!
org.junit.ComparisonFailure: expected:<fo[o
]> but was:<fo[]>
	at org.junit.Assert.assertEquals(Assert.java:115)
	at org.junit.Assert.assertEquals(Assert.java:144)
	at org.apache.commons.lang3.text.StrBuilderAppendInsertTest.testAppendln_CharArray_int_int(StrBuilderAppendInsertTest.java:819)

testAppendln_String_int_int(org.apache.commons.lang3.text.StrBuilderAppendInsertTest)  Time elapsed: 0 sec  <<< FAILURE!
org.junit.ComparisonFailure: expected:<fo[o
]> but was:<fo[]>
	at org.junit.Assert.assertEquals(Assert.java:115)
	at org.junit.Assert.assertEquals(Assert.java:144)
	at org.apache.commons.lang3.text.StrBuilderAppendInsertTest.testAppendln_String_int_int(StrBuilderAppendInsertTest.java:627)

testAppendAll_Collection(org.apache.commons.lang3.text.StrBuilderAppendInsertTest)  Time elapsed: 0 sec  <<< ERROR!
java.lang.ArrayIndexOutOfBoundsException: null
	at java.lang.String.getChars(String.java:826)
	at org.apache.commons.lang3.text.StrBuilder.append(StrBuilder.java:128)
	at org.apache.commons.lang3.text.StrBuilder.append(StrBuilder.java:121)
	at org.apache.commons.lang3.text.StrBuilder.append(StrBuilder.java:114)
	at org.apache.commons.lang3.text.StrBuilder.appendAll(StrBuilder.java:258)
	at org.apache.commons.lang3.text.StrBuilderAppendInsertTest.testAppendAll_Collection(StrBuilderAppendInsertTest.java:1089)

testAppendln_StringBuilder(org.apache.commons.lang3.text.StrBuilderAppendInsertTest)  Time elapsed: 0 sec  <<< FAILURE!
org.junit.ComparisonFailure: expected:<fo[o
]> but was:<fo[]>
	at org.junit.Assert.assertEquals(Assert.java:115)
	at org.junit.Assert.assertEquals(Assert.java:144)
	at org.apache.commons.lang3.text.StrBuilderAppendInsertTest.testAppendln_StringBuilder(StrBuilderAppendInsertTest.java:675)

testAppendNewLine(org.apache.commons.lang3.text.StrBuilderAppendInsertTest)  Time elapsed: 0 sec  <<< ERROR!
java.lang.ArrayIndexOutOfBoundsException: null
	at java.lang.String.getChars(String.java:826)
	at org.apache.commons.lang3.text.StrBuilder.append(StrBuilder.java:128)
	at org.apache.commons.lang3.text.StrBuilder.appendNewLine(StrBuilder.java:108)
	at org.apache.commons.lang3.text.StrBuilderAppendInsertTest.testAppendNewLine(StrBuilderAppendInsertTest.java:53)

testAppend_CharArray_int_int(org.apache.commons.lang3.text.StrBuilderAppendInsertTest)  Time elapsed: 0 sec  <<< ERROR!
java.lang.StringIndexOutOfBoundsException: String index out of range: -4
	at java.lang.String.<init>(String.java:197)
	at org.apache.commons.lang3.text.StrBuilder.toString(StrBuilder.java:606)
	at org.apache.commons.lang3.text.StrBuilderAppendInsertTest.testAppend_CharArray_int_int(StrBuilderAppendInsertTest.java:460)

testAppendln_StringBuffer(org.apache.commons.lang3.text.StrBuilderAppendInsertTest)  Time elapsed: 0 sec  <<< FAILURE!
org.junit.ComparisonFailure: expected:<fo[o
]> but was:<fo[]>
	at org.junit.Assert.assertEquals(Assert.java:115)
	at org.junit.Assert.assertEquals(Assert.java:144)
	at org.apache.commons.lang3.text.StrBuilderAppendInsertTest.testAppendln_StringBuffer(StrBuilderAppendInsertTest.java:651)

testAppendAll_Iterator(org.apache.commons.lang3.text.StrBuilderAppendInsertTest)  Time elapsed: 0 sec  <<< ERROR!
java.lang.ArrayIndexOutOfBoundsException: null
	at java.lang.String.getChars(String.java:826)
	at org.apache.commons.lang3.text.StrBuilder.append(StrBuilder.java:128)
	at org.apache.commons.lang3.text.StrBuilder.append(StrBuilder.java:121)
	at org.apache.commons.lang3.text.StrBuilder.append(StrBuilder.java:114)
	at org.apache.commons.lang3.text.StrBuilder.appendAll(StrBuilder.java:260)
	at org.apache.commons.lang3.text.StrBuilderAppendInsertTest.testAppendAll_Iterator(StrBuilderAppendInsertTest.java:1105)

testAppendSeparator_char_char(org.apache.commons.lang3.text.StrBuilderAppendInsertTest)  Time elapsed: 0 sec  <<< ERROR!
java.lang.StringIndexOutOfBoundsException: String index out of range: -2
	at java.lang.String.<init>(String.java:197)
	at org.apache.commons.lang3.text.StrBuilder.toString(StrBuilder.java:606)
	at org.apache.commons.lang3.text.StrBuilderAppendInsertTest.testAppendSeparator_char_char(StrBuilderAppendInsertTest.java:1249)

testAppendWithSeparators_Iterator(org.apache.commons.lang3.text.StrBuilderAppendInsertTest)  Time elapsed: 0.001 sec  <<< ERROR!
java.lang.ArrayIndexOutOfBoundsException: null
	at java.lang.String.getChars(String.java:826)
	at org.apache.commons.lang3.text.StrBuilder.append(StrBuilder.java:128)
	at org.apache.commons.lang3.text.StrBuilder.appendWithSeparators(StrBuilder.java:276)
	at org.apache.commons.lang3.text.StrBuilderAppendInsertTest.testAppendWithSeparators_Iterator(StrBuilderAppendInsertTest.java:1169)

testAppendWithNullText(org.apache.commons.lang3.text.StrBuilderAppendInsertTest)  Time elapsed: 0 sec  <<< ERROR!
java.lang.StringIndexOutOfBoundsException: String index out of range: -4
	at java.lang.String.<init>(String.java:197)
	at org.apache.commons.lang3.text.StrBuilder.toString(StrBuilder.java:606)
	at org.apache.commons.lang3.text.StrBuilderAppendInsertTest.testAppendWithNullText(StrBuilderAppendInsertTest.java:69)

testAppendln_StrBuilder(org.apache.commons.lang3.text.StrBuilderAppendInsertTest)  Time elapsed: 0.001 sec  <<< ERROR!
java.lang.StringIndexOutOfBoundsException: String index out of range: -1
	at java.lang.String.<init>(String.java:197)
	at org.apache.commons.lang3.text.StrBuilder.toString(StrBuilder.java:606)
	at org.apache.commons.lang3.text.StrBuilderAppendInsertTest.testAppendln_StrBuilder(StrBuilderAppendInsertTest.java:747)

testAppendln_Object(org.apache.commons.lang3.text.StrBuilderAppendInsertTest)  Time elapsed: 0 sec  <<< ERROR!
java.lang.StringIndexOutOfBoundsException: String index out of range: -1
	at java.lang.String.<init>(String.java:197)
	at org.apache.commons.lang3.text.StrBuilder.toString(StrBuilder.java:606)
	at org.apache.commons.lang3.text.StrBuilderAppendInsertTest.testAppendln_Object(StrBuilderAppendInsertTest.java:575)

testAppend_StrBuilder(org.apache.commons.lang3.text.StrBuilderAppendInsertTest)  Time elapsed: 0.001 sec  <<< ERROR!
java.lang.StringIndexOutOfBoundsException: String index out of range: -4
	at java.lang.String.<init>(String.java:197)
	at org.apache.commons.lang3.text.StrBuilder.toString(StrBuilder.java:606)
	at org.apache.commons.lang3.text.StrBuilderAppendInsertTest.testAppend_StrBuilder(StrBuilderAppendInsertTest.java:367)

testAppendSeparator_String(org.apache.commons.lang3.text.StrBuilderAppendInsertTest)  Time elapsed: 0 sec  <<< ERROR!
java.lang.StringIndexOutOfBoundsException: String index out of range: -3
	at java.lang.String.<init>(String.java:197)
	at org.apache.commons.lang3.text.StrBuilder.toString(StrBuilder.java:606)
	at org.apache.commons.lang3.text.StrBuilderAppendInsertTest.testAppendSeparator_String(StrBuilderAppendInsertTest.java:1201)

testAppendln_String(org.apache.commons.lang3.text.StrBuilderAppendInsertTest)  Time elapsed: 0.001 sec  <<< ERROR!
java.lang.ArrayIndexOutOfBoundsException: null
	at java.lang.String.getChars(String.java:826)
	at org.apache.commons.lang3.text.StrBuilder.append(StrBuilder.java:128)
	at org.apache.commons.lang3.text.StrBuilderAppendInsertTest$3.append(StrBuilderAppendInsertTest.java:594)
	at org.apache.commons.lang3.text.StrBuilder.appendNewLine(StrBuilder.java:108)
	at org.apache.commons.lang3.text.StrBuilderAppendInsertTest$3.appendNewLine(StrBuilderAppendInsertTest.java:599)
	at org.apache.commons.lang3.text.StrBuilder.appendln(StrBuilder.java:239)
	at org.apache.commons.lang3.text.StrBuilderAppendInsertTest.testAppendln_String(StrBuilderAppendInsertTest.java:602)

testAppendSeparator_char_int(org.apache.commons.lang3.text.StrBuilderAppendInsertTest)  Time elapsed: 0 sec  <<< ERROR!
java.lang.StringIndexOutOfBoundsException: String index out of range: -3
	at java.lang.String.<init>(String.java:197)
	at org.apache.commons.lang3.text.StrBuilder.toString(StrBuilder.java:606)
	at org.apache.commons.lang3.text.StrBuilderAppendInsertTest.testAppendSeparator_char_int(StrBuilderAppendInsertTest.java:1276)

testAppendSeparator_String_String(org.apache.commons.lang3.text.StrBuilderAppendInsertTest)  Time elapsed: 0.001 sec  <<< ERROR!
java.lang.StringIndexOutOfBoundsException: String index out of range: -9
	at java.lang.String.<init>(String.java:197)
	at org.apache.commons.lang3.text.StrBuilder.toString(StrBuilder.java:606)
	at org.apache.commons.lang3.text.StrBuilderAppendInsertTest.testAppendSeparator_String_String(StrBuilderAppendInsertTest.java:1218)

testAppendAll_Array(org.apache.commons.lang3.text.StrBuilderAppendInsertTest)  Time elapsed: 0 sec  <<< ERROR!
java.lang.ArrayIndexOutOfBoundsException: null
	at java.lang.String.getChars(String.java:826)
	at org.apache.commons.lang3.text.StrBuilder.append(StrBuilder.java:128)
	at org.apache.commons.lang3.text.StrBuilder.append(StrBuilder.java:121)
	at org.apache.commons.lang3.text.StrBuilder.append(StrBuilder.java:114)
	at org.apache.commons.lang3.text.StrBuilder.appendAll(StrBuilder.java:256)
	at org.apache.commons.lang3.text.StrBuilderAppendInsertTest.testAppendAll_Array(StrBuilderAppendInsertTest.java:1069)

testAppend_StringBuilder_int_int(org.apache.commons.lang3.text.StrBuilderAppendInsertTest)  Time elapsed: 0.001 sec  <<< ERROR!
java.lang.StringIndexOutOfBoundsException: String index out of range: -4
	at java.lang.String.<init>(String.java:197)
	at org.apache.commons.lang3.text.StrBuilder.toString(StrBuilder.java:606)
	at org.apache.commons.lang3.text.StrBuilderAppendInsertTest.testAppend_StringBuilder_int_int(StrBuilderAppendInsertTest.java:226)

testAppendSeparator_char(org.apache.commons.lang3.text.StrBuilderAppendInsertTest)  Time elapsed: 0 sec  <<< ERROR!
java.lang.StringIndexOutOfBoundsException: String index out of range: -3
	at java.lang.String.<init>(String.java:197)
	at org.apache.commons.lang3.text.StrBuilder.toString(StrBuilder.java:606)
	at org.apache.commons.lang3.text.StrBuilderAppendInsertTest.testAppendSeparator_char(StrBuilderAppendInsertTest.java:1236)

testAppend_StringBuffer(org.apache.commons.lang3.text.StrBuilderAppendInsertTest)  Time elapsed: 0 sec  <<< ERROR!
java.lang.StringIndexOutOfBoundsException: String index out of range: -4
	at java.lang.String.<init>(String.java:197)
	at org.apache.commons.lang3.text.StrBuilder.toString(StrBuilder.java:606)
	at org.apache.commons.lang3.text.StrBuilderAppendInsertTest.testAppend_StringBuffer(StrBuilderAppendInsertTest.java:289)

testAppendWithSeparatorsWithNullText(org.apache.commons.lang3.text.StrBuilderAppendInsertTest)  Time elapsed: 0 sec  <<< ERROR!
java.lang.ArrayIndexOutOfBoundsException: null
	at java.lang.String.getChars(String.java:826)
	at org.apache.commons.lang3.text.StrBuilder.append(StrBuilder.java:128)
	at org.apache.commons.lang3.text.StrBuilder.appendWithSeparators(StrBuilder.java:266)
	at org.apache.commons.lang3.text.StrBuilderAppendInsertTest.testAppendWithSeparatorsWithNullText(StrBuilderAppendInsertTest.java:1186)

testAppendSeparator_String_int(org.apache.commons.lang3.text.StrBuilderAppendInsertTest)  Time elapsed: 0 sec  <<< ERROR!
java.lang.StringIndexOutOfBoundsException: String index out of range: -3
	at java.lang.String.<init>(String.java:197)
	at org.apache.commons.lang3.text.StrBuilder.toString(StrBuilder.java:606)
	at org.apache.commons.lang3.text.StrBuilderAppendInsertTest.testAppendSeparator_String_int(StrBuilderAppendInsertTest.java:1261)

testAppendln_StringBuffer_int_int(org.apache.commons.lang3.text.StrBuilderAppendInsertTest)  Time elapsed: 0.001 sec  <<< FAILURE!
org.junit.ComparisonFailure: expected:<fo[o
]> but was:<fo[]>
	at org.junit.Assert.assertEquals(Assert.java:115)
	at org.junit.Assert.assertEquals(Assert.java:144)
	at org.apache.commons.lang3.text.StrBuilderAppendInsertTest.testAppendln_StringBuffer_int_int(StrBuilderAppendInsertTest.java:699)

testAppend_FormattedString(org.apache.commons.lang3.text.StrBuilderAppendInsertTest)  Time elapsed: 0 sec  <<< ERROR!
java.lang.StringIndexOutOfBoundsException: String index out of range: -2
	at java.lang.String.<init>(String.java:197)
	at org.apache.commons.lang3.text.StrBuilder.toString(StrBuilder.java:606)
	at org.apache.commons.lang3.text.StrBuilderAppendInsertTest.testAppend_FormattedString(StrBuilderAppendInsertTest.java:1039)

testAppend_Object(org.apache.commons.lang3.text.StrBuilderAppendInsertTest)  Time elapsed: 0.001 sec  <<< ERROR!
java.lang.StringIndexOutOfBoundsException: String index out of range: -3
	at java.lang.String.<init>(String.java:197)
	at org.apache.commons.lang3.text.StrBuilder.toString(StrBuilder.java:606)
	at org.apache.commons.lang3.text.StrBuilderAppendInsertTest.testAppend_Object(StrBuilderAppendInsertTest.java:104)

testAppend_StringBuffer_int_int(org.apache.commons.lang3.text.StrBuilderAppendInsertTest)  Time elapsed: 0 sec  <<< ERROR!
java.lang.StringIndexOutOfBoundsException: String index out of range: -4
	at java.lang.String.<init>(String.java:197)
	at org.apache.commons.lang3.text.StrBuilder.toString(StrBuilder.java:606)
	at org.apache.commons.lang3.text.StrBuilderAppendInsertTest.testAppend_StringBuffer_int_int(StrBuilderAppendInsertTest.java:307)

testAppendPadding(org.apache.commons.lang3.text.StrBuilderAppendInsertTest)  Time elapsed: 0.001 sec  <<< ERROR!
java.lang.StringIndexOutOfBoundsException: String index out of range: -3
	at java.lang.String.<init>(String.java:197)
	at org.apache.commons.lang3.text.StrBuilder.toString(StrBuilder.java:606)
	at org.apache.commons.lang3.text.StrBuilderAppendInsertTest.testAppendPadding(StrBuilderAppendInsertTest.java:861)

testAppend_String(org.apache.commons.lang3.text.StrBuilderAppendInsertTest)  Time elapsed: 0 sec  <<< ERROR!
java.lang.StringIndexOutOfBoundsException: String index out of range: -4
	at java.lang.String.<init>(String.java:197)
	at org.apache.commons.lang3.text.StrBuilder.toString(StrBuilder.java:606)
	at org.apache.commons.lang3.text.StrBuilderAppendInsertTest.testAppend_String(StrBuilderAppendInsertTest.java:145)

testAppend_String_int_int(org.apache.commons.lang3.text.StrBuilderAppendInsertTest)  Time elapsed: 0 sec  <<< ERROR!
java.lang.StringIndexOutOfBoundsException: String index out of range: -4
	at java.lang.String.<init>(String.java:197)
	at org.apache.commons.lang3.text.StrBuilder.toString(StrBuilder.java:606)
	at org.apache.commons.lang3.text.StrBuilderAppendInsertTest.testAppend_String_int_int(StrBuilderAppendInsertTest.java:163)

testAppend_PrimitiveNumber(org.apache.commons.lang3.text.StrBuilderAppendInsertTest)  Time elapsed: 0 sec  <<< ERROR!
java.lang.StringIndexOutOfBoundsException: String index out of range: -1
	at java.lang.String.<init>(String.java:197)
	at org.apache.commons.lang3.text.StrBuilder.toString(StrBuilder.java:606)
	at org.apache.commons.lang3.text.StrBuilderAppendInsertTest.testAppend_PrimitiveNumber(StrBuilderAppendInsertTest.java:534)

testAppend_StringBuilder(org.apache.commons.lang3.text.StrBuilderAppendInsertTest)  Time elapsed: 0 sec  <<< ERROR!
java.lang.StringIndexOutOfBoundsException: String index out of range: -4
	at java.lang.String.<init>(String.java:197)
	at org.apache.commons.lang3.text.StrBuilder.toString(StrBuilder.java:606)
	at org.apache.commons.lang3.text.StrBuilderAppendInsertTest.testAppend_StringBuilder(StrBuilderAppendInsertTest.java:127)

testInsert(org.apache.commons.lang3.text.StrBuilderAppendInsertTest)  Time elapsed: 0.001 sec  <<< ERROR!
java.lang.StringIndexOutOfBoundsException: String index out of range: -6
	at java.lang.String.<init>(String.java:197)
	at org.apache.commons.lang3.text.StrBuilder.toString(StrBuilder.java:606)
	at org.apache.commons.lang3.text.StrBuilderAppendInsertTest.testInsert(StrBuilderAppendInsertTest.java:1290)

testAppendln_StrBuilder_int_int(org.apache.commons.lang3.text.StrBuilderAppendInsertTest)  Time elapsed: 0.001 sec  <<< ERROR!
java.lang.StringIndexOutOfBoundsException: startIndex must be valid
	at org.apache.commons.lang3.text.StrBuilder.append(StrBuilder.java:196)
	at org.apache.commons.lang3.text.StrBuilderAppendInsertTest$10.append(StrBuilderAppendInsertTest.java:762)
	at org.apache.commons.lang3.text.StrBuilder.appendln(StrBuilder.java:247)
	at org.apache.commons.lang3.text.StrBuilderAppendInsertTest.testAppendln_StrBuilder_int_int(StrBuilderAppendInsertTest.java:770)

testAppend_CharArray(org.apache.commons.lang3.text.StrBuilderAppendInsertTest)  Time elapsed: 0 sec  <<< ERROR!
java.lang.StringIndexOutOfBoundsException: String index out of range: -4
	at java.lang.String.<init>(String.java:197)
	at org.apache.commons.lang3.text.StrBuilder.toString(StrBuilder.java:606)
	at org.apache.commons.lang3.text.StrBuilderAppendInsertTest.testAppend_CharArray(StrBuilderAppendInsertTest.java:445)

testAppendln_FormattedString(org.apache.commons.lang3.text.StrBuilderAppendInsertTest)  Time elapsed: 0.001 sec  <<< ERROR!
java.lang.ArrayIndexOutOfBoundsException: null
	at java.lang.String.getChars(String.java:826)
	at org.apache.commons.lang3.text.StrBuilder.append(StrBuilder.java:128)
	at org.apache.commons.lang3.text.StrBuilderAppendInsertTest$2.append(StrBuilderAppendInsertTest.java:556)
	at org.apache.commons.lang3.text.StrBuilder.appendNewLine(StrBuilder.java:108)
	at org.apache.commons.lang3.text.StrBuilderAppendInsertTest$2.appendNewLine(StrBuilderAppendInsertTest.java:561)
	at org.apache.commons.lang3.text.StrBuilder.appendln(StrBuilder.java:241)
	at org.apache.commons.lang3.text.StrBuilderAppendInsertTest.testAppendln_FormattedString(StrBuilderAppendInsertTest.java:564)

testAppendln_CharArray(org.apache.commons.lang3.text.StrBuilderAppendInsertTest)  Time elapsed: 0 sec  <<< FAILURE!
org.junit.ComparisonFailure: expected:<fo[o
]> but was:<fo[]>
	at org.junit.Assert.assertEquals(Assert.java:115)
	at org.junit.Assert.assertEquals(Assert.java:144)
	at org.apache.commons.lang3.text.StrBuilderAppendInsertTest.testAppendln_CharArray(StrBuilderAppendInsertTest.java:795)

testAppendln_StringBuilder_int_int(org.apache.commons.lang3.text.StrBuilderAppendInsertTest)  Time elapsed: 0.001 sec  <<< FAILURE!
org.junit.ComparisonFailure: expected:<fo[o
]> but was:<fo[]>
	at org.junit.Assert.assertEquals(Assert.java:115)
	at org.junit.Assert.assertEquals(Assert.java:144)
	at org.apache.commons.lang3.text.StrBuilderAppendInsertTest.testAppendln_StringBuilder_int_int(StrBuilderAppendInsertTest.java:723)

testAppendWithSeparators_Array(org.apache.commons.lang3.text.StrBuilderAppendInsertTest)  Time elapsed: 0 sec  <<< ERROR!
java.lang.ArrayIndexOutOfBoundsException: null
	at java.lang.String.getChars(String.java:826)
	at org.apache.commons.lang3.text.StrBuilder.append(StrBuilder.java:128)
	at org.apache.commons.lang3.text.StrBuilder.appendWithSeparators(StrBuilder.java:266)
	at org.apache.commons.lang3.text.StrBuilderAppendInsertTest.testAppendWithSeparators_Array(StrBuilderAppendInsertTest.java:1121)

Running org.apache.commons.lang3.text.ExtendedMessageFormatTest
Tests run: 10, Failures: 0, Errors: 0, Skipped: 0, Time elapsed: 0.776 sec - in org.apache.commons.lang3.text.ExtendedMessageFormatTest
Running org.apache.commons.lang3.text.StrSubstitutorTest
Tests run: 40, Failures: 0, Errors: 32, Skipped: 0, Time elapsed: 0.03 sec <<< FAILURE! - in org.apache.commons.lang3.text.StrSubstitutorTest
testReplaceEscaping(org.apache.commons.lang3.text.StrSubstitutorTest)  Time elapsed: 0.001 sec  <<< ERROR!
java.lang.StringIndexOutOfBoundsException: String index out of range: 4
	at org.apache.commons.lang3.text.StrBuilder.deleteCharAt(StrBuilder.java:70)
	at org.apache.commons.lang3.text.StrSubstitutor.substitute(StrSubstitutor.java:772)
	at org.apache.commons.lang3.text.StrSubstitutor.substitute(StrSubstitutor.java:735)
	at org.apache.commons.lang3.text.StrSubstitutor.replace(StrSubstitutor.java:395)
	at org.apache.commons.lang3.text.StrSubstitutorTest.doTestReplace(StrSubstitutorTest.java:634)
	at org.apache.commons.lang3.text.StrSubstitutorTest.testReplaceEscaping(StrSubstitutorTest.java:163)

testReplaceSoloEscaping(org.apache.commons.lang3.text.StrSubstitutorTest)  Time elapsed: 0 sec  <<< ERROR!
java.lang.StringIndexOutOfBoundsException: String index out of range: 0
	at org.apache.commons.lang3.text.StrBuilder.deleteCharAt(StrBuilder.java:70)
	at org.apache.commons.lang3.text.StrSubstitutor.substitute(StrSubstitutor.java:772)
	at org.apache.commons.lang3.text.StrSubstitutor.substitute(StrSubstitutor.java:735)
	at org.apache.commons.lang3.text.StrSubstitutor.replace(StrSubstitutor.java:395)
	at org.apache.commons.lang3.text.StrSubstitutorTest.doTestReplace(StrSubstitutorTest.java:634)
	at org.apache.commons.lang3.text.StrSubstitutorTest.testReplaceSoloEscaping(StrSubstitutorTest.java:171)

testSubstituteDefaultProperties(org.apache.commons.lang3.text.StrSubstitutorTest)  Time elapsed: 0.001 sec  <<< ERROR!
java.lang.StringIndexOutOfBoundsException: String index out of range: -14
	at java.lang.String.<init>(String.java:197)
	at org.apache.commons.lang3.text.StrBuilder.toString(StrBuilder.java:606)
	at org.apache.commons.lang3.text.StrSubstitutor.replace(StrSubstitutor.java:598)
	at org.apache.commons.lang3.text.StrSubstitutor.replace(StrSubstitutor.java:181)
	at org.apache.commons.lang3.text.StrSubstitutor.replace(StrSubstitutor.java:220)
	at org.apache.commons.lang3.text.StrSubstitutorTest.testSubstituteDefaultProperties(StrSubstitutorTest.java:615)

testReplaceNoPrefixSuffix(org.apache.commons.lang3.text.StrSubstitutorTest)  Time elapsed: 0.001 sec  <<< ERROR!
java.lang.StringIndexOutOfBoundsException: end < start
	at org.apache.commons.lang3.text.StrBuilder.validateRange(StrBuilder.java:612)
	at org.apache.commons.lang3.text.StrBuilder.replace(StrBuilder.java:412)
	at org.apache.commons.lang3.text.StrSubstitutor.substitute(StrSubstitutor.java:851)
	at org.apache.commons.lang3.text.StrSubstitutor.substitute(StrSubstitutor.java:735)
	at org.apache.commons.lang3.text.StrSubstitutor.replace(StrSubstitutor.java:395)
	at org.apache.commons.lang3.text.StrSubstitutorTest.doTestReplace(StrSubstitutorTest.java:634)
	at org.apache.commons.lang3.text.StrSubstitutorTest.testReplaceNoPrefixSuffix(StrSubstitutorTest.java:212)

testCyclicReplacement(org.apache.commons.lang3.text.StrSubstitutorTest)  Time elapsed: 0.001 sec  <<< ERROR!
java.lang.StringIndexOutOfBoundsException: end < start
	at org.apache.commons.lang3.text.StrBuilder.validateRange(StrBuilder.java:612)
	at org.apache.commons.lang3.text.StrBuilder.replace(StrBuilder.java:412)
	at org.apache.commons.lang3.text.StrSubstitutor.substitute(StrSubstitutor.java:851)
	at org.apache.commons.lang3.text.StrSubstitutor.substitute(StrSubstitutor.java:735)
	at org.apache.commons.lang3.text.StrSubstitutor.replace(StrSubstitutor.java:395)
	at org.apache.commons.lang3.text.StrSubstitutorTest.testCyclicReplacement(StrSubstitutorTest.java:251)

testReplaceToIdentical(org.apache.commons.lang3.text.StrSubstitutorTest)  Time elapsed: 0.001 sec  <<< ERROR!
java.lang.StringIndexOutOfBoundsException: end < start
	at org.apache.commons.lang3.text.StrBuilder.validateRange(StrBuilder.java:612)
	at org.apache.commons.lang3.text.StrBuilder.replace(StrBuilder.java:412)
	at org.apache.commons.lang3.text.StrSubstitutor.substitute(StrSubstitutor.java:851)
	at org.apache.commons.lang3.text.StrSubstitutor.substitute(StrSubstitutor.java:735)
	at org.apache.commons.lang3.text.StrSubstitutor.replace(StrSubstitutor.java:395)
	at org.apache.commons.lang3.text.StrSubstitutorTest.doTestReplace(StrSubstitutorTest.java:634)
	at org.apache.commons.lang3.text.StrSubstitutorTest.testReplaceToIdentical(StrSubstitutorTest.java:231)

testReplaceSimple(org.apache.commons.lang3.text.StrSubstitutorTest)  Time elapsed: 0 sec  <<< ERROR!
java.lang.StringIndexOutOfBoundsException: end < start
	at org.apache.commons.lang3.text.StrBuilder.validateRange(StrBuilder.java:612)
	at org.apache.commons.lang3.text.StrBuilder.replace(StrBuilder.java:412)
	at org.apache.commons.lang3.text.StrSubstitutor.substitute(StrSubstitutor.java:851)
	at org.apache.commons.lang3.text.StrSubstitutor.substitute(StrSubstitutor.java:735)
	at org.apache.commons.lang3.text.StrSubstitutor.replace(StrSubstitutor.java:395)
	at org.apache.commons.lang3.text.StrSubstitutorTest.doTestReplace(StrSubstitutorTest.java:634)
	at org.apache.commons.lang3.text.StrSubstitutorTest.testReplaceSimple(StrSubstitutorTest.java:63)

testStaticReplacePrefixSuffix(org.apache.commons.lang3.text.StrSubstitutorTest)  Time elapsed: 0 sec  <<< ERROR!
java.lang.StringIndexOutOfBoundsException: String index out of range: -10
	at java.lang.String.<init>(String.java:197)
	at org.apache.commons.lang3.text.StrBuilder.toString(StrBuilder.java:606)
	at org.apache.commons.lang3.text.StrSubstitutor.replace(StrSubstitutor.java:598)
	at org.apache.commons.lang3.text.StrSubstitutor.replace(StrSubstitutor.java:198)
	at org.apache.commons.lang3.text.StrSubstitutorTest.testStaticReplacePrefixSuffix(StrSubstitutorTest.java:573)

testReplaceRecursive(org.apache.commons.lang3.text.StrSubstitutorTest)  Time elapsed: 0 sec  <<< ERROR!
java.lang.StringIndexOutOfBoundsException: end < start
	at org.apache.commons.lang3.text.StrBuilder.validateRange(StrBuilder.java:612)
	at org.apache.commons.lang3.text.StrBuilder.replace(StrBuilder.java:412)
	at org.apache.commons.lang3.text.StrSubstitutor.substitute(StrSubstitutor.java:851)
	at org.apache.commons.lang3.text.StrSubstitutor.substitute(StrSubstitutor.java:735)
	at org.apache.commons.lang3.text.StrSubstitutor.replace(StrSubstitutor.java:395)
	at org.apache.commons.lang3.text.StrSubstitutorTest.doTestReplace(StrSubstitutorTest.java:634)
	at org.apache.commons.lang3.text.StrSubstitutorTest.testReplaceRecursive(StrSubstitutorTest.java:152)

testConstructorMapPrefixSuffix(org.apache.commons.lang3.text.StrSubstitutorTest)  Time elapsed: 0.001 sec  <<< ERROR!
java.lang.StringIndexOutOfBoundsException: String index out of range: 3
	at org.apache.commons.lang3.text.StrBuilder.deleteCharAt(StrBuilder.java:70)
	at org.apache.commons.lang3.text.StrSubstitutor.substitute(StrSubstitutor.java:772)
	at org.apache.commons.lang3.text.StrSubstitutor.substitute(StrSubstitutor.java:735)
	at org.apache.commons.lang3.text.StrSubstitutor.replace(StrSubstitutor.java:395)
	at org.apache.commons.lang3.text.StrSubstitutorTest.testConstructorMapPrefixSuffix(StrSubstitutorTest.java:441)

testSamePrefixAndSuffix(org.apache.commons.lang3.text.StrSubstitutorTest)  Time elapsed: 0 sec  <<< ERROR!
java.lang.StringIndexOutOfBoundsException: String index out of range: -10
	at java.lang.String.<init>(String.java:197)
	at org.apache.commons.lang3.text.StrBuilder.toString(StrBuilder.java:606)
	at org.apache.commons.lang3.text.StrSubstitutor.replace(StrSubstitutor.java:598)
	at org.apache.commons.lang3.text.StrSubstitutor.replace(StrSubstitutor.java:198)
	at org.apache.commons.lang3.text.StrSubstitutorTest.testSamePrefixAndSuffix(StrSubstitutorTest.java:624)

testStaticReplace(org.apache.commons.lang3.text.StrSubstitutorTest)  Time elapsed: 0 sec  <<< ERROR!
java.lang.StringIndexOutOfBoundsException: String index out of range: -11
	at java.lang.String.<init>(String.java:197)
	at org.apache.commons.lang3.text.StrBuilder.toString(StrBuilder.java:606)
	at org.apache.commons.lang3.text.StrSubstitutor.replace(StrSubstitutor.java:598)
	at org.apache.commons.lang3.text.StrSubstitutor.replace(StrSubstitutor.java:181)
	at org.apache.commons.lang3.text.StrSubstitutorTest.testStaticReplace(StrSubstitutorTest.java:563)

testReplaceUnknownKey(org.apache.commons.lang3.text.StrSubstitutorTest)  Time elapsed: 0 sec  <<< ERROR!
java.lang.StringIndexOutOfBoundsException: end < start
	at org.apache.commons.lang3.text.StrBuilder.validateRange(StrBuilder.java:612)
	at org.apache.commons.lang3.text.StrBuilder.replace(StrBuilder.java:412)
	at org.apache.commons.lang3.text.StrSubstitutor.substitute(StrSubstitutor.java:851)
	at org.apache.commons.lang3.text.StrSubstitutor.substitute(StrSubstitutor.java:735)
	at org.apache.commons.lang3.text.StrSubstitutor.replace(StrSubstitutor.java:395)
	at org.apache.commons.lang3.text.StrSubstitutorTest.doTestReplace(StrSubstitutorTest.java:634)
	at org.apache.commons.lang3.text.StrSubstitutorTest.testReplaceUnknownKey(StrSubstitutorTest.java:113)

testReplaceNoPrefixNoSuffix(org.apache.commons.lang3.text.StrSubstitutorTest)  Time elapsed: 0.001 sec  <<< ERROR!
java.lang.StringIndexOutOfBoundsException: end < start
	at org.apache.commons.lang3.text.StrBuilder.validateRange(StrBuilder.java:612)
	at org.apache.commons.lang3.text.StrBuilder.replace(StrBuilder.java:412)
	at org.apache.commons.lang3.text.StrSubstitutor.substitute(StrSubstitutor.java:851)
	at org.apache.commons.lang3.text.StrSubstitutor.substitute(StrSubstitutor.java:735)
	at org.apache.commons.lang3.text.StrSubstitutor.replace(StrSubstitutor.java:395)
	at org.apache.commons.lang3.text.StrSubstitutorTest.doTestReplace(StrSubstitutorTest.java:634)
	at org.apache.commons.lang3.text.StrSubstitutorTest.testReplaceNoPrefixNoSuffix(StrSubstitutorTest.java:188)

testStaticReplaceSystemProperties(org.apache.commons.lang3.text.StrSubstitutorTest)  Time elapsed: 0 sec  <<< ERROR!
java.lang.ArrayIndexOutOfBoundsException: null
	at java.lang.String.getChars(String.java:826)
	at org.apache.commons.lang3.text.StrBuilder.append(StrBuilder.java:128)
	at org.apache.commons.lang3.text.StrSubstitutorTest.testStaticReplaceSystemProperties(StrSubstitutorTest.java:582)

testReplaceInVariableRecursive(org.apache.commons.lang3.text.StrSubstitutorTest)  Time elapsed: 0.001 sec  <<< ERROR!
java.lang.StringIndexOutOfBoundsException: String index out of range: -26
	at java.lang.String.<init>(String.java:197)
	at org.apache.commons.lang3.text.StrBuilder.toString(StrBuilder.java:606)
	at org.apache.commons.lang3.text.StrSubstitutor.substitute(StrSubstitutor.java:806)
	at org.apache.commons.lang3.text.StrSubstitutor.substitute(StrSubstitutor.java:735)
	at org.apache.commons.lang3.text.StrSubstitutor.replace(StrSubstitutor.java:395)
	at org.apache.commons.lang3.text.StrSubstitutorTest.testReplaceInVariableRecursive(StrSubstitutorTest.java:357)

testReplaceAdjacentAtEnd(org.apache.commons.lang3.text.StrSubstitutorTest)  Time elapsed: 0 sec  <<< ERROR!
java.lang.StringIndexOutOfBoundsException: end < start
	at org.apache.commons.lang3.text.StrBuilder.validateRange(StrBuilder.java:612)
	at org.apache.commons.lang3.text.StrBuilder.replace(StrBuilder.java:412)
	at org.apache.commons.lang3.text.StrSubstitutor.substitute(StrSubstitutor.java:851)
	at org.apache.commons.lang3.text.StrSubstitutor.substitute(StrSubstitutor.java:735)
	at org.apache.commons.lang3.text.StrSubstitutor.replace(StrSubstitutor.java:395)
	at org.apache.commons.lang3.text.StrSubstitutorTest.testReplaceAdjacentAtEnd(StrSubstitutorTest.java:136)

testReplaceSolo(org.apache.commons.lang3.text.StrSubstitutorTest)  Time elapsed: 0 sec  <<< ERROR!
java.lang.StringIndexOutOfBoundsException: end < start
	at org.apache.commons.lang3.text.StrBuilder.validateRange(StrBuilder.java:612)
	at org.apache.commons.lang3.text.StrBuilder.replace(StrBuilder.java:412)
	at org.apache.commons.lang3.text.StrSubstitutor.substitute(StrSubstitutor.java:851)
	at org.apache.commons.lang3.text.StrSubstitutor.substitute(StrSubstitutor.java:735)
	at org.apache.commons.lang3.text.StrSubstitutor.replace(StrSubstitutor.java:395)
	at org.apache.commons.lang3.text.StrSubstitutorTest.doTestReplace(StrSubstitutorTest.java:634)
	at org.apache.commons.lang3.text.StrSubstitutorTest.testReplaceSolo(StrSubstitutorTest.java:71)

testLANG1055(org.apache.commons.lang3.text.StrSubstitutorTest)  Time elapsed: 0 sec  <<< ERROR!
java.lang.StringIndexOutOfBoundsException: String index out of range: -20
	at java.lang.String.<init>(String.java:197)
	at org.apache.commons.lang3.text.StrBuilder.toString(StrBuilder.java:606)
	at org.apache.commons.lang3.text.StrSubstitutor.replace(StrSubstitutor.java:598)
	at org.apache.commons.lang3.text.StrSubstitutor.replace(StrSubstitutor.java:181)
	at org.apache.commons.lang3.text.StrSubstitutor.replace(StrSubstitutor.java:220)
	at org.apache.commons.lang3.text.StrSubstitutorTest.testLANG1055(StrSubstitutorTest.java:599)

testReplaceChangedMap(org.apache.commons.lang3.text.StrSubstitutorTest)  Time elapsed: 0 sec  <<< ERROR!
java.lang.StringIndexOutOfBoundsException: end < start
	at org.apache.commons.lang3.text.StrBuilder.validateRange(StrBuilder.java:612)
	at org.apache.commons.lang3.text.StrBuilder.replace(StrBuilder.java:412)
	at org.apache.commons.lang3.text.StrSubstitutor.substitute(StrSubstitutor.java:851)
	at org.apache.commons.lang3.text.StrSubstitutor.substitute(StrSubstitutor.java:735)
	at org.apache.commons.lang3.text.StrSubstitutor.replace(StrSubstitutor.java:395)
	at org.apache.commons.lang3.text.StrSubstitutorTest.testReplaceChangedMap(StrSubstitutorTest.java:105)

testReplaceWeirdPattens(org.apache.commons.lang3.text.StrSubstitutorTest)  Time elapsed: 0.001 sec  <<< ERROR!
java.lang.StringIndexOutOfBoundsException: String index out of range: -3
	at java.lang.String.<init>(String.java:197)
	at org.apache.commons.lang3.text.StrBuilder.toString(StrBuilder.java:606)
	at org.apache.commons.lang3.text.StrSubstitutorTest.doTestNoReplace(StrSubstitutorTest.java:723)
	at org.apache.commons.lang3.text.StrSubstitutorTest.testReplaceWeirdPattens(StrSubstitutorTest.java:274)

testReplaceEmptyKeys(org.apache.commons.lang3.text.StrSubstitutorTest)  Time elapsed: 0.001 sec  <<< ERROR!
java.lang.StringIndexOutOfBoundsException: end < start
	at org.apache.commons.lang3.text.StrBuilder.validateRange(StrBuilder.java:612)
	at org.apache.commons.lang3.text.StrBuilder.replace(StrBuilder.java:412)
	at org.apache.commons.lang3.text.StrSubstitutor.substitute(StrSubstitutor.java:851)
	at org.apache.commons.lang3.text.StrSubstitutor.substitute(StrSubstitutor.java:735)
	at org.apache.commons.lang3.text.StrSubstitutor.replace(StrSubstitutor.java:395)
	at org.apache.commons.lang3.text.StrSubstitutorTest.doTestReplace(StrSubstitutorTest.java:634)
	at org.apache.commons.lang3.text.StrSubstitutorTest.testReplaceEmptyKeys(StrSubstitutorTest.java:220)

testDefaultValueDelimiters(org.apache.commons.lang3.text.StrSubstitutorTest)  Time elapsed: 0.001 sec  <<< ERROR!
java.lang.StringIndexOutOfBoundsException: end < start
	at org.apache.commons.lang3.text.StrBuilder.validateRange(StrBuilder.java:612)
	at org.apache.commons.lang3.text.StrBuilder.replace(StrBuilder.java:412)
	at org.apache.commons.lang3.text.StrSubstitutor.substitute(StrSubstitutor.java:851)
	at org.apache.commons.lang3.text.StrSubstitutor.substitute(StrSubstitutor.java:735)
	at org.apache.commons.lang3.text.StrSubstitutor.replace(StrSubstitutor.java:395)
	at org.apache.commons.lang3.text.StrSubstitutorTest.testDefaultValueDelimiters(StrSubstitutorTest.java:374)

testReplaceNoVariables(org.apache.commons.lang3.text.StrSubstitutorTest)  Time elapsed: 0 sec  <<< ERROR!
java.lang.StringIndexOutOfBoundsException: String index out of range: -20
	at java.lang.String.<init>(String.java:197)
	at org.apache.commons.lang3.text.StrBuilder.toString(StrBuilder.java:606)
	at org.apache.commons.lang3.text.StrSubstitutorTest.doTestNoReplace(StrSubstitutorTest.java:723)
	at org.apache.commons.lang3.text.StrSubstitutorTest.testReplaceNoVariables(StrSubstitutorTest.java:79)

testReplaceComplexEscaping(org.apache.commons.lang3.text.StrSubstitutorTest)  Time elapsed: 0 sec  <<< ERROR!
java.lang.StringIndexOutOfBoundsException: String index out of range: 4
	at org.apache.commons.lang3.text.StrBuilder.deleteCharAt(StrBuilder.java:70)
	at org.apache.commons.lang3.text.StrSubstitutor.substitute(StrSubstitutor.java:772)
	at org.apache.commons.lang3.text.StrSubstitutor.substitute(StrSubstitutor.java:735)
	at org.apache.commons.lang3.text.StrSubstitutor.replace(StrSubstitutor.java:395)
	at org.apache.commons.lang3.text.StrSubstitutorTest.doTestReplace(StrSubstitutorTest.java:634)
	at org.apache.commons.lang3.text.StrSubstitutorTest.testReplaceComplexEscaping(StrSubstitutorTest.java:179)

testReplaceInVariable(org.apache.commons.lang3.text.StrSubstitutorTest)  Time elapsed: 0.001 sec  <<< ERROR!
java.lang.StringIndexOutOfBoundsException: String index out of range: -17
	at java.lang.String.<init>(String.java:197)
	at org.apache.commons.lang3.text.StrBuilder.toString(StrBuilder.java:606)
	at org.apache.commons.lang3.text.StrSubstitutor.substitute(StrSubstitutor.java:806)
	at org.apache.commons.lang3.text.StrSubstitutor.substitute(StrSubstitutor.java:735)
	at org.apache.commons.lang3.text.StrSubstitutor.replace(StrSubstitutor.java:395)
	at org.apache.commons.lang3.text.StrSubstitutorTest.testReplaceInVariable(StrSubstitutorTest.java:311)

testReplacePrefixNoSuffix(org.apache.commons.lang3.text.StrSubstitutorTest)  Time elapsed: 0.001 sec  <<< ERROR!
java.lang.StringIndexOutOfBoundsException: end < start
	at org.apache.commons.lang3.text.StrBuilder.validateRange(StrBuilder.java:612)
	at org.apache.commons.lang3.text.StrBuilder.replace(StrBuilder.java:412)
	at org.apache.commons.lang3.text.StrSubstitutor.substitute(StrSubstitutor.java:851)
	at org.apache.commons.lang3.text.StrSubstitutor.substitute(StrSubstitutor.java:735)
	at org.apache.commons.lang3.text.StrSubstitutor.replace(StrSubstitutor.java:395)
	at org.apache.commons.lang3.text.StrSubstitutorTest.doTestReplace(StrSubstitutorTest.java:634)
	at org.apache.commons.lang3.text.StrSubstitutorTest.testReplacePrefixNoSuffix(StrSubstitutorTest.java:204)

testResolveVariable(org.apache.commons.lang3.text.StrSubstitutorTest)  Time elapsed: 0 sec  <<< ERROR!
java.lang.StringIndexOutOfBoundsException: String index out of range: -11
	at java.lang.String.<init>(String.java:197)
	at org.apache.commons.lang3.text.StrBuilder.toString(StrBuilder.java:606)
	at org.apache.commons.lang3.text.StrSubstitutorTest.testResolveVariable(StrSubstitutorTest.java:420)

testReplaceInVariableDisabled(org.apache.commons.lang3.text.StrSubstitutorTest)  Time elapsed: 0 sec  <<< ERROR!
java.lang.StringIndexOutOfBoundsException: end < start
	at org.apache.commons.lang3.text.StrBuilder.validateRange(StrBuilder.java:612)
	at org.apache.commons.lang3.text.StrBuilder.replace(StrBuilder.java:412)
	at org.apache.commons.lang3.text.StrSubstitutor.substitute(StrSubstitutor.java:851)
	at org.apache.commons.lang3.text.StrSubstitutor.substitute(StrSubstitutor.java:735)
	at org.apache.commons.lang3.text.StrSubstitutor.replace(StrSubstitutor.java:395)
	at org.apache.commons.lang3.text.StrSubstitutorTest.testReplaceInVariableDisabled(StrSubstitutorTest.java:335)

testReplaceIncompletePrefix(org.apache.commons.lang3.text.StrSubstitutorTest)  Time elapsed: 0 sec  <<< ERROR!
java.lang.StringIndexOutOfBoundsException: end < start
	at org.apache.commons.lang3.text.StrBuilder.validateRange(StrBuilder.java:612)
	at org.apache.commons.lang3.text.StrBuilder.replace(StrBuilder.java:412)
	at org.apache.commons.lang3.text.StrSubstitutor.substitute(StrSubstitutor.java:851)
	at org.apache.commons.lang3.text.StrSubstitutor.substitute(StrSubstitutor.java:735)
	at org.apache.commons.lang3.text.StrSubstitutor.replace(StrSubstitutor.java:395)
	at org.apache.commons.lang3.text.StrSubstitutorTest.doTestReplace(StrSubstitutorTest.java:634)
	at org.apache.commons.lang3.text.StrSubstitutorTest.testReplaceIncompletePrefix(StrSubstitutorTest.java:196)

testReplaceAdjacentAtStart(org.apache.commons.lang3.text.StrSubstitutorTest)  Time elapsed: 0 sec  <<< ERROR!
java.lang.StringIndexOutOfBoundsException: end < start
	at org.apache.commons.lang3.text.StrBuilder.validateRange(StrBuilder.java:612)
	at org.apache.commons.lang3.text.StrBuilder.replace(StrBuilder.java:412)
	at org.apache.commons.lang3.text.StrSubstitutor.substitute(StrSubstitutor.java:851)
	at org.apache.commons.lang3.text.StrSubstitutor.substitute(StrSubstitutor.java:735)
	at org.apache.commons.lang3.text.StrSubstitutor.replace(StrSubstitutor.java:395)
	at org.apache.commons.lang3.text.StrSubstitutorTest.testReplaceAdjacentAtStart(StrSubstitutorTest.java:125)

testConstructorMapFull(org.apache.commons.lang3.text.StrSubstitutorTest)  Time elapsed: 0 sec  <<< ERROR!
java.lang.StringIndexOutOfBoundsException: String index out of range: 3
	at org.apache.commons.lang3.text.StrBuilder.deleteCharAt(StrBuilder.java:70)
	at org.apache.commons.lang3.text.StrSubstitutor.substitute(StrSubstitutor.java:772)
	at org.apache.commons.lang3.text.StrSubstitutor.substitute(StrSubstitutor.java:735)
	at org.apache.commons.lang3.text.StrSubstitutor.replace(StrSubstitutor.java:395)
	at org.apache.commons.lang3.text.StrSubstitutorTest.testConstructorMapFull(StrSubstitutorTest.java:452)

Running org.apache.commons.lang3.text.StrBuilderTest
Tests run: 90, Failures: 26, Errors: 48, Skipped: 0, Time elapsed: 0.133 sec <<< FAILURE! - in org.apache.commons.lang3.text.StrBuilderTest
testAsTokenizer(org.apache.commons.lang3.text.StrBuilderTest)  Time elapsed: 0 sec  <<< FAILURE!
java.lang.AssertionError: expected:<2> but was:<0>
	at org.junit.Assert.fail(Assert.java:88)
	at org.junit.Assert.failNotEquals(Assert.java:834)
	at org.junit.Assert.assertEquals(Assert.java:645)
	at org.junit.Assert.assertEquals(Assert.java:631)
	at org.apache.commons.lang3.text.StrBuilderTest.testAsTokenizer(StrBuilderTest.java:1666)

testDeleteFirst_StrMatcher(org.apache.commons.lang3.text.StrBuilderTest)  Time elapsed: 0 sec  <<< ERROR!
java.lang.StringIndexOutOfBoundsException: end < start
	at org.apache.commons.lang3.text.StrBuilder.validateRange(StrBuilder.java:612)
	at org.apache.commons.lang3.text.StrBuilder.replace(StrBuilder.java:438)
	at org.apache.commons.lang3.text.StrBuilder.deleteFirst(StrBuilder.java:406)
	at org.apache.commons.lang3.text.StrBuilderTest.testDeleteFirst_StrMatcher(StrBuilderTest.java:726)

testReplaceFirst_StrMatcher_String(org.apache.commons.lang3.text.StrBuilderTest)  Time elapsed: 0.001 sec  <<< ERROR!
java.lang.StringIndexOutOfBoundsException: end < start
	at org.apache.commons.lang3.text.StrBuilder.validateRange(StrBuilder.java:612)
	at org.apache.commons.lang3.text.StrBuilder.replace(StrBuilder.java:438)
	at org.apache.commons.lang3.text.StrBuilder.replaceFirst(StrBuilder.java:437)
	at org.apache.commons.lang3.text.StrBuilderTest.testReplaceFirst_StrMatcher_String(StrBuilderTest.java:907)

testDeleteAll_String(org.apache.commons.lang3.text.StrBuilderTest)  Time elapsed: 0 sec  <<< ERROR!
java.lang.StringIndexOutOfBoundsException: String index out of range: -8
	at java.lang.String.<init>(String.java:197)
	at org.apache.commons.lang3.text.StrBuilder.toString(StrBuilder.java:606)
	at org.apache.commons.lang3.text.StrBuilderTest.testDeleteAll_String(StrBuilderTest.java:657)

testEndsWith(org.apache.commons.lang3.text.StrBuilderTest)  Time elapsed: 0 sec  <<< FAILURE!
java.lang.AssertionError: null
	at org.junit.Assert.fail(Assert.java:86)
	at org.junit.Assert.assertTrue(Assert.java:41)
	at org.junit.Assert.assertTrue(Assert.java:52)
	at org.apache.commons.lang3.text.StrBuilderTest.testEndsWith(StrBuilderTest.java:1184)

testReadFromReaderAppendsToEnd(org.apache.commons.lang3.text.StrBuilderTest)  Time elapsed: 0.002 sec  <<< ERROR!
java.lang.IndexOutOfBoundsException: null
	at java.io.StringReader.read(StringReader.java:93)
	at org.apache.commons.lang3.text.StrBuilder.readFrom(StrBuilder.java:95)
	at org.apache.commons.lang3.text.StrBuilderTest.testReadFromReaderAppendsToEnd(StrBuilderTest.java:117)

testSubSequenceIntInt(org.apache.commons.lang3.text.StrBuilderTest)  Time elapsed: 0 sec  <<< ERROR!
java.lang.StringIndexOutOfBoundsException: String index out of range: 5
	at org.apache.commons.lang3.text.StrBuilder.subSequence(StrBuilder.java:487)
	at org.apache.commons.lang3.text.StrBuilderTest.testSubSequenceIntInt(StrBuilderTest.java:1222)

testGetChars(org.apache.commons.lang3.text.StrBuilderTest)  Time elapsed: 0 sec  <<< ERROR!
java.lang.ArrayIndexOutOfBoundsException: null
	at java.lang.System.arraycopy(Native Method)
	at org.apache.commons.lang3.text.StrBuilder.getChars(StrBuilder.java:85)
	at org.apache.commons.lang3.text.StrBuilderTest.testGetChars(StrBuilderTest.java:528)

testLastIndexOf_String(org.apache.commons.lang3.text.StrBuilderTest)  Time elapsed: 0 sec  <<< FAILURE!
java.lang.AssertionError: expected:<2> but was:<-1>
	at org.junit.Assert.fail(Assert.java:88)
	at org.junit.Assert.failNotEquals(Assert.java:834)
	at org.junit.Assert.assertEquals(Assert.java:645)
	at org.junit.Assert.assertEquals(Assert.java:631)
	at org.apache.commons.lang3.text.StrBuilderTest.testLastIndexOf_String(StrBuilderTest.java:1470)

testDeleteAll_char(org.apache.commons.lang3.text.StrBuilderTest)  Time elapsed: 0 sec  <<< ERROR!
java.lang.StringIndexOutOfBoundsException: String index out of range: -8
	at java.lang.String.<init>(String.java:197)
	at org.apache.commons.lang3.text.StrBuilder.toString(StrBuilder.java:606)
	at org.apache.commons.lang3.text.StrBuilderTest.testDeleteAll_char(StrBuilderTest.java:622)

testReplace_StrMatcher_String_int_int_int_VaryEndIndex(org.apache.commons.lang3.text.StrBuilderTest)  Time elapsed: 0.001 sec  <<< ERROR!
java.lang.StringIndexOutOfBoundsException: end < start
	at org.apache.commons.lang3.text.StrBuilder.validateRange(StrBuilder.java:612)
	at org.apache.commons.lang3.text.StrBuilder.replace(StrBuilder.java:438)
	at org.apache.commons.lang3.text.StrBuilderTest.testReplace_StrMatcher_String_int_int_int_VaryEndIndex(StrBuilderTest.java:1047)

testLastIndexOf_char_int(org.apache.commons.lang3.text.StrBuilderTest)  Time elapsed: 0 sec  <<< FAILURE!
java.lang.AssertionError: expected:<0> but was:<-1>
	at org.junit.Assert.fail(Assert.java:88)
	at org.junit.Assert.failNotEquals(Assert.java:834)
	at org.junit.Assert.assertEquals(Assert.java:645)
	at org.junit.Assert.assertEquals(Assert.java:631)
	at org.apache.commons.lang3.text.StrBuilderTest.testLastIndexOf_char_int(StrBuilderTest.java:1389)

testAppendToStringBuffer(org.apache.commons.lang3.text.StrBuilderTest)  Time elapsed: 0 sec  <<< ERROR!
java.lang.ArrayIndexOutOfBoundsException: null
	at java.lang.AbstractStringBuilder.append(AbstractStringBuilder.java:536)
	at java.lang.StringBuffer.append(StringBuffer.java:322)
	at org.apache.commons.lang3.text.StrBuilder.appendTo(StrBuilder.java:577)
	at org.apache.commons.lang3.text.StrBuilderTest.testAppendToStringBuffer(StrBuilderTest.java:1983)

testSize(org.apache.commons.lang3.text.StrBuilderTest)  Time elapsed: 0.001 sec  <<< FAILURE!
java.lang.AssertionError: expected:<5> but was:<-5>
	at org.junit.Assert.fail(Assert.java:88)
	at org.junit.Assert.failNotEquals(Assert.java:834)
	at org.junit.Assert.assertEquals(Assert.java:645)
	at org.junit.Assert.assertEquals(Assert.java:631)
	at org.apache.commons.lang3.text.StrBuilderTest.testSize(StrBuilderTest.java:368)

testTrim(org.apache.commons.lang3.text.StrBuilderTest)  Time elapsed: 0 sec  <<< ERROR!
java.lang.StringIndexOutOfBoundsException: String index out of range: -3
	at java.lang.String.<init>(String.java:197)
	at org.apache.commons.lang3.text.StrBuilder.toString(StrBuilder.java:606)
	at org.apache.commons.lang3.text.StrBuilderTest.testTrim(StrBuilderTest.java:1147)

testRightString(org.apache.commons.lang3.text.StrBuilderTest)  Time elapsed: 0 sec  <<< ERROR!
java.lang.StringIndexOutOfBoundsException: String index out of range: -10
	at java.lang.String.<init>(String.java:197)
	at org.apache.commons.lang3.text.StrBuilder.rightString(StrBuilder.java:497)
	at org.apache.commons.lang3.text.StrBuilderTest.testRightString(StrBuilderTest.java:1284)

testToString(org.apache.commons.lang3.text.StrBuilderTest)  Time elapsed: 0 sec  <<< ERROR!
java.lang.StringIndexOutOfBoundsException: String index out of range: -3
	at java.lang.String.<init>(String.java:197)
	at org.apache.commons.lang3.text.StrBuilder.toString(StrBuilder.java:606)
	at org.apache.commons.lang3.text.StrBuilderTest.testToString(StrBuilderTest.java:1873)

testConstructors(org.apache.commons.lang3.text.StrBuilderTest)  Time elapsed: 0.001 sec  <<< FAILURE!
java.lang.AssertionError: expected:<3> but was:<-3>
	at org.junit.Assert.fail(Assert.java:88)
	at org.junit.Assert.failNotEquals(Assert.java:834)
	at org.junit.Assert.assertEquals(Assert.java:645)
	at org.junit.Assert.assertEquals(Assert.java:631)
	at org.apache.commons.lang3.text.StrBuilderTest.testConstructors(StrBuilderTest.java:80)

testMinimizeCapacity(org.apache.commons.lang3.text.StrBuilderTest)  Time elapsed: 0.002 sec  <<< ERROR!
java.lang.NegativeArraySizeException: null
	at org.apache.commons.lang3.text.StrBuilder.minimizeCapacity(StrBuilder.java:58)
	at org.apache.commons.lang3.text.StrBuilderTest.testMinimizeCapacity(StrBuilderTest.java:357)

testSubstringIntInt(org.apache.commons.lang3.text.StrBuilderTest)  Time elapsed: 0 sec  <<< ERROR!
java.lang.StringIndexOutOfBoundsException: end < start
	at org.apache.commons.lang3.text.StrBuilder.validateRange(StrBuilder.java:612)
	at org.apache.commons.lang3.text.StrBuilder.substring(StrBuilder.java:491)
	at org.apache.commons.lang3.text.StrBuilderTest.testSubstringIntInt(StrBuilderTest.java:1250)

testContains_String(org.apache.commons.lang3.text.StrBuilderTest)  Time elapsed: 0.002 sec  <<< FAILURE!
java.lang.AssertionError: null
	at org.junit.Assert.fail(Assert.java:86)
	at org.junit.Assert.assertTrue(Assert.java:41)
	at org.junit.Assert.assertTrue(Assert.java:52)
	at org.apache.commons.lang3.text.StrBuilderTest.testContains_String(StrBuilderTest.java:1312)

testCapacityAndLength(org.apache.commons.lang3.text.StrBuilderTest)  Time elapsed: 0 sec  <<< FAILURE!
java.lang.AssertionError: expected:<3> but was:<-3>
	at org.junit.Assert.fail(Assert.java:88)
	at org.junit.Assert.failNotEquals(Assert.java:834)
	at org.junit.Assert.assertEquals(Assert.java:645)
	at org.junit.Assert.assertEquals(Assert.java:631)
	at org.apache.commons.lang3.text.StrBuilderTest.testCapacityAndLength(StrBuilderTest.java:235)

testReadFromReadableAppendsToEnd(org.apache.commons.lang3.text.StrBuilderTest)  Time elapsed: 0 sec  <<< ERROR!
java.lang.IndexOutOfBoundsException: null
	at java.nio.CharBuffer.wrap(CharBuffer.java:371)
	at org.apache.commons.lang3.text.StrBuilder.readFrom(StrBuilder.java:103)
	at org.apache.commons.lang3.text.StrBuilderTest.testReadFromReadableAppendsToEnd(StrBuilderTest.java:159)

testAsReader(org.apache.commons.lang3.text.StrBuilderTest)  Time elapsed: 0 sec  <<< FAILURE!
java.lang.AssertionError: null
	at org.junit.Assert.fail(Assert.java:86)
	at org.junit.Assert.assertTrue(Assert.java:41)
	at org.junit.Assert.assertTrue(Assert.java:52)
	at org.apache.commons.lang3.text.StrBuilderTest.testAsReader(StrBuilderTest.java:1701)

testToStringBuilder(org.apache.commons.lang3.text.StrBuilderTest)  Time elapsed: 0.001 sec  <<< ERROR!
java.lang.NegativeArraySizeException: null
	at java.lang.AbstractStringBuilder.<init>(AbstractStringBuilder.java:64)
	at java.lang.StringBuilder.<init>(StringBuilder.java:97)
	at org.apache.commons.lang3.text.StrBuilder.toStringBuilder(StrBuilder.java:608)
	at org.apache.commons.lang3.text.StrBuilderTest.testToStringBuilder(StrBuilderTest.java:1893)

testReplaceAll_String_String(org.apache.commons.lang3.text.StrBuilderTest)  Time elapsed: 0.001 sec  <<< ERROR!
java.lang.StringIndexOutOfBoundsException: String index out of range: -8
	at java.lang.String.<init>(String.java:197)
	at org.apache.commons.lang3.text.StrBuilder.toString(StrBuilder.java:606)
	at org.apache.commons.lang3.text.StrBuilderTest.testReplaceAll_String_String(StrBuilderTest.java:813)

testAsWriter(org.apache.commons.lang3.text.StrBuilderTest)  Time elapsed: 0.011 sec  <<< ERROR!
java.lang.ArrayIndexOutOfBoundsException: -4
	at org.apache.commons.lang3.text.StrBuilder.append(StrBuilder.java:232)
	at org.apache.commons.lang3.text.StrBuilder$StrBuilderWriter.write(StrBuilder.java:642)
	at org.apache.commons.lang3.text.StrBuilderTest.testAsWriter(StrBuilderTest.java:1774)

testLang294(org.apache.commons.lang3.text.StrBuilderTest)  Time elapsed: 0.001 sec  <<< ERROR!
java.lang.StringIndexOutOfBoundsException: String index out of range: -45
	at java.lang.String.<init>(String.java:197)
	at org.apache.commons.lang3.text.StrBuilder.toString(StrBuilder.java:606)
	at org.apache.commons.lang3.text.StrBuilderTest.testLang294(StrBuilderTest.java:1901)

testReplaceAll_char_char(org.apache.commons.lang3.text.StrBuilderTest)  Time elapsed: 0.001 sec  <<< ERROR!
java.lang.StringIndexOutOfBoundsException: String index out of range: -8
	at java.lang.String.<init>(String.java:197)
	at org.apache.commons.lang3.text.StrBuilder.toString(StrBuilder.java:606)
	at org.apache.commons.lang3.text.StrBuilderTest.testReplaceAll_char_char(StrBuilderTest.java:781)

testLastIndexOf_String_int(org.apache.commons.lang3.text.StrBuilderTest)  Time elapsed: 0 sec  <<< FAILURE!
java.lang.AssertionError: expected:<0> but was:<-1>
	at org.junit.Assert.fail(Assert.java:88)
	at org.junit.Assert.failNotEquals(Assert.java:834)
	at org.junit.Assert.assertEquals(Assert.java:645)
	at org.junit.Assert.assertEquals(Assert.java:631)
	at org.apache.commons.lang3.text.StrBuilderTest.testLastIndexOf_String_int(StrBuilderTest.java:1493)

testDeleteCharAt(org.apache.commons.lang3.text.StrBuilderTest)  Time elapsed: 0 sec  <<< ERROR!
java.lang.StringIndexOutOfBoundsException: String index out of range: 0
	at org.apache.commons.lang3.text.StrBuilder.deleteCharAt(StrBuilder.java:70)
	at org.apache.commons.lang3.text.StrBuilderTest.testDeleteCharAt(StrBuilderTest.java:459)

testReplaceFirst_String_String(org.apache.commons.lang3.text.StrBuilderTest)  Time elapsed: 0 sec  <<< ERROR!
java.lang.StringIndexOutOfBoundsException: String index out of range: -8
	at java.lang.String.<init>(String.java:197)
	at org.apache.commons.lang3.text.StrBuilder.toString(StrBuilder.java:606)
	at org.apache.commons.lang3.text.StrBuilderTest.testReplaceFirst_String_String(StrBuilderTest.java:843)

testContains_char(org.apache.commons.lang3.text.StrBuilderTest)  Time elapsed: 0.006 sec  <<< FAILURE!
java.lang.AssertionError: null
	at org.junit.Assert.fail(Assert.java:86)
	at org.junit.Assert.assertTrue(Assert.java:41)
	at org.junit.Assert.assertTrue(Assert.java:52)
	at org.apache.commons.lang3.text.StrBuilderTest.testContains_char(StrBuilderTest.java:1303)

testDeleteIntInt(org.apache.commons.lang3.text.StrBuilderTest)  Time elapsed: 0.001 sec  <<< ERROR!
java.lang.StringIndexOutOfBoundsException: end < start
	at org.apache.commons.lang3.text.StrBuilder.validateRange(StrBuilder.java:612)
	at org.apache.commons.lang3.text.StrBuilder.delete(StrBuilder.java:379)
	at org.apache.commons.lang3.text.StrBuilderTest.testDeleteIntInt(StrBuilderTest.java:592)

testReplace_StrMatcher_String_int_int_int_VaryCount(org.apache.commons.lang3.text.StrBuilderTest)  Time elapsed: 0 sec  <<< ERROR!
java.lang.StringIndexOutOfBoundsException: end < start
	at org.apache.commons.lang3.text.StrBuilder.validateRange(StrBuilder.java:612)
	at org.apache.commons.lang3.text.StrBuilder.replace(StrBuilder.java:438)
	at org.apache.commons.lang3.text.StrBuilderTest.testReplace_StrMatcher_String_int_int_int_VaryCount(StrBuilderTest.java:1101)

testReplaceFirst_char_char(org.apache.commons.lang3.text.StrBuilderTest)  Time elapsed: 0 sec  <<< ERROR!
java.lang.StringIndexOutOfBoundsException: String index out of range: -8
	at java.lang.String.<init>(String.java:197)
	at org.apache.commons.lang3.text.StrBuilder.toString(StrBuilder.java:606)
	at org.apache.commons.lang3.text.StrBuilderTest.testReplaceFirst_char_char(StrBuilderTest.java:797)

testIndexOf_char(org.apache.commons.lang3.text.StrBuilderTest)  Time elapsed: 0 sec  <<< FAILURE!
java.lang.AssertionError: expected:<0> but was:<-1>
	at org.junit.Assert.fail(Assert.java:88)
	at org.junit.Assert.failNotEquals(Assert.java:834)
	at org.junit.Assert.assertEquals(Assert.java:645)
	at org.junit.Assert.assertEquals(Assert.java:631)
	at org.apache.commons.lang3.text.StrBuilderTest.testIndexOf_char(StrBuilderTest.java:1338)

testReplace_int_int_String(org.apache.commons.lang3.text.StrBuilderTest)  Time elapsed: 0.001 sec  <<< ERROR!
java.lang.StringIndexOutOfBoundsException: end < start
	at org.apache.commons.lang3.text.StrBuilder.validateRange(StrBuilder.java:612)
	at org.apache.commons.lang3.text.StrBuilder.replace(StrBuilder.java:412)
	at org.apache.commons.lang3.text.StrBuilderTest.testReplace_int_int_String(StrBuilderTest.java:744)

testToCharArray(org.apache.commons.lang3.text.StrBuilderTest)  Time elapsed: 0 sec  <<< ERROR!
java.lang.NegativeArraySizeException: null
	at org.apache.commons.lang3.text.StrBuilder.toCharArray(StrBuilder.java:74)
	at org.apache.commons.lang3.text.StrBuilderTest.testToCharArray(StrBuilderTest.java:479)

testLastIndexOf_StrMatcher(org.apache.commons.lang3.text.StrBuilderTest)  Time elapsed: 0.001 sec  <<< FAILURE!
java.lang.AssertionError: expected:<0> but was:<-1>
	at org.junit.Assert.fail(Assert.java:88)
	at org.junit.Assert.failNotEquals(Assert.java:834)
	at org.junit.Assert.assertEquals(Assert.java:645)
	at org.junit.Assert.assertEquals(Assert.java:631)
	at org.apache.commons.lang3.text.StrBuilderTest.testLastIndexOf_StrMatcher(StrBuilderTest.java:1592)

testIndexOf_StrMatcher_int(org.apache.commons.lang3.text.StrBuilderTest)  Time elapsed: 0.001 sec  <<< FAILURE!
java.lang.AssertionError: expected:<0> but was:<-1>
	at org.junit.Assert.fail(Assert.java:88)
	at org.junit.Assert.failNotEquals(Assert.java:834)
	at org.junit.Assert.assertEquals(Assert.java:645)
	at org.junit.Assert.assertEquals(Assert.java:631)
	at org.apache.commons.lang3.text.StrBuilderTest.testIndexOf_StrMatcher_int(StrBuilderTest.java:1553)

testEnsureCapacity(org.apache.commons.lang3.text.StrBuilderTest)  Time elapsed: 0 sec  <<< ERROR!
java.lang.ArrayIndexOutOfBoundsException: null
	at java.lang.System.arraycopy(Native Method)
	at org.apache.commons.lang3.text.StrBuilder.ensureCapacity(StrBuilder.java:55)
	at org.apache.commons.lang3.text.StrBuilderTest.testEnsureCapacity(StrBuilderTest.java:346)

testDeleteFirst_String(org.apache.commons.lang3.text.StrBuilderTest)  Time elapsed: 0 sec  <<< ERROR!
java.lang.StringIndexOutOfBoundsException: String index out of range: -8
	at java.lang.String.<init>(String.java:197)
	at org.apache.commons.lang3.text.StrBuilder.toString(StrBuilder.java:606)
	at org.apache.commons.lang3.text.StrBuilderTest.testDeleteFirst_String(StrBuilderTest.java:683)

testAppendToStringBuilder(org.apache.commons.lang3.text.StrBuilderTest)  Time elapsed: 0.005 sec  <<< ERROR!
java.lang.ArrayIndexOutOfBoundsException: null
	at java.lang.AbstractStringBuilder.append(AbstractStringBuilder.java:536)
	at java.lang.StringBuilder.append(StringBuilder.java:204)
	at org.apache.commons.lang3.text.StrBuilder.appendTo(StrBuilder.java:576)
	at org.apache.commons.lang3.text.StrBuilderTest.testAppendToStringBuilder(StrBuilderTest.java:1973)

testMidString(org.apache.commons.lang3.text.StrBuilderTest)  Time elapsed: 0 sec  <<< FAILURE!
org.junit.ComparisonFailure: expected:<[goodbye]> but was:<[]>
	at org.junit.Assert.assertEquals(Assert.java:115)
	at org.junit.Assert.assertEquals(Assert.java:144)
	at org.apache.commons.lang3.text.StrBuilderTest.testMidString(StrBuilderTest.java:1273)

testReplaceAll_StrMatcher_String(org.apache.commons.lang3.text.StrBuilderTest)  Time elapsed: 0 sec  <<< ERROR!
java.lang.StringIndexOutOfBoundsException: end < start
	at org.apache.commons.lang3.text.StrBuilder.validateRange(StrBuilder.java:612)
	at org.apache.commons.lang3.text.StrBuilder.replace(StrBuilder.java:438)
	at org.apache.commons.lang3.text.StrBuilder.replaceAll(StrBuilder.java:436)
	at org.apache.commons.lang3.text.StrBuilderTest.testReplaceAll_StrMatcher_String(StrBuilderTest.java:873)

testReadFromCharBufferAppendsToEnd(org.apache.commons.lang3.text.StrBuilderTest)  Time elapsed: 0.002 sec  <<< ERROR!
java.lang.IndexOutOfBoundsException: null
	at java.nio.Buffer.checkBounds(Buffer.java:559)
	at java.nio.CharBuffer.get(CharBuffer.java:668)
	at org.apache.commons.lang3.text.StrBuilder.readFrom(StrBuilder.java:100)
	at org.apache.commons.lang3.text.StrBuilderTest.testReadFromCharBufferAppendsToEnd(StrBuilderTest.java:138)

testSetCharAt(org.apache.commons.lang3.text.StrBuilderTest)  Time elapsed: 0 sec  <<< ERROR!
java.lang.StringIndexOutOfBoundsException: String index out of range: 0
	at org.apache.commons.lang3.text.StrBuilder.setCharAt(StrBuilder.java:67)
	at org.apache.commons.lang3.text.StrBuilderTest.testSetCharAt(StrBuilderTest.java:443)

testReplace_StrMatcher_String_int_int_int_VaryStartIndex(org.apache.commons.lang3.text.StrBuilderTest)  Time elapsed: 0.001 sec  <<< ERROR!
java.lang.StringIndexOutOfBoundsException: end < start
	at org.apache.commons.lang3.text.StrBuilder.validateRange(StrBuilder.java:612)
	at org.apache.commons.lang3.text.StrBuilder.replace(StrBuilder.java:438)
	at org.apache.commons.lang3.text.StrBuilderTest.testReplace_StrMatcher_String_int_int_int_VaryStartIndex(StrBuilderTest.java:986)

testHashCode(org.apache.commons.lang3.text.StrBuilderTest)  Time elapsed: 0 sec  <<< FAILURE!
java.lang.AssertionError: null
	at org.junit.Assert.fail(Assert.java:86)
	at org.junit.Assert.assertTrue(Assert.java:41)
	at org.junit.Assert.assertTrue(Assert.java:52)
	at org.apache.commons.lang3.text.StrBuilderTest.testHashCode(StrBuilderTest.java:1865)

testSubstringInt(org.apache.commons.lang3.text.StrBuilderTest)  Time elapsed: 0 sec  <<< ERROR!
java.lang.StringIndexOutOfBoundsException: end < start
	at org.apache.commons.lang3.text.StrBuilder.validateRange(StrBuilder.java:612)
	at org.apache.commons.lang3.text.StrBuilder.substring(StrBuilder.java:491)
	at org.apache.commons.lang3.text.StrBuilder.substring(StrBuilder.java:490)
	at org.apache.commons.lang3.text.StrBuilderTest.testSubstringInt(StrBuilderTest.java:1231)

testSetLength(org.apache.commons.lang3.text.StrBuilderTest)  Time elapsed: 0 sec  <<< ERROR!
java.lang.ArrayIndexOutOfBoundsException: -5
	at org.apache.commons.lang3.text.StrBuilder.setLength(StrBuilder.java:50)
	at org.apache.commons.lang3.text.StrBuilderTest.testSetLength(StrBuilderTest.java:311)

testAppendToWriter(org.apache.commons.lang3.text.StrBuilderTest)  Time elapsed: 0.001 sec  <<< ERROR!
java.lang.IndexOutOfBoundsException: null
	at java.io.StringWriter.write(StringWriter.java:90)
	at org.apache.commons.lang3.text.StrBuilder.appendTo(StrBuilder.java:575)
	at org.apache.commons.lang3.text.StrBuilderTest.testAppendToWriter(StrBuilderTest.java:1963)

testCharAt(org.apache.commons.lang3.text.StrBuilderTest)  Time elapsed: 0.001 sec  <<< ERROR!
java.lang.StringIndexOutOfBoundsException: String index out of range: 0
	at org.apache.commons.lang3.text.StrBuilder.charAt(StrBuilder.java:65)
	at org.apache.commons.lang3.text.StrBuilderTest.testCharAt(StrBuilderTest.java:409)

testReplace_StrMatcher_String_int_int_int_VaryMatcher(org.apache.commons.lang3.text.StrBuilderTest)  Time elapsed: 0 sec  <<< ERROR!
java.lang.StringIndexOutOfBoundsException: end < start
	at org.apache.commons.lang3.text.StrBuilder.validateRange(StrBuilder.java:612)
	at org.apache.commons.lang3.text.StrBuilder.replace(StrBuilder.java:438)
	at org.apache.commons.lang3.text.StrBuilderTest.testReplace_StrMatcher_String_int_int_int_VaryMatcher(StrBuilderTest.java:942)

testEquals(org.apache.commons.lang3.text.StrBuilderTest)  Time elapsed: 0.001 sec  <<< FAILURE!
java.lang.AssertionError: null
	at org.junit.Assert.fail(Assert.java:86)
	at org.junit.Assert.assertTrue(Assert.java:41)
	at org.junit.Assert.assertFalse(Assert.java:64)
	at org.junit.Assert.assertFalse(Assert.java:74)
	at org.apache.commons.lang3.text.StrBuilderTest.testEquals(StrBuilderTest.java:1842)

testLastIndexOf_char(org.apache.commons.lang3.text.StrBuilderTest)  Time elapsed: 0.001 sec  <<< FAILURE!
java.lang.AssertionError: expected:<2> but was:<-1>
	at org.junit.Assert.fail(Assert.java:88)
	at org.junit.Assert.failNotEquals(Assert.java:834)
	at org.junit.Assert.assertEquals(Assert.java:645)
	at org.junit.Assert.assertEquals(Assert.java:631)
	at org.apache.commons.lang3.text.StrBuilderTest.testLastIndexOf_char(StrBuilderTest.java:1375)

testLeftString(org.apache.commons.lang3.text.StrBuilderTest)  Time elapsed: 0 sec  <<< ERROR!
java.lang.StringIndexOutOfBoundsException: String index out of range: -10
	at java.lang.String.<init>(String.java:197)
	at org.apache.commons.lang3.text.StrBuilder.leftString(StrBuilder.java:494)
	at org.apache.commons.lang3.text.StrBuilderTest.testLeftString(StrBuilderTest.java:1293)

testIndexOf_String_int(org.apache.commons.lang3.text.StrBuilderTest)  Time elapsed: 0.003 sec  <<< FAILURE!
java.lang.AssertionError: expected:<0> but was:<-1>
	at org.junit.Assert.fail(Assert.java:88)
	at org.junit.Assert.failNotEquals(Assert.java:834)
	at org.junit.Assert.assertEquals(Assert.java:645)
	at org.junit.Assert.assertEquals(Assert.java:631)
	at org.apache.commons.lang3.text.StrBuilderTest.testIndexOf_String_int(StrBuilderTest.java:1432)

testContains_StrMatcher(org.apache.commons.lang3.text.StrBuilderTest)  Time elapsed: 0 sec  <<< FAILURE!
java.lang.AssertionError: null
	at org.junit.Assert.fail(Assert.java:86)
	at org.junit.Assert.assertTrue(Assert.java:41)
	at org.junit.Assert.assertTrue(Assert.java:52)
	at org.apache.commons.lang3.text.StrBuilderTest.testContains_StrMatcher(StrBuilderTest.java:1322)

testLength(org.apache.commons.lang3.text.StrBuilderTest)  Time elapsed: 0.004 sec  <<< FAILURE!
java.lang.AssertionError: expected:<5> but was:<-5>
	at org.junit.Assert.fail(Assert.java:88)
	at org.junit.Assert.failNotEquals(Assert.java:834)
	at org.junit.Assert.assertEquals(Assert.java:645)
	at org.junit.Assert.assertEquals(Assert.java:631)
	at org.apache.commons.lang3.text.StrBuilderTest.testLength(StrBuilderTest.java:304)

testReplace_StrMatcher_String_int_int_int_VaryReplace(org.apache.commons.lang3.text.StrBuilderTest)  Time elapsed: 0.001 sec  <<< ERROR!
java.lang.StringIndexOutOfBoundsException: end < start
	at org.apache.commons.lang3.text.StrBuilder.validateRange(StrBuilder.java:612)
	at org.apache.commons.lang3.text.StrBuilder.replace(StrBuilder.java:438)
	at org.apache.commons.lang3.text.StrBuilderTest.testReplace_StrMatcher_String_int_int_int_VaryReplace(StrBuilderTest.java:963)

testDeleteFirst_char(org.apache.commons.lang3.text.StrBuilderTest)  Time elapsed: 0 sec  <<< ERROR!
java.lang.StringIndexOutOfBoundsException: String index out of range: -5
	at java.lang.String.<init>(String.java:197)
	at org.apache.commons.lang3.text.StrBuilder.toString(StrBuilder.java:606)
	at org.apache.commons.lang3.text.StrBuilderTest.testDeleteFirst_char(StrBuilderTest.java:639)

testAppendToCharBuffer(org.apache.commons.lang3.text.StrBuilderTest)  Time elapsed: 0 sec  <<< ERROR!
java.lang.IllegalArgumentException: null
	at java.nio.CharBuffer.allocate(CharBuffer.java:330)
	at org.apache.commons.lang3.text.StrBuilderTest.testAppendToCharBuffer(StrBuilderTest.java:1992)

testDeleteAll_StrMatcher(org.apache.commons.lang3.text.StrBuilderTest)  Time elapsed: 0.001 sec  <<< ERROR!
java.lang.StringIndexOutOfBoundsException: end < start
	at org.apache.commons.lang3.text.StrBuilder.validateRange(StrBuilder.java:612)
	at org.apache.commons.lang3.text.StrBuilder.replace(StrBuilder.java:438)
	at org.apache.commons.lang3.text.StrBuilder.deleteAll(StrBuilder.java:405)
	at org.apache.commons.lang3.text.StrBuilderTest.testDeleteAll_StrMatcher(StrBuilderTest.java:709)

testToCharArrayIntInt(org.apache.commons.lang3.text.StrBuilderTest)  Time elapsed: 0.001 sec  <<< ERROR!
java.lang.StringIndexOutOfBoundsException: end < start
	at org.apache.commons.lang3.text.StrBuilder.validateRange(StrBuilder.java:612)
	at org.apache.commons.lang3.text.StrBuilder.toCharArray(StrBuilder.java:77)
	at org.apache.commons.lang3.text.StrBuilderTest.testToCharArrayIntInt(StrBuilderTest.java:490)

testToStringBuffer(org.apache.commons.lang3.text.StrBuilderTest)  Time elapsed: 0.001 sec  <<< ERROR!
java.lang.NegativeArraySizeException: null
	at java.lang.AbstractStringBuilder.<init>(AbstractStringBuilder.java:64)
	at java.lang.StringBuffer.<init>(StringBuffer.java:108)
	at org.apache.commons.lang3.text.StrBuilder.toStringBuffer(StrBuilder.java:607)
	at org.apache.commons.lang3.text.StrBuilderTest.testToStringBuffer(StrBuilderTest.java:1883)

testAsBuilder(org.apache.commons.lang3.text.StrBuilderTest)  Time elapsed: 0.001 sec  <<< ERROR!
java.lang.ArrayIndexOutOfBoundsException: null
	at java.lang.String.getChars(String.java:826)
	at org.apache.commons.lang3.text.StrBuilder.append(StrBuilder.java:128)
	at org.apache.commons.lang3.text.StrBuilder.append(StrBuilder.java:121)
	at org.apache.commons.lang3.text.StrBuilder.append(StrBuilder.java:114)
	at org.apache.commons.lang3.text.StrBuilder.appendAll(StrBuilder.java:256)
	at org.apache.commons.lang3.text.StrBuilderTest.testAsBuilder(StrBuilderTest.java:1937)

testIndexOf_String(org.apache.commons.lang3.text.StrBuilderTest)  Time elapsed: 0 sec  <<< FAILURE!
java.lang.AssertionError: expected:<0> but was:<-1>
	at org.junit.Assert.fail(Assert.java:88)
	at org.junit.Assert.failNotEquals(Assert.java:834)
	at org.junit.Assert.assertEquals(Assert.java:645)
	at org.junit.Assert.assertEquals(Assert.java:631)
	at org.apache.commons.lang3.text.StrBuilderTest.testIndexOf_String(StrBuilderTest.java:1410)

testIndexOf_char_int(org.apache.commons.lang3.text.StrBuilderTest)  Time elapsed: 0 sec  <<< FAILURE!
java.lang.AssertionError: expected:<0> but was:<-1>
	at org.junit.Assert.fail(Assert.java:88)
	at org.junit.Assert.failNotEquals(Assert.java:834)
	at org.junit.Assert.assertEquals(Assert.java:645)
	at org.junit.Assert.assertEquals(Assert.java:631)
	at org.apache.commons.lang3.text.StrBuilderTest.testIndexOf_char_int(StrBuilderTest.java:1352)

testGetCharsIntIntCharArrayInt(org.apache.commons.lang3.text.StrBuilderTest)  Time elapsed: 0 sec  <<< ERROR!
java.lang.StringIndexOutOfBoundsException: String index out of range: 5
	at org.apache.commons.lang3.text.StrBuilder.getChars(StrBuilder.java:88)
	at org.apache.commons.lang3.text.StrBuilderTest.testGetCharsIntIntCharArrayInt(StrBuilderTest.java:552)

testStartsWith(org.apache.commons.lang3.text.StrBuilderTest)  Time elapsed: 0.001 sec  <<< FAILURE!
java.lang.AssertionError: null
	at org.junit.Assert.fail(Assert.java:86)
	at org.junit.Assert.assertTrue(Assert.java:41)
	at org.junit.Assert.assertTrue(Assert.java:52)
	at org.apache.commons.lang3.text.StrBuilderTest.testStartsWith(StrBuilderTest.java:1170)

testIndexOf_StrMatcher(org.apache.commons.lang3.text.StrBuilderTest)  Time elapsed: 0 sec  <<< FAILURE!
java.lang.AssertionError: expected:<0> but was:<-1>
	at org.junit.Assert.fail(Assert.java:88)
	at org.junit.Assert.failNotEquals(Assert.java:834)
	at org.junit.Assert.assertEquals(Assert.java:645)
	at org.junit.Assert.assertEquals(Assert.java:631)
	at org.apache.commons.lang3.text.StrBuilderTest.testIndexOf_StrMatcher(StrBuilderTest.java:1534)

testLastIndexOf_StrMatcher_int(org.apache.commons.lang3.text.StrBuilderTest)  Time elapsed: 0 sec  <<< FAILURE!
java.lang.AssertionError: expected:<0> but was:<-1>
	at org.junit.Assert.fail(Assert.java:88)
	at org.junit.Assert.failNotEquals(Assert.java:834)
	at org.junit.Assert.assertEquals(Assert.java:645)
	at org.junit.Assert.assertEquals(Assert.java:631)
	at org.apache.commons.lang3.text.StrBuilderTest.testLastIndexOf_StrMatcher_int(StrBuilderTest.java:1613)

Running org.apache.commons.lang3.StringEscapeUtilsTest
Tests run: 28, Failures: 0, Errors: 0, Skipped: 0, Time elapsed: 0.402 sec - in org.apache.commons.lang3.StringEscapeUtilsTest
Running org.apache.commons.lang3.AnnotationUtilsTest
Tests run: 10, Failures: 0, Errors: 0, Skipped: 0, Time elapsed: 0.032 sec - in org.apache.commons.lang3.AnnotationUtilsTest
Running org.apache.commons.lang3.ConversionTest
Tests run: 42, Failures: 0, Errors: 0, Skipped: 0, Time elapsed: 0.012 sec - in org.apache.commons.lang3.ConversionTest
Running org.apache.commons.lang3.StringUtilsTrimEmptyTest
Tests run: 15, Failures: 0, Errors: 0, Skipped: 0, Time elapsed: 0.01 sec - in org.apache.commons.lang3.StringUtilsTrimEmptyTest
Running org.apache.commons.lang3.EnumUtilsTest
Tests run: 34, Failures: 0, Errors: 0, Skipped: 0, Time elapsed: 0.01 sec - in org.apache.commons.lang3.EnumUtilsTest
Running org.apache.commons.lang3.exception.ExceptionUtilsTest
Tests run: 28, Failures: 0, Errors: 0, Skipped: 0, Time elapsed: 0.026 sec - in org.apache.commons.lang3.exception.ExceptionUtilsTest
Running org.apache.commons.lang3.exception.DefaultExceptionContextTest
Tests run: 8, Failures: 0, Errors: 0, Skipped: 0, Time elapsed: 0.011 sec - in org.apache.commons.lang3.exception.DefaultExceptionContextTest
Running org.apache.commons.lang3.exception.ContextedExceptionTest
Tests run: 14, Failures: 0, Errors: 0, Skipped: 0, Time elapsed: 0.007 sec - in org.apache.commons.lang3.exception.ContextedExceptionTest
Running org.apache.commons.lang3.exception.ContextedRuntimeExceptionTest
Tests run: 14, Failures: 0, Errors: 0, Skipped: 0, Time elapsed: 0.012 sec - in org.apache.commons.lang3.exception.ContextedRuntimeExceptionTest
Running org.apache.commons.lang3.BitFieldTest
Tests run: 15, Failures: 0, Errors: 0, Skipped: 0, Time elapsed: 0.001 sec - in org.apache.commons.lang3.BitFieldTest
Running org.apache.commons.lang3.ArrayUtilsRemoveMultipleTest
Tests run: 55, Failures: 0, Errors: 0, Skipped: 0, Time elapsed: 0.007 sec - in org.apache.commons.lang3.ArrayUtilsRemoveMultipleTest
Running org.apache.commons.lang3.HashSetvBitSetTest
Ratio=8% array=100 count=1 extract=22888643 bitset=1894763
Ratio=6% array=100 count=10 extract=30691699 bitset=1922998
Ratio=9% array=100 count=50 extract=9555228 bitset=937728
Ratio=4% array=100 count=100 extract=10567569 bitset=512575
Ratio=84% array=1000 count=10 extract=6187233 bitset=5236833
Ratio=32% array=1000 count=100 extract=15892679 bitset=5242008
Ratio=7% array=1000 count=500 extract=45281889 bitset=3243703
Ratio=1% array=1000 count=1000 extract=75291171 bitset=783340
Ratio=7% count=0 hash=4730556 bits=342921
Ratio=22% count=5 hash=1366296 bits=307257
Ratio=25% count=10 hash=1625692 bits=421137
Ratio=21% count=200 hash=21499953 bits=4538528
Ratio=18% count=50 hash=7016640 bits=1303235
Ratio=21% count=100 hash=16002403 bits=3430472
Ratio=21% count=1000 hash=79265145 bits=17159333
Ratio=20% count=2000 hash=161126341 bits=33829723
Tests run: 2, Failures: 0, Errors: 0, Skipped: 0, Time elapsed: 0.697 sec - in org.apache.commons.lang3.HashSetvBitSetTest
Running org.apache.commons.lang3.StringUtilsTest
Tests run: 124, Failures: 0, Errors: 0, Skipped: 0, Time elapsed: 0.223 sec - in org.apache.commons.lang3.StringUtilsTest
Running org.apache.commons.lang3.ArrayUtilsRemoveTest
Tests run: 19, Failures: 0, Errors: 0, Skipped: 0, Time elapsed: 0.007 sec - in org.apache.commons.lang3.ArrayUtilsRemoveTest
Running org.apache.commons.lang3.ObjectUtilsTest
Tests run: 36, Failures: 0, Errors: 1, Skipped: 0, Time elapsed: 0.016 sec <<< FAILURE! - in org.apache.commons.lang3.ObjectUtilsTest
testIdentityToStringStrBuilder(org.apache.commons.lang3.ObjectUtilsTest)  Time elapsed: 0 sec  <<< ERROR!
java.lang.ArrayIndexOutOfBoundsException: -17
	at org.apache.commons.lang3.text.StrBuilder.append(StrBuilder.java:232)
	at org.apache.commons.lang3.ObjectUtils.identityToString(ObjectUtils.java:315)
	at org.apache.commons.lang3.ObjectUtilsTest.testIdentityToStringStrBuilder(ObjectUtilsTest.java:242)

Running org.apache.commons.lang3.ClassPathUtilsTest
Tests run: 13, Failures: 0, Errors: 0, Skipped: 0, Time elapsed: 0.003 sec - in org.apache.commons.lang3.ClassPathUtilsTest
Running org.apache.commons.lang3.math.NumberUtilsTest
Tests run: 91, Failures: 0, Errors: 0, Skipped: 0, Time elapsed: 0.034 sec - in org.apache.commons.lang3.math.NumberUtilsTest
Running org.apache.commons.lang3.math.IEEE754rUtilsTest
Tests run: 3, Failures: 0, Errors: 0, Skipped: 0, Time elapsed: 0 sec - in org.apache.commons.lang3.math.IEEE754rUtilsTest
Running org.apache.commons.lang3.math.FractionTest
Tests run: 25, Failures: 0, Errors: 0, Skipped: 0, Time elapsed: 0.167 sec - in org.apache.commons.lang3.math.FractionTest
Running org.apache.commons.lang3.BooleanUtilsTest
Tests run: 72, Failures: 0, Errors: 0, Skipped: 0, Time elapsed: 0.041 sec - in org.apache.commons.lang3.BooleanUtilsTest
Running org.apache.commons.lang3.CharSequenceUtilsTest
Tests run: 2, Failures: 0, Errors: 0, Skipped: 0, Time elapsed: 0 sec - in org.apache.commons.lang3.CharSequenceUtilsTest
Running org.apache.commons.lang3.CharSetUtilsTest
Tests run: 11, Failures: 0, Errors: 0, Skipped: 0, Time elapsed: 0.002 sec - in org.apache.commons.lang3.CharSetUtilsTest
Running org.apache.commons.lang3.ArrayUtilsAddTest
Tests run: 13, Failures: 0, Errors: 0, Skipped: 0, Time elapsed: 0.003 sec - in org.apache.commons.lang3.ArrayUtilsAddTest
Running org.apache.commons.lang3.CharEncodingTest
Tests run: 6, Failures: 0, Errors: 0, Skipped: 0, Time elapsed: 0.036 sec - in org.apache.commons.lang3.CharEncodingTest
Running org.apache.commons.lang3.ClassUtilsTest
Tests run: 57, Failures: 0, Errors: 0, Skipped: 0, Time elapsed: 0.045 sec - in org.apache.commons.lang3.ClassUtilsTest
Running org.apache.commons.lang3.RangeTest
Tests run: 24, Failures: 0, Errors: 0, Skipped: 0, Time elapsed: 0.011 sec - in org.apache.commons.lang3.RangeTest
Running org.apache.commons.lang3.event.EventUtilsTest
Tests run: 8, Failures: 0, Errors: 0, Skipped: 0, Time elapsed: 0.014 sec - in org.apache.commons.lang3.event.EventUtilsTest
Running org.apache.commons.lang3.event.EventListenerSupportTest
Tests run: 9, Failures: 0, Errors: 0, Skipped: 0, Time elapsed: 0.022 sec - in org.apache.commons.lang3.event.EventListenerSupportTest
Running org.apache.commons.lang3.ArrayUtilsTest
Tests run: 205, Failures: 0, Errors: 0, Skipped: 0, Time elapsed: 0.063 sec - in org.apache.commons.lang3.ArrayUtilsTest
Running org.apache.commons.lang3.CharUtilsTest
Tests run: 24, Failures: 0, Errors: 0, Skipped: 0, Time elapsed: 0.001 sec - in org.apache.commons.lang3.CharUtilsTest
Running org.apache.commons.lang3.NotImplementedExceptionTest
Tests run: 1, Failures: 0, Errors: 0, Skipped: 0, Time elapsed: 0 sec - in org.apache.commons.lang3.NotImplementedExceptionTest
Running org.apache.commons.lang3.StringUtilsEqualsIndexOfTest
Tests run: 50, Failures: 0, Errors: 0, Skipped: 0, Time elapsed: 0.01 sec - in org.apache.commons.lang3.StringUtilsEqualsIndexOfTest
Running org.apache.commons.lang3.RandomUtilsTest
Tests run: 23, Failures: 0, Errors: 0, Skipped: 0, Time elapsed: 0.001 sec - in org.apache.commons.lang3.RandomUtilsTest

Results :

Failed tests: 
  StringUtilsStartsEndsWithTest.testEndsWithAny:179 StringUtils.endsWithAny( StrBuilder(abcxyz), StringBuilder(abc), StringBuffer(xyz))
  StringUtilsStartsEndsWithTest.testStartsWithAny:97 StringUtils.startsWithAny( StrBuilder(abcxyz), StringBuilder(xyz), StringBuffer(abc))
  StrBuilderAppendInsertTest.testAppendln_Boolean:829 expected:<tru[e
]> but was:<tru[]>
  StrBuilderAppendInsertTest.testAppendln_CharArray:795 expected:<fo[o
]> but was:<fo[]>
  StrBuilderAppendInsertTest.testAppendln_CharArray_int_int:819 expected:<fo[o
]> but was:<fo[]>
  StrBuilderAppendInsertTest.testAppendln_StringBuffer:651 expected:<fo[o
]> but was:<fo[]>
  StrBuilderAppendInsertTest.testAppendln_StringBuffer_int_int:699 expected:<fo[o
]> but was:<fo[]>
  StrBuilderAppendInsertTest.testAppendln_StringBuilder:675 expected:<fo[o
]> but was:<fo[]>
  StrBuilderAppendInsertTest.testAppendln_StringBuilder_int_int:723 expected:<fo[o
]> but was:<fo[]>
  StrBuilderAppendInsertTest.testAppendln_String_int_int:627 expected:<fo[o
]> but was:<fo[]>
  StrBuilderTest.testAsReader:1701 null
  StrBuilderTest.testAsTokenizer:1666 expected:<2> but was:<0>
  StrBuilderTest.testCapacityAndLength:235 expected:<3> but was:<-3>
  StrBuilderTest.testConstructors:80 expected:<3> but was:<-3>
  StrBuilderTest.testContains_StrMatcher:1322 null
  StrBuilderTest.testContains_String:1312 null
  StrBuilderTest.testContains_char:1303 null
  StrBuilderTest.testEndsWith:1184 null
  StrBuilderTest.testEquals:1842 null
  StrBuilderTest.testHashCode:1865 null
  StrBuilderTest.testIndexOf_StrMatcher:1534 expected:<0> but was:<-1>
  StrBuilderTest.testIndexOf_StrMatcher_int:1553 expected:<0> but was:<-1>
  StrBuilderTest.testIndexOf_String:1410 expected:<0> but was:<-1>
  StrBuilderTest.testIndexOf_String_int:1432 expected:<0> but was:<-1>
  StrBuilderTest.testIndexOf_char:1338 expected:<0> but was:<-1>
  StrBuilderTest.testIndexOf_char_int:1352 expected:<0> but was:<-1>
  StrBuilderTest.testLastIndexOf_StrMatcher:1592 expected:<0> but was:<-1>
  StrBuilderTest.testLastIndexOf_StrMatcher_int:1613 expected:<0> but was:<-1>
  StrBuilderTest.testLastIndexOf_String:1470 expected:<2> but was:<-1>
  StrBuilderTest.testLastIndexOf_String_int:1493 expected:<0> but was:<-1>
  StrBuilderTest.testLastIndexOf_char:1375 expected:<2> but was:<-1>
  StrBuilderTest.testLastIndexOf_char_int:1389 expected:<0> but was:<-1>
  StrBuilderTest.testLength:304 expected:<5> but was:<-5>
  StrBuilderTest.testMidString:1273 expected:<[goodbye]> but was:<[]>
  StrBuilderTest.testSize:368 expected:<5> but was:<-5>
  StrBuilderTest.testStartsWith:1170 null

Tests in error: 
  ObjectUtilsTest.testIdentityToStringStrBuilder:242 » ArrayIndexOutOfBounds -17
  StrBuilderAppendInsertTest.testAppendAll_Array:1069 » ArrayIndexOutOfBounds
  StrBuilderAppendInsertTest.testAppendAll_Collection:1089 » ArrayIndexOutOfBounds
  StrBuilderAppendInsertTest.testAppendAll_Iterator:1105 » ArrayIndexOutOfBounds
  StrBuilderAppendInsertTest.testAppendNewLine:53 » ArrayIndexOutOfBounds
  StrBuilderAppendInsertTest.testAppendPadding:861 » StringIndexOutOfBounds Stri...
  StrBuilderAppendInsertTest.testAppendSeparator_String:1201 » StringIndexOutOfBounds
  StrBuilderAppendInsertTest.testAppendSeparator_String_String:1218 » StringIndexOutOfBounds
  StrBuilderAppendInsertTest.testAppendSeparator_String_int:1261 » StringIndexOutOfBounds
  StrBuilderAppendInsertTest.testAppendSeparator_char:1236 » StringIndexOutOfBounds
  StrBuilderAppendInsertTest.testAppendSeparator_char_char:1249 » StringIndexOutOfBounds
  StrBuilderAppendInsertTest.testAppendSeparator_char_int:1276 » StringIndexOutOfBounds
  StrBuilderAppendInsertTest.testAppendWithNullText:69 » StringIndexOutOfBounds ...
  StrBuilderAppendInsertTest.testAppendWithSeparatorsWithNullText:1186 » ArrayIndexOutOfBounds
  StrBuilderAppendInsertTest.testAppendWithSeparators_Array:1121 » ArrayIndexOutOfBounds
  StrBuilderAppendInsertTest.testAppendWithSeparators_Collection:1145 » ArrayIndexOutOfBounds
  StrBuilderAppendInsertTest.testAppendWithSeparators_Iterator:1169 » ArrayIndexOutOfBounds
  StrBuilderAppendInsertTest.testAppend_CharArray:445 » StringIndexOutOfBounds S...
  StrBuilderAppendInsertTest.testAppend_CharArray_int_int:460 » StringIndexOutOfBounds
  StrBuilderAppendInsertTest.testAppend_FormattedString:1039 » StringIndexOutOfBounds
  StrBuilderAppendInsertTest.testAppend_Object:104 » StringIndexOutOfBounds Stri...
  StrBuilderAppendInsertTest.testAppend_PrimitiveNumber:534 » StringIndexOutOfBounds
  StrBuilderAppendInsertTest.testAppend_StrBuilder:367 » StringIndexOutOfBounds ...
  StrBuilderAppendInsertTest.testAppend_StrBuilder_int_int:385 » StringIndexOutOfBounds
  StrBuilderAppendInsertTest.testAppend_String:145 » StringIndexOutOfBounds Stri...
  StrBuilderAppendInsertTest.testAppend_StringBuffer:289 » StringIndexOutOfBounds
  StrBuilderAppendInsertTest.testAppend_StringBuffer_int_int:307 » StringIndexOutOfBounds
  StrBuilderAppendInsertTest.testAppend_StringBuilder:127 » StringIndexOutOfBounds
  StrBuilderAppendInsertTest.testAppend_StringBuilder_int_int:226 » StringIndexOutOfBounds
  StrBuilderAppendInsertTest.testAppend_String_int_int:163 » StringIndexOutOfBounds
  StrBuilderAppendInsertTest.testAppendln_FormattedString:564 » ArrayIndexOutOfBounds
  StrBuilderAppendInsertTest.testAppendln_Object:575 » StringIndexOutOfBounds St...
  StrBuilderAppendInsertTest.testAppendln_PrimitiveNumber:840 » ArrayIndexOutOfBounds
  StrBuilderAppendInsertTest.testAppendln_StrBuilder:747 » StringIndexOutOfBounds
  StrBuilderAppendInsertTest.testAppendln_StrBuilder_int_int:770 » StringIndexOutOfBounds
  StrBuilderAppendInsertTest.testAppendln_String:602 » ArrayIndexOutOfBounds
  StrBuilderAppendInsertTest.testInsert:1290 » StringIndexOutOfBounds String ind...
  StrBuilderAppendInsertTest.testInsertWithNullText:1557 » StringIndexOutOfBounds
  StrBuilderTest.testAppendToCharBuffer:1992 » IllegalArgument
  StrBuilderTest.testAppendToStringBuffer:1983 » ArrayIndexOutOfBounds
  StrBuilderTest.testAppendToStringBuilder:1973 » ArrayIndexOutOfBounds
  StrBuilderTest.testAppendToWriter:1963 » IndexOutOfBounds
  StrBuilderTest.testAsBuilder:1937 » ArrayIndexOutOfBounds
  StrBuilderTest.testAsWriter:1774 » ArrayIndexOutOfBounds -4
  StrBuilderTest.testCharAt:409 » StringIndexOutOfBounds String index out of ran...
  StrBuilderTest.testDeleteAll_StrMatcher:709 » StringIndexOutOfBounds end < sta...
  StrBuilderTest.testDeleteAll_String:657 » StringIndexOutOfBounds String index ...
  StrBuilderTest.testDeleteAll_char:622 » StringIndexOutOfBounds String index ou...
  StrBuilderTest.testDeleteCharAt:459 » StringIndexOutOfBounds String index out ...
  StrBuilderTest.testDeleteFirst_StrMatcher:726 » StringIndexOutOfBounds end < s...
  StrBuilderTest.testDeleteFirst_String:683 » StringIndexOutOfBounds String inde...
  StrBuilderTest.testDeleteFirst_char:639 » StringIndexOutOfBounds String index ...
  StrBuilderTest.testDeleteIntInt:592 » StringIndexOutOfBounds end < start
  StrBuilderTest.testEnsureCapacity:346 » ArrayIndexOutOfBounds
  StrBuilderTest.testGetChars:528 » ArrayIndexOutOfBounds
  StrBuilderTest.testGetCharsIntIntCharArrayInt:552 » StringIndexOutOfBounds Str...
  StrBuilderTest.testLang294:1901 » StringIndexOutOfBounds String index out of r...
  StrBuilderTest.testLeftString:1293 » StringIndexOutOfBounds String index out o...
  StrBuilderTest.testMinimizeCapacity:357 » NegativeArraySize
  StrBuilderTest.testReadFromCharBufferAppendsToEnd:138 » IndexOutOfBounds
  StrBuilderTest.testReadFromReadableAppendsToEnd:159 » IndexOutOfBounds
  StrBuilderTest.testReadFromReaderAppendsToEnd:117 » IndexOutOfBounds
  StrBuilderTest.testReplaceAll_StrMatcher_String:873 » StringIndexOutOfBounds e...
  StrBuilderTest.testReplaceAll_String_String:813 » StringIndexOutOfBounds Strin...
  StrBuilderTest.testReplaceAll_char_char:781 » StringIndexOutOfBounds String in...
  StrBuilderTest.testReplaceFirst_StrMatcher_String:907 » StringIndexOutOfBounds
  StrBuilderTest.testReplaceFirst_String_String:843 » StringIndexOutOfBounds Str...
  StrBuilderTest.testReplaceFirst_char_char:797 » StringIndexOutOfBounds String ...
  StrBuilderTest.testReplace_StrMatcher_String_int_int_int_VaryCount:1101 » StringIndexOutOfBounds
  StrBuilderTest.testReplace_StrMatcher_String_int_int_int_VaryEndIndex:1047 » StringIndexOutOfBounds
  StrBuilderTest.testReplace_StrMatcher_String_int_int_int_VaryMatcher:942 » StringIndexOutOfBounds
  StrBuilderTest.testReplace_StrMatcher_String_int_int_int_VaryReplace:963 » StringIndexOutOfBounds
  StrBuilderTest.testReplace_StrMatcher_String_int_int_int_VaryStartIndex:986 » StringIndexOutOfBounds
  StrBuilderTest.testReplace_int_int_String:744 » StringIndexOutOfBounds end < s...
  StrBuilderTest.testRightString:1284 » StringIndexOutOfBounds String index out ...
  StrBuilderTest.testSetCharAt:443 » StringIndexOutOfBounds String index out of ...
  StrBuilderTest.testSetLength:311 » ArrayIndexOutOfBounds -5
  StrBuilderTest.testSubSequenceIntInt:1222 » StringIndexOutOfBounds String inde...
  StrBuilderTest.testSubstringInt:1231 » StringIndexOutOfBounds end < start
  StrBuilderTest.testSubstringIntInt:1250 » StringIndexOutOfBounds end < start
  StrBuilderTest.testToCharArray:479 » NegativeArraySize
  StrBuilderTest.testToCharArrayIntInt:490 » StringIndexOutOfBounds end < start
  StrBuilderTest.testToString:1873 » StringIndexOutOfBounds String index out of ...
  StrBuilderTest.testToStringBuffer:1883 » NegativeArraySize
  StrBuilderTest.testToStringBuilder:1893 » NegativeArraySize
  StrBuilderTest.testTrim:1147 » StringIndexOutOfBounds String index out of rang...
  StrSubstitutorTest.testConstructorMapFull:452 » StringIndexOutOfBounds String ...
  StrSubstitutorTest.testConstructorMapPrefixSuffix:441 » StringIndexOutOfBounds
  StrSubstitutorTest.testCyclicReplacement:251 » StringIndexOutOfBounds end < st...
  StrSubstitutorTest.testDefaultValueDelimiters:374 » StringIndexOutOfBounds end...
  StrSubstitutorTest.testLANG1055:599 » StringIndexOutOfBounds String index out ...
  StrSubstitutorTest.testReplaceAdjacentAtEnd:136 » StringIndexOutOfBounds end <...
  StrSubstitutorTest.testReplaceAdjacentAtStart:125 » StringIndexOutOfBounds end...
  StrSubstitutorTest.testReplaceChangedMap:105 » StringIndexOutOfBounds end < st...
  StrSubstitutorTest.testReplaceComplexEscaping:179->doTestReplace:634 » StringIndexOutOfBounds
  StrSubstitutorTest.testReplaceEmptyKeys:220->doTestReplace:634 » StringIndexOutOfBounds
  StrSubstitutorTest.testReplaceEscaping:163->doTestReplace:634 » StringIndexOutOfBounds
  StrSubstitutorTest.testReplaceInVariable:311 » StringIndexOutOfBounds String i...
  StrSubstitutorTest.testReplaceInVariableDisabled:335 » StringIndexOutOfBounds ...
  StrSubstitutorTest.testReplaceInVariableRecursive:357 » StringIndexOutOfBounds
  StrSubstitutorTest.testReplaceIncompletePrefix:196->doTestReplace:634 » StringIndexOutOfBounds
  StrSubstitutorTest.testReplaceNoPrefixNoSuffix:188->doTestReplace:634 » StringIndexOutOfBounds
  StrSubstitutorTest.testReplaceNoPrefixSuffix:212->doTestReplace:634 » StringIndexOutOfBounds
  StrSubstitutorTest.testReplaceNoVariables:79->doTestNoReplace:723 » StringIndexOutOfBounds
  StrSubstitutorTest.testReplacePrefixNoSuffix:204->doTestReplace:634 » StringIndexOutOfBounds
  StrSubstitutorTest.testReplaceRecursive:152->doTestReplace:634 » StringIndexOutOfBounds
  StrSubstitutorTest.testReplaceSimple:63->doTestReplace:634 » StringIndexOutOfBounds
  StrSubstitutorTest.testReplaceSolo:71->doTestReplace:634 » StringIndexOutOfBounds
  StrSubstitutorTest.testReplaceSoloEscaping:171->doTestReplace:634 » StringIndexOutOfBounds
  StrSubstitutorTest.testReplaceToIdentical:231->doTestReplace:634 » StringIndexOutOfBounds
  StrSubstitutorTest.testReplaceUnknownKey:113->doTestReplace:634 » StringIndexOutOfBounds
  StrSubstitutorTest.testReplaceWeirdPattens:274->doTestNoReplace:723 » StringIndexOutOfBounds
  StrSubstitutorTest.testResolveVariable:420 » StringIndexOutOfBounds String ind...
  StrSubstitutorTest.testSamePrefixAndSuffix:624 » StringIndexOutOfBounds String...
  StrSubstitutorTest.testStaticReplace:563 » StringIndexOutOfBounds String index...
  StrSubstitutorTest.testStaticReplacePrefixSuffix:573 » StringIndexOutOfBounds ...
  StrSubstitutorTest.testStaticReplaceSystemProperties:582 » ArrayIndexOutOfBounds
  StrSubstitutorTest.testSubstituteDefaultProperties:615 » StringIndexOutOfBounds


Tests run: 3526, Failures: 36, Errors: 118, Skipped: 97

[INFO] ------------------------------------------------------------------------
[INFO] BUILD FAILURE
[INFO] ------------------------------------------------------------------------
[INFO] Total time: 37.841s
[INFO] Finished at: Wed Aug 05 02:15:31 BST 2015
[INFO] Final Memory: 25M/499M
[INFO] ------------------------------------------------------------------------
[ERROR] Failed to execute goal org.apache.maven.plugins:maven-surefire-plugin:2.18:test (default-test) on project commons-lang3: There are test failures.
[ERROR] 
[ERROR] Please refer to /home/perham/Study/LittleDarwin/Cases/commons-lang3-3.4-src/target/surefire-reports for the individual test results.
[ERROR] -> [Help 1]
[ERROR] 
[ERROR] To see the full stack trace of the errors, re-run Maven with the -e switch.
[ERROR] Re-run Maven using the -X switch to enable full debug logging.
[ERROR] 
[ERROR] For more information about the errors and possible solutions, please read the following articles:
[ERROR] [Help 1] http://cwiki.apache.org/confluence/display/MAVEN/MojoFailureException
