[INFO] Scanning for projects...
[INFO]                                                                         
[INFO] ------------------------------------------------------------------------
[INFO] Building Apache Commons Lang 3.4
[INFO] ------------------------------------------------------------------------
[INFO] 
[INFO] --- maven-enforcer-plugin:1.3.1:enforce (enforce-maven-3) @ commons-lang3 ---
[INFO] 
[INFO] --- build-helper-maven-plugin:1.8:parse-version (parse-version) @ commons-lang3 ---
[INFO] 
[INFO] --- maven-antrun-plugin:1.8:run (javadoc.resources) @ commons-lang3 ---
[INFO] Executing tasks

main:
[INFO] Executed tasks
[INFO] 
[INFO] --- maven-remote-resources-plugin:1.5:process (default) @ commons-lang3 ---
[INFO] 
[INFO] --- buildnumber-maven-plugin:1.3:create (default) @ commons-lang3 ---
[INFO] Executing: /bin/sh -c cd /home/perham/Study/LittleDarwin/Cases/commons-lang3-3.4-src && svn --non-interactive info
[INFO] Working directory: /home/perham/Study/LittleDarwin/Cases/commons-lang3-3.4-src
[INFO] Storing buildNumber: ?????? at timestamp: 1438734756159
[INFO] Executing: /bin/sh -c cd /home/perham/Study/LittleDarwin/Cases/commons-lang3-3.4-src && svn --non-interactive info
[INFO] Working directory: /home/perham/Study/LittleDarwin/Cases/commons-lang3-3.4-src
[INFO] Storing buildScmBranch: UNKNOWN_BRANCH
[INFO] 
[INFO] --- maven-resources-plugin:2.7:resources (default-resources) @ commons-lang3 ---
[INFO] Using 'ISO-8859-1' encoding to copy filtered resources.
[INFO] Copying 0 resource
[INFO] Copying 2 resources to META-INF
[INFO] 
[INFO] --- maven-compiler-plugin:3.2:compile (default-compile) @ commons-lang3 ---
[INFO] Changes detected - recompiling the module!
[INFO] Compiling 133 source files to /home/perham/Study/LittleDarwin/Cases/commons-lang3-3.4-src/target/classes
[INFO] /home/perham/Study/LittleDarwin/Cases/commons-lang3-3.4-src/src/main/java/org/apache/commons/lang3/SerializationUtils.java: /home/perham/Study/LittleDarwin/Cases/commons-lang3-3.4-src/src/main/java/org/apache/commons/lang3/SerializationUtils.java uses unchecked or unsafe operations.
[INFO] /home/perham/Study/LittleDarwin/Cases/commons-lang3-3.4-src/src/main/java/org/apache/commons/lang3/SerializationUtils.java: Recompile with -Xlint:unchecked for details.
[INFO] 
[INFO] --- maven-bundle-plugin:2.5.3:manifest (bundle-manifest) @ commons-lang3 ---
[INFO] 
[INFO] --- animal-sniffer-maven-plugin:1.13:check (checkAPIcompatibility) @ commons-lang3 ---
[INFO] Checking unresolved references to org.codehaus.mojo.signature:java16:1.0
[INFO] 
[INFO] --- maven-resources-plugin:2.7:testResources (default-testResources) @ commons-lang3 ---
[INFO] Using 'ISO-8859-1' encoding to copy filtered resources.
[INFO] Copying 2 resources
[INFO] Copying 2 resources to META-INF
[INFO] 
[INFO] --- maven-compiler-plugin:3.2:testCompile (default-testCompile) @ commons-lang3 ---
[INFO] Nothing to compile - all classes are up to date
[INFO] 
[INFO] --- maven-surefire-plugin:2.18:test (default-test) @ commons-lang3 ---
[INFO] Surefire report directory: /home/perham/Study/LittleDarwin/Cases/commons-lang3-3.4-src/target/surefire-reports

-------------------------------------------------------
 T E S T S
-------------------------------------------------------
Running org.apache.commons.lang3.ValidateTest
Tests run: 63, Failures: 0, Errors: 0, Skipped: 0, Time elapsed: 0.042 sec - in org.apache.commons.lang3.ValidateTest
Running org.apache.commons.lang3.LocaleUtilsTest
Tests run: 15, Failures: 0, Errors: 0, Skipped: 0, Time elapsed: 0.015 sec - in org.apache.commons.lang3.LocaleUtilsTest
Running org.apache.commons.lang3.tuple.MutableTripleTest
Tests run: 8, Failures: 0, Errors: 0, Skipped: 0, Time elapsed: 0.001 sec - in org.apache.commons.lang3.tuple.MutableTripleTest
Running org.apache.commons.lang3.tuple.TripleTest
Tests run: 10, Failures: 0, Errors: 0, Skipped: 0, Time elapsed: 0.012 sec - in org.apache.commons.lang3.tuple.TripleTest
Running org.apache.commons.lang3.tuple.ImmutablePairTest
Tests run: 6, Failures: 0, Errors: 0, Skipped: 0, Time elapsed: 0 sec - in org.apache.commons.lang3.tuple.ImmutablePairTest
Running org.apache.commons.lang3.tuple.MutablePairTest
Tests run: 8, Failures: 0, Errors: 0, Skipped: 0, Time elapsed: 0.003 sec - in org.apache.commons.lang3.tuple.MutablePairTest
Running org.apache.commons.lang3.tuple.ImmutableTripleTest
Tests run: 6, Failures: 0, Errors: 0, Skipped: 0, Time elapsed: 0.001 sec - in org.apache.commons.lang3.tuple.ImmutableTripleTest
Running org.apache.commons.lang3.tuple.PairTest
Tests run: 9, Failures: 0, Errors: 0, Skipped: 0, Time elapsed: 0.004 sec - in org.apache.commons.lang3.tuple.PairTest
Running org.apache.commons.lang3.StringUtilsIsTest
Tests run: 8, Failures: 0, Errors: 0, Skipped: 0, Time elapsed: 0.015 sec - in org.apache.commons.lang3.StringUtilsIsTest
Running org.apache.commons.lang3.JavaVersionTest
Tests run: 3, Failures: 0, Errors: 0, Skipped: 0, Time elapsed: 0 sec - in org.apache.commons.lang3.JavaVersionTest
Running org.apache.commons.lang3.builder.NoFieldNamesToStringStyleTest
Tests run: 8, Failures: 0, Errors: 0, Skipped: 0, Time elapsed: 0.027 sec - in org.apache.commons.lang3.builder.NoFieldNamesToStringStyleTest
Running org.apache.commons.lang3.builder.ShortPrefixToStringStyleTest
Tests run: 8, Failures: 0, Errors: 0, Skipped: 0, Time elapsed: 0.002 sec - in org.apache.commons.lang3.builder.ShortPrefixToStringStyleTest
Running org.apache.commons.lang3.builder.DiffResultTest
Tests run: 9, Failures: 0, Errors: 0, Skipped: 0, Time elapsed: 0.019 sec - in org.apache.commons.lang3.builder.DiffResultTest
Running org.apache.commons.lang3.builder.CompareToBuilderTest
Tests run: 48, Failures: 0, Errors: 0, Skipped: 0, Time elapsed: 0.044 sec - in org.apache.commons.lang3.builder.CompareToBuilderTest
Running org.apache.commons.lang3.builder.MultilineRecursiveToStringStyleTest
Tests run: 10, Failures: 0, Errors: 0, Skipped: 0, Time elapsed: 0.015 sec - in org.apache.commons.lang3.builder.MultilineRecursiveToStringStyleTest
Running org.apache.commons.lang3.builder.RecursiveToStringStyleTest
Tests run: 8, Failures: 0, Errors: 0, Skipped: 0, Time elapsed: 0.009 sec - in org.apache.commons.lang3.builder.RecursiveToStringStyleTest
Running org.apache.commons.lang3.builder.DefaultToStringStyleTest
Tests run: 8, Failures: 0, Errors: 0, Skipped: 0, Time elapsed: 0.004 sec - in org.apache.commons.lang3.builder.DefaultToStringStyleTest
Running org.apache.commons.lang3.builder.ReflectionToStringBuilderExcludeTest
Tests run: 11, Failures: 0, Errors: 0, Skipped: 0, Time elapsed: 0.004 sec - in org.apache.commons.lang3.builder.ReflectionToStringBuilderExcludeTest
Running org.apache.commons.lang3.builder.StandardToStringStyleTest
Tests run: 8, Failures: 0, Errors: 0, Skipped: 0, Time elapsed: 0.004 sec - in org.apache.commons.lang3.builder.StandardToStringStyleTest
Running org.apache.commons.lang3.builder.ToStringStyleTest
Tests run: 12, Failures: 0, Errors: 0, Skipped: 0, Time elapsed: 0.002 sec - in org.apache.commons.lang3.builder.ToStringStyleTest
Running org.apache.commons.lang3.builder.DiffTest
Tests run: 4, Failures: 0, Errors: 0, Skipped: 0, Time elapsed: 0.001 sec - in org.apache.commons.lang3.builder.DiffTest
Running org.apache.commons.lang3.builder.SimpleToStringStyleTest
Tests run: 8, Failures: 0, Errors: 0, Skipped: 0, Time elapsed: 0.002 sec - in org.apache.commons.lang3.builder.SimpleToStringStyleTest
Running org.apache.commons.lang3.builder.MultiLineToStringStyleTest
Tests run: 8, Failures: 0, Errors: 0, Skipped: 0, Time elapsed: 0.004 sec - in org.apache.commons.lang3.builder.MultiLineToStringStyleTest
Running org.apache.commons.lang3.builder.ToStringStyleConcurrencyTest
Tests run: 3, Failures: 0, Errors: 0, Skipped: 0, Time elapsed: 4.621 sec - in org.apache.commons.lang3.builder.ToStringStyleConcurrencyTest
Running org.apache.commons.lang3.builder.ReflectionToStringBuilderMutateInspectConcurrencyTest
Tests run: 1, Failures: 0, Errors: 0, Skipped: 1, Time elapsed: 0.002 sec - in org.apache.commons.lang3.builder.ReflectionToStringBuilderMutateInspectConcurrencyTest
Running org.apache.commons.lang3.builder.ToStringBuilderTest
Tests run: 74, Failures: 0, Errors: 0, Skipped: 1, Time elapsed: 0.042 sec - in org.apache.commons.lang3.builder.ToStringBuilderTest
Running org.apache.commons.lang3.builder.EqualsBuilderTest
Tests run: 48, Failures: 0, Errors: 0, Skipped: 0, Time elapsed: 0.045 sec - in org.apache.commons.lang3.builder.EqualsBuilderTest
Running org.apache.commons.lang3.builder.HashCodeBuilderAndEqualsBuilderTest
Tests run: 4, Failures: 0, Errors: 0, Skipped: 0, Time elapsed: 0.007 sec - in org.apache.commons.lang3.builder.HashCodeBuilderAndEqualsBuilderTest
Running org.apache.commons.lang3.builder.ReflectionToStringBuilderConcurrencyTest
Tests run: 3, Failures: 0, Errors: 0, Skipped: 3, Time elapsed: 0 sec - in org.apache.commons.lang3.builder.ReflectionToStringBuilderConcurrencyTest
Running org.apache.commons.lang3.builder.JsonToStringStyleTest
Tests run: 9, Failures: 0, Errors: 0, Skipped: 0, Time elapsed: 0.002 sec - in org.apache.commons.lang3.builder.JsonToStringStyleTest
Running org.apache.commons.lang3.builder.NoClassNameToStringStyleTest
Tests run: 8, Failures: 0, Errors: 0, Skipped: 0, Time elapsed: 0.003 sec - in org.apache.commons.lang3.builder.NoClassNameToStringStyleTest
Running org.apache.commons.lang3.builder.DiffBuilderTest
Tests run: 30, Failures: 0, Errors: 0, Skipped: 0, Time elapsed: 0.03 sec - in org.apache.commons.lang3.builder.DiffBuilderTest
Running org.apache.commons.lang3.builder.HashCodeBuilderTest
Tests run: 44, Failures: 0, Errors: 0, Skipped: 0, Time elapsed: 0.016 sec - in org.apache.commons.lang3.builder.HashCodeBuilderTest
Running org.apache.commons.lang3.concurrent.AtomicInitializerTest
Tests run: 3, Failures: 0, Errors: 0, Skipped: 0, Time elapsed: 0.011 sec - in org.apache.commons.lang3.concurrent.AtomicInitializerTest
Running org.apache.commons.lang3.concurrent.CallableBackgroundInitializerTest
Tests run: 4, Failures: 0, Errors: 0, Skipped: 0, Time elapsed: 0.001 sec - in org.apache.commons.lang3.concurrent.CallableBackgroundInitializerTest
Running org.apache.commons.lang3.concurrent.BackgroundInitializerTest
Tests run: 15, Failures: 0, Errors: 0, Skipped: 0, Time elapsed: 0.021 sec - in org.apache.commons.lang3.concurrent.BackgroundInitializerTest
Running org.apache.commons.lang3.concurrent.LazyInitializerTest
Tests run: 3, Failures: 0, Errors: 0, Skipped: 0, Time elapsed: 0.004 sec - in org.apache.commons.lang3.concurrent.LazyInitializerTest
Running org.apache.commons.lang3.concurrent.BasicThreadFactoryTest
Tests run: 15, Failures: 0, Errors: 0, Skipped: 0, Time elapsed: 0.038 sec - in org.apache.commons.lang3.concurrent.BasicThreadFactoryTest
Running org.apache.commons.lang3.concurrent.ConstantInitializerTest
Tests run: 7, Failures: 0, Errors: 0, Skipped: 0, Time elapsed: 0.001 sec - in org.apache.commons.lang3.concurrent.ConstantInitializerTest
Running org.apache.commons.lang3.concurrent.MultiBackgroundInitializerTest
Tests run: 17, Failures: 0, Errors: 0, Skipped: 0, Time elapsed: 0.073 sec - in org.apache.commons.lang3.concurrent.MultiBackgroundInitializerTest
Running org.apache.commons.lang3.concurrent.AtomicSafeInitializerTest
Tests run: 4, Failures: 0, Errors: 0, Skipped: 0, Time elapsed: 0.006 sec - in org.apache.commons.lang3.concurrent.AtomicSafeInitializerTest
Running org.apache.commons.lang3.concurrent.ConcurrentUtilsTest
Tests run: 40, Failures: 0, Errors: 0, Skipped: 0, Time elapsed: 0.017 sec - in org.apache.commons.lang3.concurrent.ConcurrentUtilsTest
Running org.apache.commons.lang3.concurrent.TimedSemaphoreTest
Tests run: 15, Failures: 0, Errors: 0, Skipped: 0, Time elapsed: 1.179 sec - in org.apache.commons.lang3.concurrent.TimedSemaphoreTest
Running org.apache.commons.lang3.StringUtilsSubstringTest
Tests run: 14, Failures: 0, Errors: 0, Skipped: 0, Time elapsed: 0.004 sec - in org.apache.commons.lang3.StringUtilsSubstringTest
Running org.apache.commons.lang3.SystemUtilsTest
Tests run: 12, Failures: 0, Errors: 0, Skipped: 0, Time elapsed: 0.003 sec - in org.apache.commons.lang3.SystemUtilsTest
Running org.apache.commons.lang3.CharRangeTest
Tests run: 16, Failures: 0, Errors: 0, Skipped: 0, Time elapsed: 0.041 sec - in org.apache.commons.lang3.CharRangeTest
Running org.apache.commons.lang3.CharSetTest
Tests run: 14, Failures: 0, Errors: 0, Skipped: 0, Time elapsed: 0.011 sec - in org.apache.commons.lang3.CharSetTest
Running org.apache.commons.lang3.StringUtilsStartsEndsWithTest
Tests run: 6, Failures: 2, Errors: 0, Skipped: 0, Time elapsed: 0.007 sec <<< FAILURE! - in org.apache.commons.lang3.StringUtilsStartsEndsWithTest
testStartsWithAny(org.apache.commons.lang3.StringUtilsStartsEndsWithTest)  Time elapsed: 0.006 sec  <<< FAILURE!
java.lang.AssertionError: StringUtils.startsWithAny( StrBuilder(abcxyz), StringBuilder(xyz), StringBuffer(abc))
	at org.junit.Assert.fail(Assert.java:88)
	at org.junit.Assert.assertTrue(Assert.java:41)
	at org.apache.commons.lang3.StringUtilsStartsEndsWithTest.testStartsWithAny(StringUtilsStartsEndsWithTest.java:97)

testEndsWithAny(org.apache.commons.lang3.StringUtilsStartsEndsWithTest)  Time elapsed: 0 sec  <<< FAILURE!
java.lang.AssertionError: StringUtils.endsWithAny( StrBuilder(abcxyz), StringBuilder(abc), StringBuffer(xyz))
	at org.junit.Assert.fail(Assert.java:88)
	at org.junit.Assert.assertTrue(Assert.java:41)
	at org.apache.commons.lang3.StringUtilsStartsEndsWithTest.testEndsWithAny(StringUtilsStartsEndsWithTest.java:179)

Running org.apache.commons.lang3.RandomStringUtilsTest
Tests run: 11, Failures: 0, Errors: 0, Skipped: 0, Time elapsed: 0.038 sec - in org.apache.commons.lang3.RandomStringUtilsTest
Running org.apache.commons.lang3.SerializationUtilsTest
Tests run: 26, Failures: 0, Errors: 0, Skipped: 0, Time elapsed: 0.051 sec - in org.apache.commons.lang3.SerializationUtilsTest
Running org.apache.commons.lang3.time.StopWatchTest
Tests run: 8, Failures: 0, Errors: 0, Skipped: 0, Time elapsed: 4.755 sec - in org.apache.commons.lang3.time.StopWatchTest
Running org.apache.commons.lang3.time.DateUtilsRoundingTest
Tests run: 22, Failures: 0, Errors: 0, Skipped: 0, Time elapsed: 0.182 sec - in org.apache.commons.lang3.time.DateUtilsRoundingTest
Running org.apache.commons.lang3.time.FastDateParserTest
Tests run: 33, Failures: 0, Errors: 0, Skipped: 0, Time elapsed: 2.668 sec - in org.apache.commons.lang3.time.FastDateParserTest
Running org.apache.commons.lang3.time.FastDateFormat_ParserTest
Tests run: 33, Failures: 0, Errors: 0, Skipped: 0, Time elapsed: 0.805 sec - in org.apache.commons.lang3.time.FastDateFormat_ParserTest
Running org.apache.commons.lang3.time.DurationFormatUtilsTest
Tests run: 25, Failures: 0, Errors: 0, Skipped: 0, Time elapsed: 1.008 sec - in org.apache.commons.lang3.time.DurationFormatUtilsTest
Running org.apache.commons.lang3.time.DateFormatUtilsTest
Tests run: 10, Failures: 0, Errors: 0, Skipped: 0, Time elapsed: 0.003 sec - in org.apache.commons.lang3.time.DateFormatUtilsTest
Running org.apache.commons.lang3.time.DateUtilsFragmentTest
Tests run: 57, Failures: 0, Errors: 0, Skipped: 0, Time elapsed: 0.013 sec - in org.apache.commons.lang3.time.DateUtilsFragmentTest
Running org.apache.commons.lang3.time.FastDatePrinterTimeZonesTest
Tests run: 617, Failures: 0, Errors: 0, Skipped: 0, Time elapsed: 0.281 sec - in org.apache.commons.lang3.time.FastDatePrinterTimeZonesTest
Running org.apache.commons.lang3.time.FastDateFormatTest
>>FastDateFormatTest: FastDateParser:19213  SimpleDateFormat:4272
Tests run: 14, Failures: 0, Errors: 0, Skipped: 0, Time elapsed: 2.623 sec - in org.apache.commons.lang3.time.FastDateFormatTest
Running org.apache.commons.lang3.time.FastDateFormat_PrinterTest
Tests run: 17, Failures: 0, Errors: 0, Skipped: 0, Time elapsed: 0.018 sec - in org.apache.commons.lang3.time.FastDateFormat_PrinterTest
Running org.apache.commons.lang3.time.FastDatePrinterTest
Tests run: 17, Failures: 0, Errors: 0, Skipped: 0, Time elapsed: 0.007 sec - in org.apache.commons.lang3.time.FastDatePrinterTest
Running org.apache.commons.lang3.time.FastDateParserSDFTest
Tests run: 276, Failures: 0, Errors: 0, Skipped: 92, Time elapsed: 0.076 sec - in org.apache.commons.lang3.time.FastDateParserSDFTest
Running org.apache.commons.lang3.time.DateUtilsTest
DateUtilsTest: Default Locale=en_US
Tests run: 38, Failures: 0, Errors: 0, Skipped: 0, Time elapsed: 0.028 sec - in org.apache.commons.lang3.time.DateUtilsTest
Running org.apache.commons.lang3.reflect.InheritanceUtilsTest
Tests run: 9, Failures: 0, Errors: 0, Skipped: 0, Time elapsed: 0.004 sec - in org.apache.commons.lang3.reflect.InheritanceUtilsTest
Running org.apache.commons.lang3.reflect.MethodUtilsTest
Tests run: 23, Failures: 0, Errors: 0, Skipped: 0, Time elapsed: 0.04 sec - in org.apache.commons.lang3.reflect.MethodUtilsTest
Running org.apache.commons.lang3.reflect.ConstructorUtilsTest
Tests run: 7, Failures: 0, Errors: 0, Skipped: 0, Time elapsed: 0.011 sec - in org.apache.commons.lang3.reflect.ConstructorUtilsTest
Running org.apache.commons.lang3.reflect.FieldUtilsTest
Tests run: 64, Failures: 0, Errors: 0, Skipped: 0, Time elapsed: 0.04 sec - in org.apache.commons.lang3.reflect.FieldUtilsTest
Running org.apache.commons.lang3.reflect.TypeLiteralTest
Tests run: 4, Failures: 0, Errors: 0, Skipped: 0, Time elapsed: 0 sec - in org.apache.commons.lang3.reflect.TypeLiteralTest
Running org.apache.commons.lang3.reflect.TypeUtilsTest
Tests run: 19, Failures: 0, Errors: 0, Skipped: 0, Time elapsed: 0.044 sec - in org.apache.commons.lang3.reflect.TypeUtilsTest
Running org.apache.commons.lang3.mutable.MutableByteTest
Tests run: 17, Failures: 0, Errors: 0, Skipped: 0, Time elapsed: 0.005 sec - in org.apache.commons.lang3.mutable.MutableByteTest
Running org.apache.commons.lang3.mutable.MutableShortTest
Tests run: 14, Failures: 0, Errors: 0, Skipped: 0, Time elapsed: 0.005 sec - in org.apache.commons.lang3.mutable.MutableShortTest
Running org.apache.commons.lang3.mutable.MutableIntTest
Tests run: 17, Failures: 0, Errors: 0, Skipped: 0, Time elapsed: 0.005 sec - in org.apache.commons.lang3.mutable.MutableIntTest
Running org.apache.commons.lang3.mutable.MutableDoubleTest
Tests run: 18, Failures: 0, Errors: 0, Skipped: 0, Time elapsed: 0.007 sec - in org.apache.commons.lang3.mutable.MutableDoubleTest
Running org.apache.commons.lang3.mutable.MutableFloatTest
Tests run: 18, Failures: 0, Errors: 0, Skipped: 0, Time elapsed: 0.005 sec - in org.apache.commons.lang3.mutable.MutableFloatTest
Running org.apache.commons.lang3.mutable.MutableLongTest
Tests run: 17, Failures: 0, Errors: 0, Skipped: 0, Time elapsed: 0.008 sec - in org.apache.commons.lang3.mutable.MutableLongTest
Running org.apache.commons.lang3.mutable.MutableBooleanTest
Tests run: 9, Failures: 0, Errors: 0, Skipped: 0, Time elapsed: 0.005 sec - in org.apache.commons.lang3.mutable.MutableBooleanTest
Running org.apache.commons.lang3.mutable.MutableObjectTest
Tests run: 5, Failures: 0, Errors: 0, Skipped: 0, Time elapsed: 0.001 sec - in org.apache.commons.lang3.mutable.MutableObjectTest
Running org.apache.commons.lang3.text.translate.UnicodeEscaperTest
Tests run: 3, Failures: 0, Errors: 0, Skipped: 0, Time elapsed: 0 sec - in org.apache.commons.lang3.text.translate.UnicodeEscaperTest
Running org.apache.commons.lang3.text.translate.EntityArraysTest
Tests run: 3, Failures: 0, Errors: 0, Skipped: 0, Time elapsed: 0.001 sec - in org.apache.commons.lang3.text.translate.EntityArraysTest
Running org.apache.commons.lang3.text.translate.UnicodeUnpairedSurrogateRemoverTest
Tests run: 2, Failures: 0, Errors: 0, Skipped: 0, Time elapsed: 0 sec - in org.apache.commons.lang3.text.translate.UnicodeUnpairedSurrogateRemoverTest
Running org.apache.commons.lang3.text.translate.NumericEntityUnescaperTest
Tests run: 3, Failures: 0, Errors: 0, Skipped: 0, Time elapsed: 0.001 sec - in org.apache.commons.lang3.text.translate.NumericEntityUnescaperTest
Running org.apache.commons.lang3.text.translate.NumericEntityEscaperTest
Tests run: 4, Failures: 0, Errors: 0, Skipped: 0, Time elapsed: 0.001 sec - in org.apache.commons.lang3.text.translate.NumericEntityEscaperTest
Running org.apache.commons.lang3.text.translate.LookupTranslatorTest
Tests run: 2, Failures: 0, Errors: 0, Skipped: 0, Time elapsed: 0 sec - in org.apache.commons.lang3.text.translate.LookupTranslatorTest
Running org.apache.commons.lang3.text.translate.UnicodeUnescaperTest
Tests run: 3, Failures: 0, Errors: 0, Skipped: 0, Time elapsed: 0.002 sec - in org.apache.commons.lang3.text.translate.UnicodeUnescaperTest
Running org.apache.commons.lang3.text.translate.OctalUnescaperTest
Tests run: 1, Failures: 0, Errors: 0, Skipped: 0, Time elapsed: 0 sec - in org.apache.commons.lang3.text.translate.OctalUnescaperTest
Running org.apache.commons.lang3.text.StrMatcherTest
Tests run: 14, Failures: 0, Errors: 0, Skipped: 0, Time elapsed: 0.005 sec - in org.apache.commons.lang3.text.StrMatcherTest
Running org.apache.commons.lang3.text.StrTokenizerTest
Tests run: 55, Failures: 0, Errors: 0, Skipped: 0, Time elapsed: 0.012 sec - in org.apache.commons.lang3.text.StrTokenizerTest
Running org.apache.commons.lang3.text.FormattableUtilsTest
Tests run: 5, Failures: 0, Errors: 0, Skipped: 0, Time elapsed: 0 sec - in org.apache.commons.lang3.text.FormattableUtilsTest
Running org.apache.commons.lang3.text.CompositeFormatTest
Tests run: 2, Failures: 0, Errors: 0, Skipped: 0, Time elapsed: 0.004 sec - in org.apache.commons.lang3.text.CompositeFormatTest
Running org.apache.commons.lang3.text.WordUtilsTest
Tests run: 12, Failures: 0, Errors: 0, Skipped: 0, Time elapsed: 0 sec - in org.apache.commons.lang3.text.WordUtilsTest
Running org.apache.commons.lang3.text.StrLookupTest
Tests run: 5, Failures: 0, Errors: 0, Skipped: 0, Time elapsed: 0.001 sec - in org.apache.commons.lang3.text.StrLookupTest
Running org.apache.commons.lang3.text.StrBuilderAppendInsertTest
Tests run: 51, Failures: 4, Errors: 2, Skipped: 0, Time elapsed: 0.019 sec <<< FAILURE! - in org.apache.commons.lang3.text.StrBuilderAppendInsertTest
testAppend_StrBuilder_int_int(org.apache.commons.lang3.text.StrBuilderAppendInsertTest)  Time elapsed: 0.004 sec  <<< ERROR!
java.lang.StringIndexOutOfBoundsException: length must be valid
	at org.apache.commons.lang3.text.StrBuilder.append(StrBuilder.java:197)
	at org.apache.commons.lang3.text.StrBuilderAppendInsertTest.testAppend_StrBuilder_int_int(StrBuilderAppendInsertTest.java:388)

testAppendNewLine(org.apache.commons.lang3.text.StrBuilderAppendInsertTest)  Time elapsed: 0.001 sec  <<< FAILURE!
org.junit.ComparisonFailure: expected:<[---]
+++> but was:<[]
+++>
	at org.junit.Assert.assertEquals(Assert.java:115)
	at org.junit.Assert.assertEquals(Assert.java:144)
	at org.apache.commons.lang3.text.StrBuilderAppendInsertTest.testAppendNewLine(StrBuilderAppendInsertTest.java:54)

testAppendln_StrBuilder(org.apache.commons.lang3.text.StrBuilderAppendInsertTest)  Time elapsed: 0 sec  <<< FAILURE!
org.junit.ComparisonFailure: expected:<[foo]
> but was:<[]
>
	at org.junit.Assert.assertEquals(Assert.java:115)
	at org.junit.Assert.assertEquals(Assert.java:144)
	at org.apache.commons.lang3.text.StrBuilderAppendInsertTest.testAppendln_StrBuilder(StrBuilderAppendInsertTest.java:747)

testAppend_StrBuilder(org.apache.commons.lang3.text.StrBuilderAppendInsertTest)  Time elapsed: 0.001 sec  <<< FAILURE!
org.junit.ComparisonFailure: expected:<[foo]> but was:<[]>
	at org.junit.Assert.assertEquals(Assert.java:115)
	at org.junit.Assert.assertEquals(Assert.java:144)
	at org.apache.commons.lang3.text.StrBuilderAppendInsertTest.testAppend_StrBuilder(StrBuilderAppendInsertTest.java:371)

testAppend_Object(org.apache.commons.lang3.text.StrBuilderAppendInsertTest)  Time elapsed: 0 sec  <<< FAILURE!
org.junit.ComparisonFailure: expected:<foobaz[yes]> but was:<foobaz[]>
	at org.junit.Assert.assertEquals(Assert.java:115)
	at org.junit.Assert.assertEquals(Assert.java:144)
	at org.apache.commons.lang3.text.StrBuilderAppendInsertTest.testAppend_Object(StrBuilderAppendInsertTest.java:113)

testAppendln_StrBuilder_int_int(org.apache.commons.lang3.text.StrBuilderAppendInsertTest)  Time elapsed: 0 sec  <<< ERROR!
java.lang.StringIndexOutOfBoundsException: length must be valid
	at org.apache.commons.lang3.text.StrBuilder.append(StrBuilder.java:197)
	at org.apache.commons.lang3.text.StrBuilderAppendInsertTest$10.append(StrBuilderAppendInsertTest.java:762)
	at org.apache.commons.lang3.text.StrBuilder.appendln(StrBuilder.java:247)
	at org.apache.commons.lang3.text.StrBuilderAppendInsertTest.testAppendln_StrBuilder_int_int(StrBuilderAppendInsertTest.java:770)

Running org.apache.commons.lang3.text.ExtendedMessageFormatTest
Tests run: 10, Failures: 0, Errors: 0, Skipped: 0, Time elapsed: 0.859 sec - in org.apache.commons.lang3.text.ExtendedMessageFormatTest
Running org.apache.commons.lang3.text.StrSubstitutorTest
Tests run: 40, Failures: 11, Errors: 15, Skipped: 0, Time elapsed: 0.034 sec <<< FAILURE! - in org.apache.commons.lang3.text.StrSubstitutorTest
testReplaceEscaping(org.apache.commons.lang3.text.StrSubstitutorTest)  Time elapsed: 0.001 sec  <<< ERROR!
java.lang.ArrayIndexOutOfBoundsException: 32
	at org.apache.commons.lang3.text.StrMatcher$StringMatcher.isMatch(StrMatcher.java:372)
	at org.apache.commons.lang3.text.StrSubstitutor.substitute(StrSubstitutor.java:764)
	at org.apache.commons.lang3.text.StrSubstitutor.substitute(StrSubstitutor.java:735)
	at org.apache.commons.lang3.text.StrSubstitutor.replace(StrSubstitutor.java:395)
	at org.apache.commons.lang3.text.StrSubstitutorTest.doTestReplace(StrSubstitutorTest.java:634)
	at org.apache.commons.lang3.text.StrSubstitutorTest.testReplaceEscaping(StrSubstitutorTest.java:163)

testReplaceSoloEscaping(org.apache.commons.lang3.text.StrSubstitutorTest)  Time elapsed: 0.001 sec  <<< FAILURE!
org.junit.ComparisonFailure: expected:<$[]{animal}> but was:<$[$]{animal}>
	at org.junit.Assert.assertEquals(Assert.java:115)
	at org.junit.Assert.assertEquals(Assert.java:144)
	at org.apache.commons.lang3.text.StrSubstitutorTest.doTestReplace(StrSubstitutorTest.java:634)
	at org.apache.commons.lang3.text.StrSubstitutorTest.testReplaceSoloEscaping(StrSubstitutorTest.java:171)

testReplaceNoPrefixSuffix(org.apache.commons.lang3.text.StrSubstitutorTest)  Time elapsed: 0 sec  <<< ERROR!
java.lang.ArrayIndexOutOfBoundsException: 32
	at org.apache.commons.lang3.text.StrMatcher$StringMatcher.isMatch(StrMatcher.java:372)
	at org.apache.commons.lang3.text.StrSubstitutor.substitute(StrSubstitutor.java:764)
	at org.apache.commons.lang3.text.StrSubstitutor.substitute(StrSubstitutor.java:735)
	at org.apache.commons.lang3.text.StrSubstitutor.replace(StrSubstitutor.java:395)
	at org.apache.commons.lang3.text.StrSubstitutorTest.doTestReplace(StrSubstitutorTest.java:634)
	at org.apache.commons.lang3.text.StrSubstitutorTest.testReplaceNoPrefixSuffix(StrSubstitutorTest.java:212)

testCyclicReplacement(org.apache.commons.lang3.text.StrSubstitutorTest)  Time elapsed: 0 sec  <<< ERROR!
java.lang.ArrayIndexOutOfBoundsException: 32
	at org.apache.commons.lang3.text.StrMatcher$StringMatcher.isMatch(StrMatcher.java:372)
	at org.apache.commons.lang3.text.StrSubstitutor.substitute(StrSubstitutor.java:764)
	at org.apache.commons.lang3.text.StrSubstitutor.substitute(StrSubstitutor.java:735)
	at org.apache.commons.lang3.text.StrSubstitutor.replace(StrSubstitutor.java:395)
	at org.apache.commons.lang3.text.StrSubstitutorTest.testCyclicReplacement(StrSubstitutorTest.java:251)

testReplaceToIdentical(org.apache.commons.lang3.text.StrSubstitutorTest)  Time elapsed: 0.001 sec  <<< FAILURE!
org.junit.ComparisonFailure: expected:<[The ${animal} jumps.]> but was:<[]>
	at org.junit.Assert.assertEquals(Assert.java:115)
	at org.junit.Assert.assertEquals(Assert.java:144)
	at org.apache.commons.lang3.text.StrSubstitutorTest.doTestReplace(StrSubstitutorTest.java:662)
	at org.apache.commons.lang3.text.StrSubstitutorTest.testReplaceToIdentical(StrSubstitutorTest.java:231)

testReplaceSimple(org.apache.commons.lang3.text.StrSubstitutorTest)  Time elapsed: 0.001 sec  <<< ERROR!
java.lang.ArrayIndexOutOfBoundsException: 32
	at org.apache.commons.lang3.text.StrMatcher$StringMatcher.isMatch(StrMatcher.java:372)
	at org.apache.commons.lang3.text.StrSubstitutor.substitute(StrSubstitutor.java:764)
	at org.apache.commons.lang3.text.StrSubstitutor.substitute(StrSubstitutor.java:735)
	at org.apache.commons.lang3.text.StrSubstitutor.replace(StrSubstitutor.java:395)
	at org.apache.commons.lang3.text.StrSubstitutorTest.doTestReplace(StrSubstitutorTest.java:634)
	at org.apache.commons.lang3.text.StrSubstitutorTest.testReplaceSimple(StrSubstitutorTest.java:63)

testReplaceRecursive(org.apache.commons.lang3.text.StrSubstitutorTest)  Time elapsed: 0 sec  <<< ERROR!
java.lang.ArrayIndexOutOfBoundsException: 32
	at org.apache.commons.lang3.text.StrMatcher$StringMatcher.isMatch(StrMatcher.java:372)
	at org.apache.commons.lang3.text.StrSubstitutor.substitute(StrSubstitutor.java:764)
	at org.apache.commons.lang3.text.StrSubstitutor.substitute(StrSubstitutor.java:735)
	at org.apache.commons.lang3.text.StrSubstitutor.replace(StrSubstitutor.java:395)
	at org.apache.commons.lang3.text.StrSubstitutorTest.doTestReplace(StrSubstitutorTest.java:634)
	at org.apache.commons.lang3.text.StrSubstitutorTest.testReplaceRecursive(StrSubstitutorTest.java:152)

testConstructorMapPrefixSuffix(org.apache.commons.lang3.text.StrSubstitutorTest)  Time elapsed: 0 sec  <<< FAILURE!
org.junit.ComparisonFailure: expected:<Hi [< commons]> but was:<Hi [$< <name>]>
	at org.junit.Assert.assertEquals(Assert.java:115)
	at org.junit.Assert.assertEquals(Assert.java:144)
	at org.apache.commons.lang3.text.StrSubstitutorTest.testConstructorMapPrefixSuffix(StrSubstitutorTest.java:441)

testReplaceUnknownKey(org.apache.commons.lang3.text.StrSubstitutorTest)  Time elapsed: 0.001 sec  <<< ERROR!
java.lang.ArrayIndexOutOfBoundsException: 32
	at org.apache.commons.lang3.text.StrMatcher$StringMatcher.isMatch(StrMatcher.java:372)
	at org.apache.commons.lang3.text.StrSubstitutor.substitute(StrSubstitutor.java:764)
	at org.apache.commons.lang3.text.StrSubstitutor.substitute(StrSubstitutor.java:735)
	at org.apache.commons.lang3.text.StrSubstitutor.replace(StrSubstitutor.java:395)
	at org.apache.commons.lang3.text.StrSubstitutorTest.doTestReplace(StrSubstitutorTest.java:634)
	at org.apache.commons.lang3.text.StrSubstitutorTest.testReplaceUnknownKey(StrSubstitutorTest.java:113)

testReplaceNoPrefixNoSuffix(org.apache.commons.lang3.text.StrSubstitutorTest)  Time elapsed: 0 sec  <<< ERROR!
java.lang.ArrayIndexOutOfBoundsException: 32
	at org.apache.commons.lang3.text.StrMatcher$StringMatcher.isMatch(StrMatcher.java:372)
	at org.apache.commons.lang3.text.StrSubstitutor.substitute(StrSubstitutor.java:764)
	at org.apache.commons.lang3.text.StrSubstitutor.substitute(StrSubstitutor.java:735)
	at org.apache.commons.lang3.text.StrSubstitutor.replace(StrSubstitutor.java:395)
	at org.apache.commons.lang3.text.StrSubstitutorTest.doTestReplace(StrSubstitutorTest.java:634)
	at org.apache.commons.lang3.text.StrSubstitutorTest.testReplaceNoPrefixNoSuffix(StrSubstitutorTest.java:188)

testReplaceInVariableRecursive(org.apache.commons.lang3.text.StrSubstitutorTest)  Time elapsed: 0.001 sec  <<< ERROR!
java.lang.ArrayIndexOutOfBoundsException: 32
	at org.apache.commons.lang3.text.StrMatcher$StringMatcher.isMatch(StrMatcher.java:372)
	at org.apache.commons.lang3.text.StrSubstitutor.substitute(StrSubstitutor.java:764)
	at org.apache.commons.lang3.text.StrSubstitutor.substitute(StrSubstitutor.java:735)
	at org.apache.commons.lang3.text.StrSubstitutor.replace(StrSubstitutor.java:395)
	at org.apache.commons.lang3.text.StrSubstitutorTest.testReplaceInVariableRecursive(StrSubstitutorTest.java:357)

testReplaceAdjacentAtEnd(org.apache.commons.lang3.text.StrSubstitutorTest)  Time elapsed: 0 sec  <<< FAILURE!
org.junit.ComparisonFailure: expected:<Amount is [GBP12.50]> but was:<Amount is [${code}${amount}]>
	at org.junit.Assert.assertEquals(Assert.java:115)
	at org.junit.Assert.assertEquals(Assert.java:144)
	at org.apache.commons.lang3.text.StrSubstitutorTest.testReplaceAdjacentAtEnd(StrSubstitutorTest.java:136)

testReplaceSolo(org.apache.commons.lang3.text.StrSubstitutorTest)  Time elapsed: 0.001 sec  <<< FAILURE!
org.junit.ComparisonFailure: expected:<[quick brown fox]> but was:<[${animal}]>
	at org.junit.Assert.assertEquals(Assert.java:115)
	at org.junit.Assert.assertEquals(Assert.java:144)
	at org.apache.commons.lang3.text.StrSubstitutorTest.doTestReplace(StrSubstitutorTest.java:634)
	at org.apache.commons.lang3.text.StrSubstitutorTest.testReplaceSolo(StrSubstitutorTest.java:71)

testReplaceChangedMap(org.apache.commons.lang3.text.StrSubstitutorTest)  Time elapsed: 0 sec  <<< ERROR!
java.lang.ArrayIndexOutOfBoundsException: 32
	at org.apache.commons.lang3.text.StrMatcher$StringMatcher.isMatch(StrMatcher.java:372)
	at org.apache.commons.lang3.text.StrSubstitutor.substitute(StrSubstitutor.java:764)
	at org.apache.commons.lang3.text.StrSubstitutor.substitute(StrSubstitutor.java:735)
	at org.apache.commons.lang3.text.StrSubstitutor.replace(StrSubstitutor.java:395)
	at org.apache.commons.lang3.text.StrSubstitutorTest.testReplaceChangedMap(StrSubstitutorTest.java:105)

testReplaceWeirdPattens(org.apache.commons.lang3.text.StrSubstitutorTest)  Time elapsed: 0.001 sec  <<< FAILURE!
org.junit.ComparisonFailure: expected:<[${}]> but was:<[]>
	at org.junit.Assert.assertEquals(Assert.java:115)
	at org.junit.Assert.assertEquals(Assert.java:144)
	at org.apache.commons.lang3.text.StrSubstitutorTest.doTestNoReplace(StrSubstitutorTest.java:723)
	at org.apache.commons.lang3.text.StrSubstitutorTest.testReplaceWeirdPattens(StrSubstitutorTest.java:274)

testReplaceEmptyKeys(org.apache.commons.lang3.text.StrSubstitutorTest)  Time elapsed: 0.001 sec  <<< FAILURE!
org.junit.ComparisonFailure: expected:<... ${} jumps over the [lazy dog].> but was:<... ${} jumps over the [${target}].>
	at org.junit.Assert.assertEquals(Assert.java:115)
	at org.junit.Assert.assertEquals(Assert.java:144)
	at org.apache.commons.lang3.text.StrSubstitutorTest.doTestReplace(StrSubstitutorTest.java:634)
	at org.apache.commons.lang3.text.StrSubstitutorTest.testReplaceEmptyKeys(StrSubstitutorTest.java:220)

testDefaultValueDelimiters(org.apache.commons.lang3.text.StrSubstitutorTest)  Time elapsed: 0.001 sec  <<< ERROR!
java.lang.ArrayIndexOutOfBoundsException: 32
	at org.apache.commons.lang3.text.StrMatcher$StringMatcher.isMatch(StrMatcher.java:372)
	at org.apache.commons.lang3.text.StrSubstitutor.substitute(StrSubstitutor.java:764)
	at org.apache.commons.lang3.text.StrSubstitutor.substitute(StrSubstitutor.java:735)
	at org.apache.commons.lang3.text.StrSubstitutor.replace(StrSubstitutor.java:395)
	at org.apache.commons.lang3.text.StrSubstitutorTest.testDefaultValueDelimiters(StrSubstitutorTest.java:374)

testReplaceNoVariables(org.apache.commons.lang3.text.StrSubstitutorTest)  Time elapsed: 0 sec  <<< FAILURE!
org.junit.ComparisonFailure: expected:<[The balloon arrived.]> but was:<[]>
	at org.junit.Assert.assertEquals(Assert.java:115)
	at org.junit.Assert.assertEquals(Assert.java:144)
	at org.apache.commons.lang3.text.StrSubstitutorTest.doTestNoReplace(StrSubstitutorTest.java:723)
	at org.apache.commons.lang3.text.StrSubstitutorTest.testReplaceNoVariables(StrSubstitutorTest.java:79)

testReplaceComplexEscaping(org.apache.commons.lang3.text.StrSubstitutorTest)  Time elapsed: 0 sec  <<< ERROR!
java.lang.ArrayIndexOutOfBoundsException: 32
	at org.apache.commons.lang3.text.StrMatcher$StringMatcher.isMatch(StrMatcher.java:372)
	at org.apache.commons.lang3.text.StrSubstitutor.substitute(StrSubstitutor.java:764)
	at org.apache.commons.lang3.text.StrSubstitutor.substitute(StrSubstitutor.java:735)
	at org.apache.commons.lang3.text.StrSubstitutor.replace(StrSubstitutor.java:395)
	at org.apache.commons.lang3.text.StrSubstitutorTest.doTestReplace(StrSubstitutorTest.java:634)
	at org.apache.commons.lang3.text.StrSubstitutorTest.testReplaceComplexEscaping(StrSubstitutorTest.java:179)

testReplaceInVariable(org.apache.commons.lang3.text.StrSubstitutorTest)  Time elapsed: 0 sec  <<< ERROR!
java.lang.ArrayIndexOutOfBoundsException: 32
	at org.apache.commons.lang3.text.StrMatcher$StringMatcher.isMatch(StrMatcher.java:372)
	at org.apache.commons.lang3.text.StrSubstitutor.substitute(StrSubstitutor.java:764)
	at org.apache.commons.lang3.text.StrSubstitutor.substitute(StrSubstitutor.java:735)
	at org.apache.commons.lang3.text.StrSubstitutor.replace(StrSubstitutor.java:395)
	at org.apache.commons.lang3.text.StrSubstitutorTest.testReplaceInVariable(StrSubstitutorTest.java:311)

testReplacePrefixNoSuffix(org.apache.commons.lang3.text.StrSubstitutorTest)  Time elapsed: 0.001 sec  <<< ERROR!
java.lang.ArrayIndexOutOfBoundsException: 32
	at org.apache.commons.lang3.text.StrMatcher$StringMatcher.isMatch(StrMatcher.java:372)
	at org.apache.commons.lang3.text.StrSubstitutor.substitute(StrSubstitutor.java:764)
	at org.apache.commons.lang3.text.StrSubstitutor.substitute(StrSubstitutor.java:735)
	at org.apache.commons.lang3.text.StrSubstitutor.replace(StrSubstitutor.java:395)
	at org.apache.commons.lang3.text.StrSubstitutorTest.doTestReplace(StrSubstitutorTest.java:634)
	at org.apache.commons.lang3.text.StrSubstitutorTest.testReplacePrefixNoSuffix(StrSubstitutorTest.java:204)

testResolveVariable(org.apache.commons.lang3.text.StrSubstitutorTest)  Time elapsed: 0.001 sec  <<< FAILURE!
org.junit.ComparisonFailure: expected:<[Hi jakarta!]> but was:<[]>
	at org.junit.Assert.assertEquals(Assert.java:115)
	at org.junit.Assert.assertEquals(Assert.java:144)
	at org.apache.commons.lang3.text.StrSubstitutorTest.testResolveVariable(StrSubstitutorTest.java:420)

testReplaceInVariableDisabled(org.apache.commons.lang3.text.StrSubstitutorTest)  Time elapsed: 0 sec  <<< ERROR!
java.lang.ArrayIndexOutOfBoundsException: 32
	at org.apache.commons.lang3.text.StrMatcher$StringMatcher.isMatch(StrMatcher.java:372)
	at org.apache.commons.lang3.text.StrSubstitutor.substitute(StrSubstitutor.java:764)
	at org.apache.commons.lang3.text.StrSubstitutor.substitute(StrSubstitutor.java:735)
	at org.apache.commons.lang3.text.StrSubstitutor.replace(StrSubstitutor.java:395)
	at org.apache.commons.lang3.text.StrSubstitutorTest.testReplaceInVariableDisabled(StrSubstitutorTest.java:335)

testReplaceIncompletePrefix(org.apache.commons.lang3.text.StrSubstitutorTest)  Time elapsed: 0.001 sec  <<< ERROR!
java.lang.ArrayIndexOutOfBoundsException: 32
	at org.apache.commons.lang3.text.StrMatcher$StringMatcher.isMatch(StrMatcher.java:372)
	at org.apache.commons.lang3.text.StrSubstitutor.substitute(StrSubstitutor.java:764)
	at org.apache.commons.lang3.text.StrSubstitutor.substitute(StrSubstitutor.java:735)
	at org.apache.commons.lang3.text.StrSubstitutor.replace(StrSubstitutor.java:395)
	at org.apache.commons.lang3.text.StrSubstitutorTest.doTestReplace(StrSubstitutorTest.java:634)
	at org.apache.commons.lang3.text.StrSubstitutorTest.testReplaceIncompletePrefix(StrSubstitutorTest.java:196)

testReplaceAdjacentAtStart(org.apache.commons.lang3.text.StrSubstitutorTest)  Time elapsed: 0 sec  <<< FAILURE!
org.junit.ComparisonFailure: expected:<[GBP12.50] charged> but was:<[${code}${amount}] charged>
	at org.junit.Assert.assertEquals(Assert.java:115)
	at org.junit.Assert.assertEquals(Assert.java:144)
	at org.apache.commons.lang3.text.StrSubstitutorTest.testReplaceAdjacentAtStart(StrSubstitutorTest.java:125)

testConstructorMapFull(org.apache.commons.lang3.text.StrSubstitutorTest)  Time elapsed: 0.001 sec  <<< FAILURE!
org.junit.ComparisonFailure: expected:<Hi [< commons]> but was:<Hi [!< <name>]>
	at org.junit.Assert.assertEquals(Assert.java:115)
	at org.junit.Assert.assertEquals(Assert.java:144)
	at org.apache.commons.lang3.text.StrSubstitutorTest.testConstructorMapFull(StrSubstitutorTest.java:452)

Running org.apache.commons.lang3.text.StrBuilderTest
Tests run: 90, Failures: 45, Errors: 4, Skipped: 0, Time elapsed: 0.086 sec <<< FAILURE! - in org.apache.commons.lang3.text.StrBuilderTest
testDeleteFirst_StrMatcher(org.apache.commons.lang3.text.StrBuilderTest)  Time elapsed: 0 sec  <<< FAILURE!
org.junit.ComparisonFailure: expected:<[A0xA1A2yA3]> but was:<[]>
	at org.junit.Assert.assertEquals(Assert.java:115)
	at org.junit.Assert.assertEquals(Assert.java:144)
	at org.apache.commons.lang3.text.StrBuilderTest.testDeleteFirst_StrMatcher(StrBuilderTest.java:727)

testReplaceFirst_StrMatcher_String(org.apache.commons.lang3.text.StrBuilderTest)  Time elapsed: 0 sec  <<< FAILURE!
org.junit.ComparisonFailure: expected:<[abcbccba]> but was:<[]>
	at org.junit.Assert.assertEquals(Assert.java:115)
	at org.junit.Assert.assertEquals(Assert.java:144)
	at org.apache.commons.lang3.text.StrBuilderTest.testReplaceFirst_StrMatcher_String(StrBuilderTest.java:908)

testDeleteAll_String(org.apache.commons.lang3.text.StrBuilderTest)  Time elapsed: 0 sec  <<< FAILURE!
org.junit.ComparisonFailure: expected:<[abcbccba]> but was:<[]>
	at org.junit.Assert.assertEquals(Assert.java:115)
	at org.junit.Assert.assertEquals(Assert.java:144)
	at org.apache.commons.lang3.text.StrBuilderTest.testDeleteAll_String(StrBuilderTest.java:657)

testReadFromReaderAppendsToEnd(org.apache.commons.lang3.text.StrBuilderTest)  Time elapsed: 0.001 sec  <<< FAILURE!
org.junit.ComparisonFailure: expected:<[Test] 123> but was:<[] 123>
	at org.junit.Assert.assertEquals(Assert.java:115)
	at org.junit.Assert.assertEquals(Assert.java:144)
	at org.apache.commons.lang3.text.StrBuilderTest.testReadFromReaderAppendsToEnd(StrBuilderTest.java:118)

testSubSequenceIntInt(org.apache.commons.lang3.text.StrBuilderTest)  Time elapsed: 0 sec  <<< ERROR!
java.lang.StringIndexOutOfBoundsException: String index out of range: 5
	at org.apache.commons.lang3.text.StrBuilder.subSequence(StrBuilder.java:487)
	at org.apache.commons.lang3.text.StrBuilderTest.testSubSequenceIntInt(StrBuilderTest.java:1222)

testLastIndexOf_String(org.apache.commons.lang3.text.StrBuilderTest)  Time elapsed: 0 sec  <<< FAILURE!
java.lang.AssertionError: expected:<2> but was:<-1>
	at org.junit.Assert.fail(Assert.java:88)
	at org.junit.Assert.failNotEquals(Assert.java:834)
	at org.junit.Assert.assertEquals(Assert.java:645)
	at org.junit.Assert.assertEquals(Assert.java:631)
	at org.apache.commons.lang3.text.StrBuilderTest.testLastIndexOf_String(StrBuilderTest.java:1470)

testDeleteAll_char(org.apache.commons.lang3.text.StrBuilderTest)  Time elapsed: 0 sec  <<< FAILURE!
org.junit.ComparisonFailure: expected:<[abcbccba]> but was:<[]>
	at org.junit.Assert.assertEquals(Assert.java:115)
	at org.junit.Assert.assertEquals(Assert.java:144)
	at org.apache.commons.lang3.text.StrBuilderTest.testDeleteAll_char(StrBuilderTest.java:622)

testReplace_StrMatcher_String_int_int_int_VaryEndIndex(org.apache.commons.lang3.text.StrBuilderTest)  Time elapsed: 0.001 sec  <<< FAILURE!
org.junit.ComparisonFailure: expected:<[aaxaaaayaa]> but was:<[]>
	at org.junit.Assert.assertEquals(Assert.java:115)
	at org.junit.Assert.assertEquals(Assert.java:144)
	at org.apache.commons.lang3.text.StrBuilderTest.testReplace_StrMatcher_String_int_int_int_VaryEndIndex(StrBuilderTest.java:1048)

testLastIndexOf_char_int(org.apache.commons.lang3.text.StrBuilderTest)  Time elapsed: 0.001 sec  <<< FAILURE!
java.lang.AssertionError: expected:<0> but was:<-1>
	at org.junit.Assert.fail(Assert.java:88)
	at org.junit.Assert.failNotEquals(Assert.java:834)
	at org.junit.Assert.assertEquals(Assert.java:645)
	at org.junit.Assert.assertEquals(Assert.java:631)
	at org.apache.commons.lang3.text.StrBuilderTest.testLastIndexOf_char_int(StrBuilderTest.java:1389)

testAppendToStringBuffer(org.apache.commons.lang3.text.StrBuilderTest)  Time elapsed: 0 sec  <<< FAILURE!
org.junit.ComparisonFailure: expected:<Test [1234567890]> but was:<Test []>
	at org.junit.Assert.assertEquals(Assert.java:115)
	at org.junit.Assert.assertEquals(Assert.java:144)
	at org.apache.commons.lang3.text.StrBuilderTest.testAppendToStringBuffer(StrBuilderTest.java:1985)

testRightString(org.apache.commons.lang3.text.StrBuilderTest)  Time elapsed: 0 sec  <<< FAILURE!
org.junit.ComparisonFailure: expected:<[right]> but was:<[]>
	at org.junit.Assert.assertEquals(Assert.java:115)
	at org.junit.Assert.assertEquals(Assert.java:144)
	at org.apache.commons.lang3.text.StrBuilderTest.testRightString(StrBuilderTest.java:1284)

testToString(org.apache.commons.lang3.text.StrBuilderTest)  Time elapsed: 0 sec  <<< FAILURE!
org.junit.ComparisonFailure: expected:<[abc]> but was:<[]>
	at org.junit.Assert.assertEquals(Assert.java:115)
	at org.junit.Assert.assertEquals(Assert.java:144)
	at org.apache.commons.lang3.text.StrBuilderTest.testToString(StrBuilderTest.java:1873)

testConstructors(org.apache.commons.lang3.text.StrBuilderTest)  Time elapsed: 0.001 sec  <<< ERROR!
java.lang.NullPointerException: null
	at org.apache.commons.lang3.text.StrBuilder.<init>(StrBuilder.java:32)
	at org.apache.commons.lang3.text.StrBuilderTest.testConstructors(StrBuilderTest.java:68)

testSubstringIntInt(org.apache.commons.lang3.text.StrBuilderTest)  Time elapsed: 0.001 sec  <<< FAILURE!
org.junit.ComparisonFailure: expected:<[hello]> but was:<[]>
	at org.junit.Assert.assertEquals(Assert.java:115)
	at org.junit.Assert.assertEquals(Assert.java:144)
	at org.apache.commons.lang3.text.StrBuilderTest.testSubstringIntInt(StrBuilderTest.java:1250)

testContains_String(org.apache.commons.lang3.text.StrBuilderTest)  Time elapsed: 0 sec  <<< FAILURE!
java.lang.AssertionError: null
	at org.junit.Assert.fail(Assert.java:86)
	at org.junit.Assert.assertTrue(Assert.java:41)
	at org.junit.Assert.assertTrue(Assert.java:52)
	at org.apache.commons.lang3.text.StrBuilderTest.testContains_String(StrBuilderTest.java:1312)

testReadFromReadableAppendsToEnd(org.apache.commons.lang3.text.StrBuilderTest)  Time elapsed: 0.001 sec  <<< FAILURE!
org.junit.ComparisonFailure: expected:<[Test] 123> but was:<[] 123>
	at org.junit.Assert.assertEquals(Assert.java:115)
	at org.junit.Assert.assertEquals(Assert.java:144)
	at org.apache.commons.lang3.text.StrBuilderTest.testReadFromReadableAppendsToEnd(StrBuilderTest.java:160)

testAsReader(org.apache.commons.lang3.text.StrBuilderTest)  Time elapsed: 0.001 sec  <<< FAILURE!
java.lang.AssertionError: null
	at org.junit.Assert.fail(Assert.java:86)
	at org.junit.Assert.assertTrue(Assert.java:41)
	at org.junit.Assert.assertTrue(Assert.java:52)
	at org.apache.commons.lang3.text.StrBuilderTest.testAsReader(StrBuilderTest.java:1701)

testReplaceAll_String_String(org.apache.commons.lang3.text.StrBuilderTest)  Time elapsed: 0 sec  <<< FAILURE!
org.junit.ComparisonFailure: expected:<[abcbccba]> but was:<[]>
	at org.junit.Assert.assertEquals(Assert.java:115)
	at org.junit.Assert.assertEquals(Assert.java:144)
	at org.apache.commons.lang3.text.StrBuilderTest.testReplaceAll_String_String(StrBuilderTest.java:813)

testAsWriter(org.apache.commons.lang3.text.StrBuilderTest)  Time elapsed: 0 sec  <<< FAILURE!
org.junit.ComparisonFailure: expected:<[base]l> but was:<[]l>
	at org.junit.Assert.assertEquals(Assert.java:115)
	at org.junit.Assert.assertEquals(Assert.java:144)
	at org.apache.commons.lang3.text.StrBuilderTest.testAsWriter(StrBuilderTest.java:1775)

testLang294(org.apache.commons.lang3.text.StrBuilderTest)  Time elapsed: 0.001 sec  <<< FAILURE!
org.junit.ComparisonFailure: expected:<[
Do more stuff
even more stuff
]> but was:<[]>
	at org.junit.Assert.assertEquals(Assert.java:115)
	at org.junit.Assert.assertEquals(Assert.java:144)
	at org.apache.commons.lang3.text.StrBuilderTest.testLang294(StrBuilderTest.java:1901)

testReplaceAll_char_char(org.apache.commons.lang3.text.StrBuilderTest)  Time elapsed: 0 sec  <<< FAILURE!
org.junit.ComparisonFailure: expected:<[abcbccba]> but was:<[]>
	at org.junit.Assert.assertEquals(Assert.java:115)
	at org.junit.Assert.assertEquals(Assert.java:144)
	at org.apache.commons.lang3.text.StrBuilderTest.testReplaceAll_char_char(StrBuilderTest.java:781)

testLastIndexOf_String_int(org.apache.commons.lang3.text.StrBuilderTest)  Time elapsed: 0 sec  <<< FAILURE!
java.lang.AssertionError: expected:<0> but was:<-1>
	at org.junit.Assert.fail(Assert.java:88)
	at org.junit.Assert.failNotEquals(Assert.java:834)
	at org.junit.Assert.assertEquals(Assert.java:645)
	at org.junit.Assert.assertEquals(Assert.java:631)
	at org.apache.commons.lang3.text.StrBuilderTest.testLastIndexOf_String_int(StrBuilderTest.java:1493)

testDeleteCharAt(org.apache.commons.lang3.text.StrBuilderTest)  Time elapsed: 0 sec  <<< ERROR!
java.lang.StringIndexOutOfBoundsException: String index out of range: 0
	at org.apache.commons.lang3.text.StrBuilder.deleteCharAt(StrBuilder.java:70)
	at org.apache.commons.lang3.text.StrBuilderTest.testDeleteCharAt(StrBuilderTest.java:459)

testReplaceFirst_String_String(org.apache.commons.lang3.text.StrBuilderTest)  Time elapsed: 0 sec  <<< FAILURE!
org.junit.ComparisonFailure: expected:<[abcbccba]> but was:<[]>
	at org.junit.Assert.assertEquals(Assert.java:115)
	at org.junit.Assert.assertEquals(Assert.java:144)
	at org.apache.commons.lang3.text.StrBuilderTest.testReplaceFirst_String_String(StrBuilderTest.java:843)

testContains_char(org.apache.commons.lang3.text.StrBuilderTest)  Time elapsed: 0 sec  <<< FAILURE!
java.lang.AssertionError: null
	at org.junit.Assert.fail(Assert.java:86)
	at org.junit.Assert.assertTrue(Assert.java:41)
	at org.junit.Assert.assertTrue(Assert.java:52)
	at org.apache.commons.lang3.text.StrBuilderTest.testContains_char(StrBuilderTest.java:1303)

testDeleteIntInt(org.apache.commons.lang3.text.StrBuilderTest)  Time elapsed: 0 sec  <<< FAILURE!
org.junit.ComparisonFailure: expected:<[bc]> but was:<[]>
	at org.junit.Assert.assertEquals(Assert.java:115)
	at org.junit.Assert.assertEquals(Assert.java:144)
	at org.apache.commons.lang3.text.StrBuilderTest.testDeleteIntInt(StrBuilderTest.java:593)

testReplace_StrMatcher_String_int_int_int_VaryCount(org.apache.commons.lang3.text.StrBuilderTest)  Time elapsed: 0 sec  <<< FAILURE!
org.junit.ComparisonFailure: expected:<[-x--y-]> but was:<[]>
	at org.junit.Assert.assertEquals(Assert.java:115)
	at org.junit.Assert.assertEquals(Assert.java:144)
	at org.apache.commons.lang3.text.StrBuilderTest.testReplace_StrMatcher_String_int_int_int_VaryCount(StrBuilderTest.java:1102)

testReplaceFirst_char_char(org.apache.commons.lang3.text.StrBuilderTest)  Time elapsed: 0 sec  <<< FAILURE!
org.junit.ComparisonFailure: expected:<[abcbccba]> but was:<[]>
	at org.junit.Assert.assertEquals(Assert.java:115)
	at org.junit.Assert.assertEquals(Assert.java:144)
	at org.apache.commons.lang3.text.StrBuilderTest.testReplaceFirst_char_char(StrBuilderTest.java:797)

testIndexOf_char(org.apache.commons.lang3.text.StrBuilderTest)  Time elapsed: 0 sec  <<< FAILURE!
java.lang.AssertionError: expected:<0> but was:<-1>
	at org.junit.Assert.fail(Assert.java:88)
	at org.junit.Assert.failNotEquals(Assert.java:834)
	at org.junit.Assert.assertEquals(Assert.java:645)
	at org.junit.Assert.assertEquals(Assert.java:631)
	at org.apache.commons.lang3.text.StrBuilderTest.testIndexOf_char(StrBuilderTest.java:1338)

testReplace_int_int_String(org.apache.commons.lang3.text.StrBuilderTest)  Time elapsed: 0 sec  <<< FAILURE!
org.junit.ComparisonFailure: expected:<d[bc]> but was:<d[]>
	at org.junit.Assert.assertEquals(Assert.java:115)
	at org.junit.Assert.assertEquals(Assert.java:144)
	at org.apache.commons.lang3.text.StrBuilderTest.testReplace_int_int_String(StrBuilderTest.java:745)

testDeleteFirst_String(org.apache.commons.lang3.text.StrBuilderTest)  Time elapsed: 0.001 sec  <<< FAILURE!
org.junit.ComparisonFailure: expected:<[abcbccba]> but was:<[]>
	at org.junit.Assert.assertEquals(Assert.java:115)
	at org.junit.Assert.assertEquals(Assert.java:144)
	at org.apache.commons.lang3.text.StrBuilderTest.testDeleteFirst_String(StrBuilderTest.java:683)

testAppendToStringBuilder(org.apache.commons.lang3.text.StrBuilderTest)  Time elapsed: 0.001 sec  <<< FAILURE!
org.junit.ComparisonFailure: expected:<Test [1234567890]> but was:<Test []>
	at org.junit.Assert.assertEquals(Assert.java:115)
	at org.junit.Assert.assertEquals(Assert.java:144)
	at org.apache.commons.lang3.text.StrBuilderTest.testAppendToStringBuilder(StrBuilderTest.java:1975)

testMidString(org.apache.commons.lang3.text.StrBuilderTest)  Time elapsed: 0.001 sec  <<< FAILURE!
org.junit.ComparisonFailure: expected:<[goodbye]> but was:<[]>
	at org.junit.Assert.assertEquals(Assert.java:115)
	at org.junit.Assert.assertEquals(Assert.java:144)
	at org.apache.commons.lang3.text.StrBuilderTest.testMidString(StrBuilderTest.java:1273)

testReplaceAll_StrMatcher_String(org.apache.commons.lang3.text.StrBuilderTest)  Time elapsed: 0.001 sec  <<< FAILURE!
org.junit.ComparisonFailure: expected:<[abcbccba]> but was:<[]>
	at org.junit.Assert.assertEquals(Assert.java:115)
	at org.junit.Assert.assertEquals(Assert.java:144)
	at org.apache.commons.lang3.text.StrBuilderTest.testReplaceAll_StrMatcher_String(StrBuilderTest.java:874)

testReadFromCharBufferAppendsToEnd(org.apache.commons.lang3.text.StrBuilderTest)  Time elapsed: 0 sec  <<< FAILURE!
org.junit.ComparisonFailure: expected:<[Test] 123> but was:<[] 123>
	at org.junit.Assert.assertEquals(Assert.java:115)
	at org.junit.Assert.assertEquals(Assert.java:144)
	at org.apache.commons.lang3.text.StrBuilderTest.testReadFromCharBufferAppendsToEnd(StrBuilderTest.java:139)

testReplace_StrMatcher_String_int_int_int_VaryStartIndex(org.apache.commons.lang3.text.StrBuilderTest)  Time elapsed: 0.001 sec  <<< FAILURE!
org.junit.ComparisonFailure: expected:<[-x--y-]> but was:<[]>
	at org.junit.Assert.assertEquals(Assert.java:115)
	at org.junit.Assert.assertEquals(Assert.java:144)
	at org.apache.commons.lang3.text.StrBuilderTest.testReplace_StrMatcher_String_int_int_int_VaryStartIndex(StrBuilderTest.java:987)

testSubstringInt(org.apache.commons.lang3.text.StrBuilderTest)  Time elapsed: 0 sec  <<< ERROR!
java.lang.StringIndexOutOfBoundsException: end < start
	at org.apache.commons.lang3.text.StrBuilder.validateRange(StrBuilder.java:612)
	at org.apache.commons.lang3.text.StrBuilder.substring(StrBuilder.java:491)
	at org.apache.commons.lang3.text.StrBuilder.substring(StrBuilder.java:490)
	at org.apache.commons.lang3.text.StrBuilderTest.testSubstringInt(StrBuilderTest.java:1231)

testAppendToWriter(org.apache.commons.lang3.text.StrBuilderTest)  Time elapsed: 0 sec  <<< FAILURE!
org.junit.ComparisonFailure: expected:<Test [1234567890]> but was:<Test []>
	at org.junit.Assert.assertEquals(Assert.java:115)
	at org.junit.Assert.assertEquals(Assert.java:144)
	at org.apache.commons.lang3.text.StrBuilderTest.testAppendToWriter(StrBuilderTest.java:1965)

testReplace_StrMatcher_String_int_int_int_VaryMatcher(org.apache.commons.lang3.text.StrBuilderTest)  Time elapsed: 0.001 sec  <<< FAILURE!
org.junit.ComparisonFailure: expected:<[abcbccba]> but was:<[]>
	at org.junit.Assert.assertEquals(Assert.java:115)
	at org.junit.Assert.assertEquals(Assert.java:144)
	at org.apache.commons.lang3.text.StrBuilderTest.testReplace_StrMatcher_String_int_int_int_VaryMatcher(StrBuilderTest.java:943)

testLastIndexOf_char(org.apache.commons.lang3.text.StrBuilderTest)  Time elapsed: 0 sec  <<< FAILURE!
java.lang.AssertionError: expected:<2> but was:<-1>
	at org.junit.Assert.fail(Assert.java:88)
	at org.junit.Assert.failNotEquals(Assert.java:834)
	at org.junit.Assert.assertEquals(Assert.java:645)
	at org.junit.Assert.assertEquals(Assert.java:631)
	at org.apache.commons.lang3.text.StrBuilderTest.testLastIndexOf_char(StrBuilderTest.java:1375)

testLeftString(org.apache.commons.lang3.text.StrBuilderTest)  Time elapsed: 0 sec  <<< FAILURE!
org.junit.ComparisonFailure: expected:<[left]> but was:<[]>
	at org.junit.Assert.assertEquals(Assert.java:115)
	at org.junit.Assert.assertEquals(Assert.java:144)
	at org.apache.commons.lang3.text.StrBuilderTest.testLeftString(StrBuilderTest.java:1293)

testIndexOf_String_int(org.apache.commons.lang3.text.StrBuilderTest)  Time elapsed: 0.001 sec  <<< FAILURE!
java.lang.AssertionError: expected:<0> but was:<-1>
	at org.junit.Assert.fail(Assert.java:88)
	at org.junit.Assert.failNotEquals(Assert.java:834)
	at org.junit.Assert.assertEquals(Assert.java:645)
	at org.junit.Assert.assertEquals(Assert.java:631)
	at org.apache.commons.lang3.text.StrBuilderTest.testIndexOf_String_int(StrBuilderTest.java:1432)

testContains_StrMatcher(org.apache.commons.lang3.text.StrBuilderTest)  Time elapsed: 0.001 sec  <<< FAILURE!
java.lang.AssertionError: null
	at org.junit.Assert.fail(Assert.java:86)
	at org.junit.Assert.assertTrue(Assert.java:41)
	at org.junit.Assert.assertTrue(Assert.java:52)
	at org.apache.commons.lang3.text.StrBuilderTest.testContains_StrMatcher(StrBuilderTest.java:1322)

testReplace_StrMatcher_String_int_int_int_VaryReplace(org.apache.commons.lang3.text.StrBuilderTest)  Time elapsed: 0 sec  <<< FAILURE!
org.junit.ComparisonFailure: expected:<[abcbccba]> but was:<[]>
	at org.junit.Assert.assertEquals(Assert.java:115)
	at org.junit.Assert.assertEquals(Assert.java:144)
	at org.apache.commons.lang3.text.StrBuilderTest.testReplace_StrMatcher_String_int_int_int_VaryReplace(StrBuilderTest.java:964)

testDeleteFirst_char(org.apache.commons.lang3.text.StrBuilderTest)  Time elapsed: 0 sec  <<< FAILURE!
org.junit.ComparisonFailure: expected:<[abcba]> but was:<[]>
	at org.junit.Assert.assertEquals(Assert.java:115)
	at org.junit.Assert.assertEquals(Assert.java:144)
	at org.apache.commons.lang3.text.StrBuilderTest.testDeleteFirst_char(StrBuilderTest.java:639)

testAppendToCharBuffer(org.apache.commons.lang3.text.StrBuilderTest)  Time elapsed: 0 sec  <<< FAILURE!
org.junit.ComparisonFailure: expected:<Test [1234567890]> but was:<Test []>
	at org.junit.Assert.assertEquals(Assert.java:115)
	at org.junit.Assert.assertEquals(Assert.java:144)
	at org.apache.commons.lang3.text.StrBuilderTest.testAppendToCharBuffer(StrBuilderTest.java:1998)

testDeleteAll_StrMatcher(org.apache.commons.lang3.text.StrBuilderTest)  Time elapsed: 0 sec  <<< FAILURE!
org.junit.ComparisonFailure: expected:<[A0xA1A2yA3]> but was:<[]>
	at org.junit.Assert.assertEquals(Assert.java:115)
	at org.junit.Assert.assertEquals(Assert.java:144)
	at org.apache.commons.lang3.text.StrBuilderTest.testDeleteAll_StrMatcher(StrBuilderTest.java:710)

testIndexOf_String(org.apache.commons.lang3.text.StrBuilderTest)  Time elapsed: 0.001 sec  <<< FAILURE!
java.lang.AssertionError: expected:<0> but was:<-1>
	at org.junit.Assert.fail(Assert.java:88)
	at org.junit.Assert.failNotEquals(Assert.java:834)
	at org.junit.Assert.assertEquals(Assert.java:645)
	at org.junit.Assert.assertEquals(Assert.java:631)
	at org.apache.commons.lang3.text.StrBuilderTest.testIndexOf_String(StrBuilderTest.java:1410)

testIndexOf_char_int(org.apache.commons.lang3.text.StrBuilderTest)  Time elapsed: 0.001 sec  <<< FAILURE!
java.lang.AssertionError: expected:<0> but was:<-1>
	at org.junit.Assert.fail(Assert.java:88)
	at org.junit.Assert.failNotEquals(Assert.java:834)
	at org.junit.Assert.assertEquals(Assert.java:645)
	at org.junit.Assert.assertEquals(Assert.java:631)
	at org.apache.commons.lang3.text.StrBuilderTest.testIndexOf_char_int(StrBuilderTest.java:1352)

Running org.apache.commons.lang3.StringEscapeUtilsTest
Tests run: 28, Failures: 0, Errors: 0, Skipped: 0, Time elapsed: 0.336 sec - in org.apache.commons.lang3.StringEscapeUtilsTest
Running org.apache.commons.lang3.AnnotationUtilsTest
Tests run: 10, Failures: 0, Errors: 0, Skipped: 0, Time elapsed: 0.019 sec - in org.apache.commons.lang3.AnnotationUtilsTest
Running org.apache.commons.lang3.ConversionTest
Tests run: 42, Failures: 0, Errors: 0, Skipped: 0, Time elapsed: 0.016 sec - in org.apache.commons.lang3.ConversionTest
Running org.apache.commons.lang3.StringUtilsTrimEmptyTest
Tests run: 15, Failures: 0, Errors: 0, Skipped: 0, Time elapsed: 0.006 sec - in org.apache.commons.lang3.StringUtilsTrimEmptyTest
Running org.apache.commons.lang3.EnumUtilsTest
Tests run: 34, Failures: 0, Errors: 0, Skipped: 0, Time elapsed: 0.01 sec - in org.apache.commons.lang3.EnumUtilsTest
Running org.apache.commons.lang3.exception.ExceptionUtilsTest
Tests run: 28, Failures: 0, Errors: 0, Skipped: 0, Time elapsed: 0.024 sec - in org.apache.commons.lang3.exception.ExceptionUtilsTest
Running org.apache.commons.lang3.exception.DefaultExceptionContextTest
Tests run: 8, Failures: 0, Errors: 0, Skipped: 0, Time elapsed: 0.004 sec - in org.apache.commons.lang3.exception.DefaultExceptionContextTest
Running org.apache.commons.lang3.exception.ContextedExceptionTest
Tests run: 14, Failures: 0, Errors: 0, Skipped: 0, Time elapsed: 0.01 sec - in org.apache.commons.lang3.exception.ContextedExceptionTest
Running org.apache.commons.lang3.exception.ContextedRuntimeExceptionTest
Tests run: 14, Failures: 0, Errors: 0, Skipped: 0, Time elapsed: 0.012 sec - in org.apache.commons.lang3.exception.ContextedRuntimeExceptionTest
Running org.apache.commons.lang3.BitFieldTest
Tests run: 15, Failures: 0, Errors: 0, Skipped: 0, Time elapsed: 0.002 sec - in org.apache.commons.lang3.BitFieldTest
Running org.apache.commons.lang3.ArrayUtilsRemoveMultipleTest
Tests run: 55, Failures: 0, Errors: 0, Skipped: 0, Time elapsed: 0.015 sec - in org.apache.commons.lang3.ArrayUtilsRemoveMultipleTest
Running org.apache.commons.lang3.HashSetvBitSetTest
Ratio=7% array=100 count=1 extract=24113331 bitset=1914158
Ratio=11% array=100 count=10 extract=17252620 bitset=1920551
Ratio=14% array=100 count=50 extract=11069011 bitset=1650929
Ratio=4% array=100 count=100 extract=10956727 bitset=458260
Ratio=79% array=1000 count=10 extract=6910596 bitset=5518744
Ratio=31% array=1000 count=100 extract=15903644 bitset=5060315
Ratio=7% array=1000 count=500 extract=45513283 bitset=3364150
Ratio=0% array=1000 count=1000 extract=82279357 bitset=799607
Ratio=4% count=0 hash=4883809 bits=199926
Ratio=8% count=5 hash=2467471 bits=201154
Ratio=29% count=10 hash=994298 bits=289390
Ratio=25% count=200 hash=19985230 bits=5093645
Ratio=17% count=50 hash=7303857 bits=1304545
Ratio=20% count=100 hash=16167739 bits=3274310
Ratio=21% count=1000 hash=80083493 bits=17153397
Ratio=21% count=2000 hash=158379949 bits=33811715
Tests run: 2, Failures: 0, Errors: 0, Skipped: 0, Time elapsed: 0.724 sec - in org.apache.commons.lang3.HashSetvBitSetTest
Running org.apache.commons.lang3.StringUtilsTest
Tests run: 124, Failures: 0, Errors: 0, Skipped: 0, Time elapsed: 0.191 sec - in org.apache.commons.lang3.StringUtilsTest
Running org.apache.commons.lang3.ArrayUtilsRemoveTest
Tests run: 19, Failures: 0, Errors: 0, Skipped: 0, Time elapsed: 0.002 sec - in org.apache.commons.lang3.ArrayUtilsRemoveTest
Running org.apache.commons.lang3.ObjectUtilsTest
Tests run: 36, Failures: 0, Errors: 0, Skipped: 0, Time elapsed: 0.016 sec - in org.apache.commons.lang3.ObjectUtilsTest
Running org.apache.commons.lang3.ClassPathUtilsTest
Tests run: 13, Failures: 0, Errors: 0, Skipped: 0, Time elapsed: 0.006 sec - in org.apache.commons.lang3.ClassPathUtilsTest
Running org.apache.commons.lang3.math.NumberUtilsTest
Tests run: 91, Failures: 0, Errors: 0, Skipped: 0, Time elapsed: 0.041 sec - in org.apache.commons.lang3.math.NumberUtilsTest
Running org.apache.commons.lang3.math.IEEE754rUtilsTest
Tests run: 3, Failures: 0, Errors: 0, Skipped: 0, Time elapsed: 0.003 sec - in org.apache.commons.lang3.math.IEEE754rUtilsTest
Running org.apache.commons.lang3.math.FractionTest
Tests run: 25, Failures: 0, Errors: 0, Skipped: 0, Time elapsed: 0.123 sec - in org.apache.commons.lang3.math.FractionTest
Running org.apache.commons.lang3.BooleanUtilsTest
Tests run: 72, Failures: 0, Errors: 0, Skipped: 0, Time elapsed: 0.033 sec - in org.apache.commons.lang3.BooleanUtilsTest
Running org.apache.commons.lang3.CharSequenceUtilsTest
Tests run: 2, Failures: 0, Errors: 0, Skipped: 0, Time elapsed: 0.002 sec - in org.apache.commons.lang3.CharSequenceUtilsTest
Running org.apache.commons.lang3.CharSetUtilsTest
Tests run: 11, Failures: 0, Errors: 0, Skipped: 0, Time elapsed: 0.012 sec - in org.apache.commons.lang3.CharSetUtilsTest
Running org.apache.commons.lang3.ArrayUtilsAddTest
Tests run: 13, Failures: 0, Errors: 0, Skipped: 0, Time elapsed: 0.013 sec - in org.apache.commons.lang3.ArrayUtilsAddTest
Running org.apache.commons.lang3.CharEncodingTest
Tests run: 6, Failures: 0, Errors: 0, Skipped: 0, Time elapsed: 0.056 sec - in org.apache.commons.lang3.CharEncodingTest
Running org.apache.commons.lang3.ClassUtilsTest
Tests run: 57, Failures: 0, Errors: 0, Skipped: 0, Time elapsed: 0.043 sec - in org.apache.commons.lang3.ClassUtilsTest
Running org.apache.commons.lang3.RangeTest
Tests run: 24, Failures: 0, Errors: 0, Skipped: 0, Time elapsed: 0.018 sec - in org.apache.commons.lang3.RangeTest
Running org.apache.commons.lang3.event.EventUtilsTest
Tests run: 8, Failures: 0, Errors: 0, Skipped: 0, Time elapsed: 0.021 sec - in org.apache.commons.lang3.event.EventUtilsTest
Running org.apache.commons.lang3.event.EventListenerSupportTest
Tests run: 9, Failures: 0, Errors: 0, Skipped: 0, Time elapsed: 0.024 sec - in org.apache.commons.lang3.event.EventListenerSupportTest
Running org.apache.commons.lang3.ArrayUtilsTest
Tests run: 205, Failures: 0, Errors: 0, Skipped: 0, Time elapsed: 0.103 sec - in org.apache.commons.lang3.ArrayUtilsTest
Running org.apache.commons.lang3.CharUtilsTest
Tests run: 24, Failures: 0, Errors: 0, Skipped: 0, Time elapsed: 0.014 sec - in org.apache.commons.lang3.CharUtilsTest
Running org.apache.commons.lang3.NotImplementedExceptionTest
Tests run: 1, Failures: 0, Errors: 0, Skipped: 0, Time elapsed: 0.001 sec - in org.apache.commons.lang3.NotImplementedExceptionTest
Running org.apache.commons.lang3.StringUtilsEqualsIndexOfTest
Tests run: 50, Failures: 0, Errors: 0, Skipped: 0, Time elapsed: 0.021 sec - in org.apache.commons.lang3.StringUtilsEqualsIndexOfTest
Running org.apache.commons.lang3.RandomUtilsTest
Tests run: 23, Failures: 0, Errors: 0, Skipped: 0, Time elapsed: 0.009 sec - in org.apache.commons.lang3.RandomUtilsTest

Results :

Failed tests: 
  StringUtilsStartsEndsWithTest.testEndsWithAny:179 StringUtils.endsWithAny( StrBuilder(abcxyz), StringBuilder(abc), StringBuffer(xyz))
  StringUtilsStartsEndsWithTest.testStartsWithAny:97 StringUtils.startsWithAny( StrBuilder(abcxyz), StringBuilder(xyz), StringBuffer(abc))
  StrBuilderAppendInsertTest.testAppendNewLine:54 expected:<[---]
+++> but was:<[]
+++>
  StrBuilderAppendInsertTest.testAppend_Object:113 expected:<foobaz[yes]> but was:<foobaz[]>
  StrBuilderAppendInsertTest.testAppend_StrBuilder:371 expected:<[foo]> but was:<[]>
  StrBuilderAppendInsertTest.testAppendln_StrBuilder:747 expected:<[foo]
> but was:<[]
>
  StrBuilderTest.testAppendToCharBuffer:1998 expected:<Test [1234567890]> but was:<Test []>
  StrBuilderTest.testAppendToStringBuffer:1985 expected:<Test [1234567890]> but was:<Test []>
  StrBuilderTest.testAppendToStringBuilder:1975 expected:<Test [1234567890]> but was:<Test []>
  StrBuilderTest.testAppendToWriter:1965 expected:<Test [1234567890]> but was:<Test []>
  StrBuilderTest.testAsReader:1701 null
  StrBuilderTest.testAsWriter:1775 expected:<[base]l> but was:<[]l>
  StrBuilderTest.testContains_StrMatcher:1322 null
  StrBuilderTest.testContains_String:1312 null
  StrBuilderTest.testContains_char:1303 null
  StrBuilderTest.testDeleteAll_StrMatcher:710 expected:<[A0xA1A2yA3]> but was:<[]>
  StrBuilderTest.testDeleteAll_String:657 expected:<[abcbccba]> but was:<[]>
  StrBuilderTest.testDeleteAll_char:622 expected:<[abcbccba]> but was:<[]>
  StrBuilderTest.testDeleteFirst_StrMatcher:727 expected:<[A0xA1A2yA3]> but was:<[]>
  StrBuilderTest.testDeleteFirst_String:683 expected:<[abcbccba]> but was:<[]>
  StrBuilderTest.testDeleteFirst_char:639 expected:<[abcba]> but was:<[]>
  StrBuilderTest.testDeleteIntInt:593 expected:<[bc]> but was:<[]>
  StrBuilderTest.testIndexOf_String:1410 expected:<0> but was:<-1>
  StrBuilderTest.testIndexOf_String_int:1432 expected:<0> but was:<-1>
  StrBuilderTest.testIndexOf_char:1338 expected:<0> but was:<-1>
  StrBuilderTest.testIndexOf_char_int:1352 expected:<0> but was:<-1>
  StrBuilderTest.testLang294:1901 expected:<[
Do more stuff
even more stuff
]> but was:<[]>
  StrBuilderTest.testLastIndexOf_String:1470 expected:<2> but was:<-1>
  StrBuilderTest.testLastIndexOf_String_int:1493 expected:<0> but was:<-1>
  StrBuilderTest.testLastIndexOf_char:1375 expected:<2> but was:<-1>
  StrBuilderTest.testLastIndexOf_char_int:1389 expected:<0> but was:<-1>
  StrBuilderTest.testLeftString:1293 expected:<[left]> but was:<[]>
  StrBuilderTest.testMidString:1273 expected:<[goodbye]> but was:<[]>
  StrBuilderTest.testReadFromCharBufferAppendsToEnd:139 expected:<[Test] 123> but was:<[] 123>
  StrBuilderTest.testReadFromReadableAppendsToEnd:160 expected:<[Test] 123> but was:<[] 123>
  StrBuilderTest.testReadFromReaderAppendsToEnd:118 expected:<[Test] 123> but was:<[] 123>
  StrBuilderTest.testReplaceAll_StrMatcher_String:874 expected:<[abcbccba]> but was:<[]>
  StrBuilderTest.testReplaceAll_String_String:813 expected:<[abcbccba]> but was:<[]>
  StrBuilderTest.testReplaceAll_char_char:781 expected:<[abcbccba]> but was:<[]>
  StrBuilderTest.testReplaceFirst_StrMatcher_String:908 expected:<[abcbccba]> but was:<[]>
  StrBuilderTest.testReplaceFirst_String_String:843 expected:<[abcbccba]> but was:<[]>
  StrBuilderTest.testReplaceFirst_char_char:797 expected:<[abcbccba]> but was:<[]>
  StrBuilderTest.testReplace_StrMatcher_String_int_int_int_VaryCount:1102 expected:<[-x--y-]> but was:<[]>
  StrBuilderTest.testReplace_StrMatcher_String_int_int_int_VaryEndIndex:1048 expected:<[aaxaaaayaa]> but was:<[]>
  StrBuilderTest.testReplace_StrMatcher_String_int_int_int_VaryMatcher:943 expected:<[abcbccba]> but was:<[]>
  StrBuilderTest.testReplace_StrMatcher_String_int_int_int_VaryReplace:964 expected:<[abcbccba]> but was:<[]>
  StrBuilderTest.testReplace_StrMatcher_String_int_int_int_VaryStartIndex:987 expected:<[-x--y-]> but was:<[]>
  StrBuilderTest.testReplace_int_int_String:745 expected:<d[bc]> but was:<d[]>
  StrBuilderTest.testRightString:1284 expected:<[right]> but was:<[]>
  StrBuilderTest.testSubstringIntInt:1250 expected:<[hello]> but was:<[]>
  StrBuilderTest.testToString:1873 expected:<[abc]> but was:<[]>
  StrSubstitutorTest.testConstructorMapFull:452 expected:<Hi [< commons]> but was:<Hi [!< <name>]>
  StrSubstitutorTest.testConstructorMapPrefixSuffix:441 expected:<Hi [< commons]> but was:<Hi [$< <name>]>
  StrSubstitutorTest.testReplaceAdjacentAtEnd:136 expected:<Amount is [GBP12.50]> but was:<Amount is [${code}${amount}]>
  StrSubstitutorTest.testReplaceAdjacentAtStart:125 expected:<[GBP12.50] charged> but was:<[${code}${amount}] charged>
  StrSubstitutorTest.testReplaceEmptyKeys:220->doTestReplace:634 expected:<... ${} jumps over the [lazy dog].> but was:<... ${} jumps over the [${target}].>
  StrSubstitutorTest.testReplaceNoVariables:79->doTestNoReplace:723 expected:<[The balloon arrived.]> but was:<[]>
  StrSubstitutorTest.testReplaceSolo:71->doTestReplace:634 expected:<[quick brown fox]> but was:<[${animal}]>
  StrSubstitutorTest.testReplaceSoloEscaping:171->doTestReplace:634 expected:<$[]{animal}> but was:<$[$]{animal}>
  StrSubstitutorTest.testReplaceToIdentical:231->doTestReplace:662 expected:<[The ${animal} jumps.]> but was:<[]>
  StrSubstitutorTest.testReplaceWeirdPattens:274->doTestNoReplace:723 expected:<[${}]> but was:<[]>
  StrSubstitutorTest.testResolveVariable:420 expected:<[Hi jakarta!]> but was:<[]>

Tests in error: 
  StrBuilderAppendInsertTest.testAppend_StrBuilder_int_int:388 » StringIndexOutOfBounds
  StrBuilderAppendInsertTest.testAppendln_StrBuilder_int_int:770 » StringIndexOutOfBounds
  StrBuilderTest.testConstructors:68 » NullPointer
  StrBuilderTest.testDeleteCharAt:459 » StringIndexOutOfBounds String index out ...
  StrBuilderTest.testSubSequenceIntInt:1222 » StringIndexOutOfBounds String inde...
  StrBuilderTest.testSubstringInt:1231 » StringIndexOutOfBounds end < start
  StrSubstitutorTest.testCyclicReplacement:251 » ArrayIndexOutOfBounds 32
  StrSubstitutorTest.testDefaultValueDelimiters:374 » ArrayIndexOutOfBounds 32
  StrSubstitutorTest.testReplaceChangedMap:105 » ArrayIndexOutOfBounds 32
  StrSubstitutorTest.testReplaceComplexEscaping:179->doTestReplace:634 » ArrayIndexOutOfBounds
  StrSubstitutorTest.testReplaceEscaping:163->doTestReplace:634 » ArrayIndexOutOfBounds
  StrSubstitutorTest.testReplaceInVariable:311 » ArrayIndexOutOfBounds 32
  StrSubstitutorTest.testReplaceInVariableDisabled:335 » ArrayIndexOutOfBounds 3...
  StrSubstitutorTest.testReplaceInVariableRecursive:357 » ArrayIndexOutOfBounds ...
  StrSubstitutorTest.testReplaceIncompletePrefix:196->doTestReplace:634 » ArrayIndexOutOfBounds
  StrSubstitutorTest.testReplaceNoPrefixNoSuffix:188->doTestReplace:634 » ArrayIndexOutOfBounds
  StrSubstitutorTest.testReplaceNoPrefixSuffix:212->doTestReplace:634 » ArrayIndexOutOfBounds
  StrSubstitutorTest.testReplacePrefixNoSuffix:204->doTestReplace:634 » ArrayIndexOutOfBounds
  StrSubstitutorTest.testReplaceRecursive:152->doTestReplace:634 » ArrayIndexOutOfBounds
  StrSubstitutorTest.testReplaceSimple:63->doTestReplace:634 » ArrayIndexOutOfBounds
  StrSubstitutorTest.testReplaceUnknownKey:113->doTestReplace:634 » ArrayIndexOutOfBounds


Tests run: 3526, Failures: 62, Errors: 21, Skipped: 97

[INFO] ------------------------------------------------------------------------
[INFO] BUILD FAILURE
[INFO] ------------------------------------------------------------------------
[INFO] Total time: 37.531s
[INFO] Finished at: Wed Aug 05 01:33:10 BST 2015
[INFO] Final Memory: 28M/498M
[INFO] ------------------------------------------------------------------------
[ERROR] Failed to execute goal org.apache.maven.plugins:maven-surefire-plugin:2.18:test (default-test) on project commons-lang3: There are test failures.
[ERROR] 
[ERROR] Please refer to /home/perham/Study/LittleDarwin/Cases/commons-lang3-3.4-src/target/surefire-reports for the individual test results.
[ERROR] -> [Help 1]
[ERROR] 
[ERROR] To see the full stack trace of the errors, re-run Maven with the -e switch.
[ERROR] Re-run Maven using the -X switch to enable full debug logging.
[ERROR] 
[ERROR] For more information about the errors and possible solutions, please read the following articles:
[ERROR] [Help 1] http://cwiki.apache.org/confluence/display/MAVEN/MojoFailureException
