[INFO] Scanning for projects...
[INFO]                                                                         
[INFO] ------------------------------------------------------------------------
[INFO] Building Apache Commons Lang 3.4
[INFO] ------------------------------------------------------------------------
[INFO] 
[INFO] --- maven-enforcer-plugin:1.3.1:enforce (enforce-maven-3) @ commons-lang3 ---
[INFO] 
[INFO] --- build-helper-maven-plugin:1.8:parse-version (parse-version) @ commons-lang3 ---
[INFO] 
[INFO] --- maven-antrun-plugin:1.8:run (javadoc.resources) @ commons-lang3 ---
[INFO] Executing tasks

main:
[INFO] Executed tasks
[INFO] 
[INFO] --- maven-remote-resources-plugin:1.5:process (default) @ commons-lang3 ---
[INFO] 
[INFO] --- buildnumber-maven-plugin:1.3:create (default) @ commons-lang3 ---
[INFO] Executing: /bin/sh -c cd /home/perham/Study/LittleDarwin/Cases/commons-lang3-3.4-src && svn --non-interactive info
[INFO] Working directory: /home/perham/Study/LittleDarwin/Cases/commons-lang3-3.4-src
[INFO] Storing buildNumber: ?????? at timestamp: 1438731753697
[INFO] Executing: /bin/sh -c cd /home/perham/Study/LittleDarwin/Cases/commons-lang3-3.4-src && svn --non-interactive info
[INFO] Working directory: /home/perham/Study/LittleDarwin/Cases/commons-lang3-3.4-src
[INFO] Storing buildScmBranch: UNKNOWN_BRANCH
[INFO] 
[INFO] --- maven-resources-plugin:2.7:resources (default-resources) @ commons-lang3 ---
[INFO] Using 'ISO-8859-1' encoding to copy filtered resources.
[INFO] Copying 0 resource
[INFO] Copying 2 resources to META-INF
[INFO] 
[INFO] --- maven-compiler-plugin:3.2:compile (default-compile) @ commons-lang3 ---
[INFO] Changes detected - recompiling the module!
[INFO] Compiling 133 source files to /home/perham/Study/LittleDarwin/Cases/commons-lang3-3.4-src/target/classes
[INFO] /home/perham/Study/LittleDarwin/Cases/commons-lang3-3.4-src/src/main/java/org/apache/commons/lang3/SerializationUtils.java: /home/perham/Study/LittleDarwin/Cases/commons-lang3-3.4-src/src/main/java/org/apache/commons/lang3/SerializationUtils.java uses unchecked or unsafe operations.
[INFO] /home/perham/Study/LittleDarwin/Cases/commons-lang3-3.4-src/src/main/java/org/apache/commons/lang3/SerializationUtils.java: Recompile with -Xlint:unchecked for details.
[INFO] 
[INFO] --- maven-bundle-plugin:2.5.3:manifest (bundle-manifest) @ commons-lang3 ---
[INFO] 
[INFO] --- animal-sniffer-maven-plugin:1.13:check (checkAPIcompatibility) @ commons-lang3 ---
[INFO] Checking unresolved references to org.codehaus.mojo.signature:java16:1.0
[INFO] 
[INFO] --- maven-resources-plugin:2.7:testResources (default-testResources) @ commons-lang3 ---
[INFO] Using 'ISO-8859-1' encoding to copy filtered resources.
[INFO] Copying 2 resources
[INFO] Copying 2 resources to META-INF
[INFO] 
[INFO] --- maven-compiler-plugin:3.2:testCompile (default-testCompile) @ commons-lang3 ---
[INFO] Nothing to compile - all classes are up to date
[INFO] 
[INFO] --- maven-surefire-plugin:2.18:test (default-test) @ commons-lang3 ---
[INFO] Surefire report directory: /home/perham/Study/LittleDarwin/Cases/commons-lang3-3.4-src/target/surefire-reports

-------------------------------------------------------
 T E S T S
-------------------------------------------------------
Running org.apache.commons.lang3.ValidateTest
Tests run: 63, Failures: 0, Errors: 0, Skipped: 0, Time elapsed: 0.063 sec - in org.apache.commons.lang3.ValidateTest
Running org.apache.commons.lang3.LocaleUtilsTest
Tests run: 15, Failures: 0, Errors: 0, Skipped: 0, Time elapsed: 0.034 sec - in org.apache.commons.lang3.LocaleUtilsTest
Running org.apache.commons.lang3.tuple.MutableTripleTest
Tests run: 8, Failures: 0, Errors: 0, Skipped: 0, Time elapsed: 0.001 sec - in org.apache.commons.lang3.tuple.MutableTripleTest
Running org.apache.commons.lang3.tuple.TripleTest
Tests run: 10, Failures: 0, Errors: 0, Skipped: 0, Time elapsed: 0.001 sec - in org.apache.commons.lang3.tuple.TripleTest
Running org.apache.commons.lang3.tuple.ImmutablePairTest
Tests run: 6, Failures: 0, Errors: 0, Skipped: 0, Time elapsed: 0.001 sec - in org.apache.commons.lang3.tuple.ImmutablePairTest
Running org.apache.commons.lang3.tuple.MutablePairTest
Tests run: 8, Failures: 0, Errors: 0, Skipped: 0, Time elapsed: 0 sec - in org.apache.commons.lang3.tuple.MutablePairTest
Running org.apache.commons.lang3.tuple.ImmutableTripleTest
Tests run: 6, Failures: 0, Errors: 0, Skipped: 0, Time elapsed: 0.001 sec - in org.apache.commons.lang3.tuple.ImmutableTripleTest
Running org.apache.commons.lang3.tuple.PairTest
Tests run: 9, Failures: 0, Errors: 0, Skipped: 0, Time elapsed: 0.001 sec - in org.apache.commons.lang3.tuple.PairTest
Running org.apache.commons.lang3.StringUtilsIsTest
Tests run: 8, Failures: 0, Errors: 0, Skipped: 0, Time elapsed: 0.005 sec - in org.apache.commons.lang3.StringUtilsIsTest
Running org.apache.commons.lang3.JavaVersionTest
Tests run: 3, Failures: 0, Errors: 0, Skipped: 0, Time elapsed: 0 sec - in org.apache.commons.lang3.JavaVersionTest
Running org.apache.commons.lang3.builder.NoFieldNamesToStringStyleTest
Tests run: 8, Failures: 0, Errors: 0, Skipped: 0, Time elapsed: 0.005 sec - in org.apache.commons.lang3.builder.NoFieldNamesToStringStyleTest
Running org.apache.commons.lang3.builder.ShortPrefixToStringStyleTest
Tests run: 8, Failures: 0, Errors: 0, Skipped: 0, Time elapsed: 0.002 sec - in org.apache.commons.lang3.builder.ShortPrefixToStringStyleTest
Running org.apache.commons.lang3.builder.DiffResultTest
Tests run: 9, Failures: 0, Errors: 0, Skipped: 0, Time elapsed: 0.001 sec - in org.apache.commons.lang3.builder.DiffResultTest
Running org.apache.commons.lang3.builder.CompareToBuilderTest
Tests run: 48, Failures: 0, Errors: 0, Skipped: 0, Time elapsed: 0.027 sec - in org.apache.commons.lang3.builder.CompareToBuilderTest
Running org.apache.commons.lang3.builder.MultilineRecursiveToStringStyleTest
Tests run: 10, Failures: 0, Errors: 0, Skipped: 0, Time elapsed: 0.027 sec - in org.apache.commons.lang3.builder.MultilineRecursiveToStringStyleTest
Running org.apache.commons.lang3.builder.RecursiveToStringStyleTest
Tests run: 8, Failures: 0, Errors: 0, Skipped: 0, Time elapsed: 0 sec - in org.apache.commons.lang3.builder.RecursiveToStringStyleTest
Running org.apache.commons.lang3.builder.DefaultToStringStyleTest
Tests run: 8, Failures: 0, Errors: 0, Skipped: 0, Time elapsed: 0.001 sec - in org.apache.commons.lang3.builder.DefaultToStringStyleTest
Running org.apache.commons.lang3.builder.ReflectionToStringBuilderExcludeTest
Tests run: 11, Failures: 0, Errors: 0, Skipped: 0, Time elapsed: 0.001 sec - in org.apache.commons.lang3.builder.ReflectionToStringBuilderExcludeTest
Running org.apache.commons.lang3.builder.StandardToStringStyleTest
Tests run: 8, Failures: 0, Errors: 0, Skipped: 0, Time elapsed: 0 sec - in org.apache.commons.lang3.builder.StandardToStringStyleTest
Running org.apache.commons.lang3.builder.ToStringStyleTest
Tests run: 12, Failures: 0, Errors: 0, Skipped: 0, Time elapsed: 0.002 sec - in org.apache.commons.lang3.builder.ToStringStyleTest
Running org.apache.commons.lang3.builder.DiffTest
Tests run: 4, Failures: 0, Errors: 0, Skipped: 0, Time elapsed: 0.001 sec - in org.apache.commons.lang3.builder.DiffTest
Running org.apache.commons.lang3.builder.SimpleToStringStyleTest
Tests run: 8, Failures: 0, Errors: 0, Skipped: 0, Time elapsed: 0.004 sec - in org.apache.commons.lang3.builder.SimpleToStringStyleTest
Running org.apache.commons.lang3.builder.MultiLineToStringStyleTest
Tests run: 8, Failures: 0, Errors: 0, Skipped: 0, Time elapsed: 0.012 sec - in org.apache.commons.lang3.builder.MultiLineToStringStyleTest
Running org.apache.commons.lang3.builder.ToStringStyleConcurrencyTest
Tests run: 3, Failures: 0, Errors: 0, Skipped: 0, Time elapsed: 5.359 sec - in org.apache.commons.lang3.builder.ToStringStyleConcurrencyTest
Running org.apache.commons.lang3.builder.ReflectionToStringBuilderMutateInspectConcurrencyTest
Tests run: 1, Failures: 0, Errors: 0, Skipped: 1, Time elapsed: 0.002 sec - in org.apache.commons.lang3.builder.ReflectionToStringBuilderMutateInspectConcurrencyTest
Running org.apache.commons.lang3.builder.ToStringBuilderTest
Tests run: 74, Failures: 0, Errors: 0, Skipped: 1, Time elapsed: 0.06 sec - in org.apache.commons.lang3.builder.ToStringBuilderTest
Running org.apache.commons.lang3.builder.EqualsBuilderTest
Tests run: 48, Failures: 0, Errors: 0, Skipped: 0, Time elapsed: 0.022 sec - in org.apache.commons.lang3.builder.EqualsBuilderTest
Running org.apache.commons.lang3.builder.HashCodeBuilderAndEqualsBuilderTest
Tests run: 4, Failures: 0, Errors: 0, Skipped: 0, Time elapsed: 0.007 sec - in org.apache.commons.lang3.builder.HashCodeBuilderAndEqualsBuilderTest
Running org.apache.commons.lang3.builder.ReflectionToStringBuilderConcurrencyTest
Tests run: 3, Failures: 0, Errors: 0, Skipped: 3, Time elapsed: 0 sec - in org.apache.commons.lang3.builder.ReflectionToStringBuilderConcurrencyTest
Running org.apache.commons.lang3.builder.JsonToStringStyleTest
Tests run: 9, Failures: 0, Errors: 0, Skipped: 0, Time elapsed: 0.002 sec - in org.apache.commons.lang3.builder.JsonToStringStyleTest
Running org.apache.commons.lang3.builder.NoClassNameToStringStyleTest
Tests run: 8, Failures: 0, Errors: 0, Skipped: 0, Time elapsed: 0.005 sec - in org.apache.commons.lang3.builder.NoClassNameToStringStyleTest
Running org.apache.commons.lang3.builder.DiffBuilderTest
Tests run: 30, Failures: 0, Errors: 0, Skipped: 0, Time elapsed: 0.027 sec - in org.apache.commons.lang3.builder.DiffBuilderTest
Running org.apache.commons.lang3.builder.HashCodeBuilderTest
Tests run: 44, Failures: 0, Errors: 0, Skipped: 0, Time elapsed: 0.025 sec - in org.apache.commons.lang3.builder.HashCodeBuilderTest
Running org.apache.commons.lang3.concurrent.AtomicInitializerTest
Tests run: 3, Failures: 0, Errors: 0, Skipped: 0, Time elapsed: 0.008 sec - in org.apache.commons.lang3.concurrent.AtomicInitializerTest
Running org.apache.commons.lang3.concurrent.CallableBackgroundInitializerTest
Tests run: 4, Failures: 0, Errors: 0, Skipped: 0, Time elapsed: 0.002 sec - in org.apache.commons.lang3.concurrent.CallableBackgroundInitializerTest
Running org.apache.commons.lang3.concurrent.BackgroundInitializerTest
Tests run: 15, Failures: 0, Errors: 0, Skipped: 0, Time elapsed: 0.017 sec - in org.apache.commons.lang3.concurrent.BackgroundInitializerTest
Running org.apache.commons.lang3.concurrent.LazyInitializerTest
Tests run: 3, Failures: 0, Errors: 0, Skipped: 0, Time elapsed: 0.007 sec - in org.apache.commons.lang3.concurrent.LazyInitializerTest
Running org.apache.commons.lang3.concurrent.BasicThreadFactoryTest
Tests run: 15, Failures: 0, Errors: 0, Skipped: 0, Time elapsed: 0.039 sec - in org.apache.commons.lang3.concurrent.BasicThreadFactoryTest
Running org.apache.commons.lang3.concurrent.ConstantInitializerTest
Tests run: 7, Failures: 0, Errors: 0, Skipped: 0, Time elapsed: 0.001 sec - in org.apache.commons.lang3.concurrent.ConstantInitializerTest
Running org.apache.commons.lang3.concurrent.MultiBackgroundInitializerTest
Tests run: 17, Failures: 0, Errors: 0, Skipped: 0, Time elapsed: 0.079 sec - in org.apache.commons.lang3.concurrent.MultiBackgroundInitializerTest
Running org.apache.commons.lang3.concurrent.AtomicSafeInitializerTest
Tests run: 4, Failures: 0, Errors: 0, Skipped: 0, Time elapsed: 0.006 sec - in org.apache.commons.lang3.concurrent.AtomicSafeInitializerTest
Running org.apache.commons.lang3.concurrent.ConcurrentUtilsTest
Tests run: 40, Failures: 0, Errors: 0, Skipped: 0, Time elapsed: 0.014 sec - in org.apache.commons.lang3.concurrent.ConcurrentUtilsTest
Running org.apache.commons.lang3.concurrent.TimedSemaphoreTest
Tests run: 15, Failures: 0, Errors: 0, Skipped: 0, Time elapsed: 1.173 sec - in org.apache.commons.lang3.concurrent.TimedSemaphoreTest
Running org.apache.commons.lang3.StringUtilsSubstringTest
Tests run: 14, Failures: 0, Errors: 0, Skipped: 0, Time elapsed: 0.003 sec - in org.apache.commons.lang3.StringUtilsSubstringTest
Running org.apache.commons.lang3.SystemUtilsTest
Tests run: 12, Failures: 0, Errors: 0, Skipped: 0, Time elapsed: 0.003 sec - in org.apache.commons.lang3.SystemUtilsTest
Running org.apache.commons.lang3.CharRangeTest
Tests run: 16, Failures: 0, Errors: 0, Skipped: 0, Time elapsed: 0.039 sec - in org.apache.commons.lang3.CharRangeTest
Running org.apache.commons.lang3.CharSetTest
Tests run: 14, Failures: 0, Errors: 0, Skipped: 0, Time elapsed: 0.014 sec - in org.apache.commons.lang3.CharSetTest
Running org.apache.commons.lang3.StringUtilsStartsEndsWithTest
Tests run: 6, Failures: 0, Errors: 0, Skipped: 0, Time elapsed: 0.01 sec - in org.apache.commons.lang3.StringUtilsStartsEndsWithTest
Running org.apache.commons.lang3.RandomStringUtilsTest
Tests run: 11, Failures: 0, Errors: 0, Skipped: 0, Time elapsed: 0.031 sec - in org.apache.commons.lang3.RandomStringUtilsTest
Running org.apache.commons.lang3.SerializationUtilsTest
Tests run: 26, Failures: 0, Errors: 0, Skipped: 0, Time elapsed: 0.052 sec - in org.apache.commons.lang3.SerializationUtilsTest
Running org.apache.commons.lang3.time.StopWatchTest
Tests run: 8, Failures: 0, Errors: 0, Skipped: 0, Time elapsed: 4.767 sec - in org.apache.commons.lang3.time.StopWatchTest
Running org.apache.commons.lang3.time.DateUtilsRoundingTest
Tests run: 22, Failures: 0, Errors: 0, Skipped: 0, Time elapsed: 0.194 sec - in org.apache.commons.lang3.time.DateUtilsRoundingTest
Running org.apache.commons.lang3.time.FastDateParserTest
Tests run: 33, Failures: 0, Errors: 0, Skipped: 0, Time elapsed: 2.526 sec - in org.apache.commons.lang3.time.FastDateParserTest
Running org.apache.commons.lang3.time.FastDateFormat_ParserTest
Tests run: 33, Failures: 0, Errors: 0, Skipped: 0, Time elapsed: 0.815 sec - in org.apache.commons.lang3.time.FastDateFormat_ParserTest
Running org.apache.commons.lang3.time.DurationFormatUtilsTest
Tests run: 25, Failures: 0, Errors: 0, Skipped: 0, Time elapsed: 0.622 sec - in org.apache.commons.lang3.time.DurationFormatUtilsTest
Running org.apache.commons.lang3.time.DateFormatUtilsTest
Tests run: 10, Failures: 0, Errors: 0, Skipped: 0, Time elapsed: 0.001 sec - in org.apache.commons.lang3.time.DateFormatUtilsTest
Running org.apache.commons.lang3.time.DateUtilsFragmentTest
Tests run: 57, Failures: 0, Errors: 0, Skipped: 0, Time elapsed: 0.009 sec - in org.apache.commons.lang3.time.DateUtilsFragmentTest
Running org.apache.commons.lang3.time.FastDatePrinterTimeZonesTest
Tests run: 617, Failures: 0, Errors: 0, Skipped: 0, Time elapsed: 0.235 sec - in org.apache.commons.lang3.time.FastDatePrinterTimeZonesTest
Running org.apache.commons.lang3.time.FastDateFormatTest
>>FastDateFormatTest: FastDateParser:19344  SimpleDateFormat:4599
Tests run: 14, Failures: 0, Errors: 0, Skipped: 0, Time elapsed: 2.632 sec - in org.apache.commons.lang3.time.FastDateFormatTest
Running org.apache.commons.lang3.time.FastDateFormat_PrinterTest
Tests run: 17, Failures: 0, Errors: 0, Skipped: 0, Time elapsed: 0.008 sec - in org.apache.commons.lang3.time.FastDateFormat_PrinterTest
Running org.apache.commons.lang3.time.FastDatePrinterTest
Tests run: 17, Failures: 0, Errors: 0, Skipped: 0, Time elapsed: 0.006 sec - in org.apache.commons.lang3.time.FastDatePrinterTest
Running org.apache.commons.lang3.time.FastDateParserSDFTest
Tests run: 276, Failures: 0, Errors: 0, Skipped: 92, Time elapsed: 0.084 sec - in org.apache.commons.lang3.time.FastDateParserSDFTest
Running org.apache.commons.lang3.time.DateUtilsTest
DateUtilsTest: Default Locale=en_US
Tests run: 38, Failures: 0, Errors: 0, Skipped: 0, Time elapsed: 0.015 sec - in org.apache.commons.lang3.time.DateUtilsTest
Running org.apache.commons.lang3.reflect.InheritanceUtilsTest
Tests run: 9, Failures: 0, Errors: 0, Skipped: 0, Time elapsed: 0.008 sec - in org.apache.commons.lang3.reflect.InheritanceUtilsTest
Running org.apache.commons.lang3.reflect.MethodUtilsTest
Tests run: 23, Failures: 0, Errors: 0, Skipped: 0, Time elapsed: 0.036 sec - in org.apache.commons.lang3.reflect.MethodUtilsTest
Running org.apache.commons.lang3.reflect.ConstructorUtilsTest
Tests run: 7, Failures: 0, Errors: 0, Skipped: 0, Time elapsed: 0.005 sec - in org.apache.commons.lang3.reflect.ConstructorUtilsTest
Running org.apache.commons.lang3.reflect.FieldUtilsTest
Tests run: 64, Failures: 0, Errors: 0, Skipped: 0, Time elapsed: 0.027 sec - in org.apache.commons.lang3.reflect.FieldUtilsTest
Running org.apache.commons.lang3.reflect.TypeLiteralTest
Tests run: 4, Failures: 0, Errors: 0, Skipped: 0, Time elapsed: 0.007 sec - in org.apache.commons.lang3.reflect.TypeLiteralTest
Running org.apache.commons.lang3.reflect.TypeUtilsTest
Tests run: 19, Failures: 0, Errors: 0, Skipped: 0, Time elapsed: 0.045 sec - in org.apache.commons.lang3.reflect.TypeUtilsTest
Running org.apache.commons.lang3.mutable.MutableByteTest
Tests run: 17, Failures: 0, Errors: 0, Skipped: 0, Time elapsed: 0.004 sec - in org.apache.commons.lang3.mutable.MutableByteTest
Running org.apache.commons.lang3.mutable.MutableShortTest
Tests run: 14, Failures: 0, Errors: 0, Skipped: 0, Time elapsed: 0.003 sec - in org.apache.commons.lang3.mutable.MutableShortTest
Running org.apache.commons.lang3.mutable.MutableIntTest
Tests run: 17, Failures: 0, Errors: 0, Skipped: 0, Time elapsed: 0.004 sec - in org.apache.commons.lang3.mutable.MutableIntTest
Running org.apache.commons.lang3.mutable.MutableDoubleTest
Tests run: 18, Failures: 0, Errors: 0, Skipped: 0, Time elapsed: 0.005 sec - in org.apache.commons.lang3.mutable.MutableDoubleTest
Running org.apache.commons.lang3.mutable.MutableFloatTest
Tests run: 18, Failures: 0, Errors: 0, Skipped: 0, Time elapsed: 0.004 sec - in org.apache.commons.lang3.mutable.MutableFloatTest
Running org.apache.commons.lang3.mutable.MutableLongTest
Tests run: 17, Failures: 0, Errors: 0, Skipped: 0, Time elapsed: 0.004 sec - in org.apache.commons.lang3.mutable.MutableLongTest
Running org.apache.commons.lang3.mutable.MutableBooleanTest
Tests run: 9, Failures: 0, Errors: 0, Skipped: 0, Time elapsed: 0.009 sec - in org.apache.commons.lang3.mutable.MutableBooleanTest
Running org.apache.commons.lang3.mutable.MutableObjectTest
Tests run: 5, Failures: 0, Errors: 0, Skipped: 0, Time elapsed: 0.001 sec - in org.apache.commons.lang3.mutable.MutableObjectTest
Running org.apache.commons.lang3.text.translate.UnicodeEscaperTest
Tests run: 3, Failures: 0, Errors: 0, Skipped: 0, Time elapsed: 0 sec - in org.apache.commons.lang3.text.translate.UnicodeEscaperTest
Running org.apache.commons.lang3.text.translate.EntityArraysTest
Tests run: 3, Failures: 0, Errors: 0, Skipped: 0, Time elapsed: 0.001 sec - in org.apache.commons.lang3.text.translate.EntityArraysTest
Running org.apache.commons.lang3.text.translate.UnicodeUnpairedSurrogateRemoverTest
Tests run: 2, Failures: 0, Errors: 0, Skipped: 0, Time elapsed: 0.001 sec - in org.apache.commons.lang3.text.translate.UnicodeUnpairedSurrogateRemoverTest
Running org.apache.commons.lang3.text.translate.NumericEntityUnescaperTest
Tests run: 3, Failures: 0, Errors: 0, Skipped: 0, Time elapsed: 0 sec - in org.apache.commons.lang3.text.translate.NumericEntityUnescaperTest
Running org.apache.commons.lang3.text.translate.NumericEntityEscaperTest
Tests run: 4, Failures: 0, Errors: 0, Skipped: 0, Time elapsed: 0.001 sec - in org.apache.commons.lang3.text.translate.NumericEntityEscaperTest
Running org.apache.commons.lang3.text.translate.LookupTranslatorTest
Tests run: 2, Failures: 0, Errors: 0, Skipped: 0, Time elapsed: 0.001 sec - in org.apache.commons.lang3.text.translate.LookupTranslatorTest
Running org.apache.commons.lang3.text.translate.UnicodeUnescaperTest
Tests run: 3, Failures: 0, Errors: 0, Skipped: 0, Time elapsed: 0.001 sec - in org.apache.commons.lang3.text.translate.UnicodeUnescaperTest
Running org.apache.commons.lang3.text.translate.OctalUnescaperTest
Tests run: 1, Failures: 0, Errors: 0, Skipped: 0, Time elapsed: 0 sec - in org.apache.commons.lang3.text.translate.OctalUnescaperTest
Running org.apache.commons.lang3.text.StrMatcherTest
Tests run: 14, Failures: 0, Errors: 0, Skipped: 0, Time elapsed: 0.001 sec - in org.apache.commons.lang3.text.StrMatcherTest
Running org.apache.commons.lang3.text.StrTokenizerTest
Tests run: 55, Failures: 0, Errors: 16, Skipped: 0, Time elapsed: 0.011 sec <<< FAILURE! - in org.apache.commons.lang3.text.StrTokenizerTest
testBasicQuoted3(org.apache.commons.lang3.text.StrTokenizerTest)  Time elapsed: 0.001 sec  <<< ERROR!
java.lang.StringIndexOutOfBoundsException: Invalid length: 1
	at org.apache.commons.lang3.text.StrBuilder.append(StrBuilder.java:212)
	at org.apache.commons.lang3.text.StrTokenizer.readWithQuotes(StrTokenizer.java:758)
	at org.apache.commons.lang3.text.StrTokenizer.readNextToken(StrTokenizer.java:716)
	at org.apache.commons.lang3.text.StrTokenizer.tokenize(StrTokenizer.java:646)
	at org.apache.commons.lang3.text.StrTokenizer.checkTokenized(StrTokenizer.java:609)
	at org.apache.commons.lang3.text.StrTokenizer.hasNext(StrTokenizer.java:505)
	at org.apache.commons.lang3.text.StrTokenizer.next(StrTokenizer.java:517)
	at org.apache.commons.lang3.text.StrTokenizerTest.testBasicQuoted3(StrTokenizerTest.java:352)

testBasicQuoted4(org.apache.commons.lang3.text.StrTokenizerTest)  Time elapsed: 0 sec  <<< ERROR!
java.lang.StringIndexOutOfBoundsException: Invalid length: 1
	at org.apache.commons.lang3.text.StrBuilder.append(StrBuilder.java:212)
	at org.apache.commons.lang3.text.StrTokenizer.readWithQuotes(StrTokenizer.java:804)
	at org.apache.commons.lang3.text.StrTokenizer.readNextToken(StrTokenizer.java:716)
	at org.apache.commons.lang3.text.StrTokenizer.tokenize(StrTokenizer.java:646)
	at org.apache.commons.lang3.text.StrTokenizer.checkTokenized(StrTokenizer.java:609)
	at org.apache.commons.lang3.text.StrTokenizer.hasNext(StrTokenizer.java:505)
	at org.apache.commons.lang3.text.StrTokenizer.next(StrTokenizer.java:517)
	at org.apache.commons.lang3.text.StrTokenizerTest.testBasicQuoted4(StrTokenizerTest.java:364)

testBasicQuoted5(org.apache.commons.lang3.text.StrTokenizerTest)  Time elapsed: 0 sec  <<< ERROR!
java.lang.StringIndexOutOfBoundsException: Invalid length: 1
	at org.apache.commons.lang3.text.StrBuilder.append(StrBuilder.java:212)
	at org.apache.commons.lang3.text.StrTokenizer.readWithQuotes(StrTokenizer.java:804)
	at org.apache.commons.lang3.text.StrTokenizer.readNextToken(StrTokenizer.java:716)
	at org.apache.commons.lang3.text.StrTokenizer.tokenize(StrTokenizer.java:646)
	at org.apache.commons.lang3.text.StrTokenizer.checkTokenized(StrTokenizer.java:609)
	at org.apache.commons.lang3.text.StrTokenizer.hasNext(StrTokenizer.java:505)
	at org.apache.commons.lang3.text.StrTokenizer.next(StrTokenizer.java:517)
	at org.apache.commons.lang3.text.StrTokenizerTest.testBasicQuoted5(StrTokenizerTest.java:377)

test1(org.apache.commons.lang3.text.StrTokenizerTest)  Time elapsed: 0 sec  <<< ERROR!
java.lang.StringIndexOutOfBoundsException: Invalid length: 1
	at org.apache.commons.lang3.text.StrBuilder.append(StrBuilder.java:212)
	at org.apache.commons.lang3.text.StrTokenizer.readWithQuotes(StrTokenizer.java:758)
	at org.apache.commons.lang3.text.StrTokenizer.readNextToken(StrTokenizer.java:716)
	at org.apache.commons.lang3.text.StrTokenizer.tokenize(StrTokenizer.java:646)
	at org.apache.commons.lang3.text.StrTokenizer.checkTokenized(StrTokenizer.java:609)
	at org.apache.commons.lang3.text.StrTokenizer.getTokenArray(StrTokenizer.java:433)
	at org.apache.commons.lang3.text.StrTokenizerTest.test1(StrTokenizerTest.java:56)

test2(org.apache.commons.lang3.text.StrTokenizerTest)  Time elapsed: 0.001 sec  <<< ERROR!
java.lang.StringIndexOutOfBoundsException: Invalid length: 1
	at org.apache.commons.lang3.text.StrBuilder.append(StrBuilder.java:212)
	at org.apache.commons.lang3.text.StrTokenizer.readWithQuotes(StrTokenizer.java:758)
	at org.apache.commons.lang3.text.StrTokenizer.readNextToken(StrTokenizer.java:716)
	at org.apache.commons.lang3.text.StrTokenizer.tokenize(StrTokenizer.java:646)
	at org.apache.commons.lang3.text.StrTokenizer.checkTokenized(StrTokenizer.java:609)
	at org.apache.commons.lang3.text.StrTokenizer.getTokenArray(StrTokenizer.java:433)
	at org.apache.commons.lang3.text.StrTokenizerTest.test2(StrTokenizerTest.java:77)

test3(org.apache.commons.lang3.text.StrTokenizerTest)  Time elapsed: 0 sec  <<< ERROR!
java.lang.StringIndexOutOfBoundsException: Invalid length: 1
	at org.apache.commons.lang3.text.StrBuilder.append(StrBuilder.java:212)
	at org.apache.commons.lang3.text.StrTokenizer.readWithQuotes(StrTokenizer.java:758)
	at org.apache.commons.lang3.text.StrTokenizer.readNextToken(StrTokenizer.java:716)
	at org.apache.commons.lang3.text.StrTokenizer.tokenize(StrTokenizer.java:646)
	at org.apache.commons.lang3.text.StrTokenizer.checkTokenized(StrTokenizer.java:609)
	at org.apache.commons.lang3.text.StrTokenizer.getTokenArray(StrTokenizer.java:433)
	at org.apache.commons.lang3.text.StrTokenizerTest.test3(StrTokenizerTest.java:98)

test4(org.apache.commons.lang3.text.StrTokenizerTest)  Time elapsed: 0 sec  <<< ERROR!
java.lang.StringIndexOutOfBoundsException: Invalid length: 1
	at org.apache.commons.lang3.text.StrBuilder.append(StrBuilder.java:212)
	at org.apache.commons.lang3.text.StrTokenizer.readWithQuotes(StrTokenizer.java:758)
	at org.apache.commons.lang3.text.StrTokenizer.readNextToken(StrTokenizer.java:716)
	at org.apache.commons.lang3.text.StrTokenizer.tokenize(StrTokenizer.java:646)
	at org.apache.commons.lang3.text.StrTokenizer.checkTokenized(StrTokenizer.java:609)
	at org.apache.commons.lang3.text.StrTokenizer.getTokenArray(StrTokenizer.java:433)
	at org.apache.commons.lang3.text.StrTokenizerTest.test4(StrTokenizerTest.java:119)

test5(org.apache.commons.lang3.text.StrTokenizerTest)  Time elapsed: 0 sec  <<< ERROR!
java.lang.StringIndexOutOfBoundsException: Invalid length: 1
	at org.apache.commons.lang3.text.StrBuilder.append(StrBuilder.java:212)
	at org.apache.commons.lang3.text.StrTokenizer.readWithQuotes(StrTokenizer.java:758)
	at org.apache.commons.lang3.text.StrTokenizer.readNextToken(StrTokenizer.java:716)
	at org.apache.commons.lang3.text.StrTokenizer.tokenize(StrTokenizer.java:646)
	at org.apache.commons.lang3.text.StrTokenizer.checkTokenized(StrTokenizer.java:609)
	at org.apache.commons.lang3.text.StrTokenizer.getTokenArray(StrTokenizer.java:433)
	at org.apache.commons.lang3.text.StrTokenizerTest.test5(StrTokenizerTest.java:141)

test6(org.apache.commons.lang3.text.StrTokenizerTest)  Time elapsed: 0 sec  <<< ERROR!
java.lang.StringIndexOutOfBoundsException: Invalid length: 1
	at org.apache.commons.lang3.text.StrBuilder.append(StrBuilder.java:212)
	at org.apache.commons.lang3.text.StrTokenizer.readWithQuotes(StrTokenizer.java:758)
	at org.apache.commons.lang3.text.StrTokenizer.readNextToken(StrTokenizer.java:716)
	at org.apache.commons.lang3.text.StrTokenizer.tokenize(StrTokenizer.java:646)
	at org.apache.commons.lang3.text.StrTokenizer.checkTokenized(StrTokenizer.java:609)
	at org.apache.commons.lang3.text.StrTokenizer.getTokenArray(StrTokenizer.java:433)
	at org.apache.commons.lang3.text.StrTokenizerTest.test6(StrTokenizerTest.java:163)

testCSVSimpleNeedsTrim(org.apache.commons.lang3.text.StrTokenizerTest)  Time elapsed: 0 sec  <<< ERROR!
java.lang.StringIndexOutOfBoundsException: Invalid length: 1
	at org.apache.commons.lang3.text.StrBuilder.append(StrBuilder.java:212)
	at org.apache.commons.lang3.text.StrTokenizer.readWithQuotes(StrTokenizer.java:804)
	at org.apache.commons.lang3.text.StrTokenizer.readNextToken(StrTokenizer.java:718)
	at org.apache.commons.lang3.text.StrTokenizer.tokenize(StrTokenizer.java:646)
	at org.apache.commons.lang3.text.StrTokenizer.checkTokenized(StrTokenizer.java:609)
	at org.apache.commons.lang3.text.StrTokenizer.hasPrevious(StrTokenizer.java:540)
	at org.apache.commons.lang3.text.StrTokenizer.previousToken(StrTokenizer.java:421)
	at org.apache.commons.lang3.text.StrTokenizerTest.testXSVAbc(StrTokenizerTest.java:779)
	at org.apache.commons.lang3.text.StrTokenizerTest.testCSV(StrTokenizerTest.java:512)
	at org.apache.commons.lang3.text.StrTokenizerTest.testCSVSimpleNeedsTrim(StrTokenizerTest.java:531)

testBasicIgnoreTrimmed1(org.apache.commons.lang3.text.StrTokenizerTest)  Time elapsed: 0.001 sec  <<< ERROR!
java.lang.StringIndexOutOfBoundsException: Invalid length: 1
	at org.apache.commons.lang3.text.StrBuilder.append(StrBuilder.java:212)
	at org.apache.commons.lang3.text.StrTokenizer.readWithQuotes(StrTokenizer.java:804)
	at org.apache.commons.lang3.text.StrTokenizer.readNextToken(StrTokenizer.java:718)
	at org.apache.commons.lang3.text.StrTokenizer.tokenize(StrTokenizer.java:646)
	at org.apache.commons.lang3.text.StrTokenizer.checkTokenized(StrTokenizer.java:609)
	at org.apache.commons.lang3.text.StrTokenizer.hasNext(StrTokenizer.java:505)
	at org.apache.commons.lang3.text.StrTokenizer.next(StrTokenizer.java:517)
	at org.apache.commons.lang3.text.StrTokenizerTest.testBasicIgnoreTrimmed1(StrTokenizerTest.java:451)

testBasicIgnoreTrimmed2(org.apache.commons.lang3.text.StrTokenizerTest)  Time elapsed: 0 sec  <<< ERROR!
java.lang.StringIndexOutOfBoundsException: Invalid length: 1
	at org.apache.commons.lang3.text.StrBuilder.append(StrBuilder.java:212)
	at org.apache.commons.lang3.text.StrTokenizer.readWithQuotes(StrTokenizer.java:804)
	at org.apache.commons.lang3.text.StrTokenizer.readNextToken(StrTokenizer.java:718)
	at org.apache.commons.lang3.text.StrTokenizer.tokenize(StrTokenizer.java:646)
	at org.apache.commons.lang3.text.StrTokenizer.checkTokenized(StrTokenizer.java:609)
	at org.apache.commons.lang3.text.StrTokenizer.hasNext(StrTokenizer.java:505)
	at org.apache.commons.lang3.text.StrTokenizer.next(StrTokenizer.java:517)
	at org.apache.commons.lang3.text.StrTokenizerTest.testBasicIgnoreTrimmed2(StrTokenizerTest.java:465)

testBasicIgnoreTrimmed4(org.apache.commons.lang3.text.StrTokenizerTest)  Time elapsed: 0.001 sec  <<< ERROR!
java.lang.StringIndexOutOfBoundsException: Invalid length: 1
	at org.apache.commons.lang3.text.StrBuilder.append(StrBuilder.java:212)
	at org.apache.commons.lang3.text.StrTokenizer.readWithQuotes(StrTokenizer.java:804)
	at org.apache.commons.lang3.text.StrTokenizer.readNextToken(StrTokenizer.java:716)
	at org.apache.commons.lang3.text.StrTokenizer.tokenize(StrTokenizer.java:646)
	at org.apache.commons.lang3.text.StrTokenizer.checkTokenized(StrTokenizer.java:609)
	at org.apache.commons.lang3.text.StrTokenizer.hasNext(StrTokenizer.java:505)
	at org.apache.commons.lang3.text.StrTokenizer.next(StrTokenizer.java:517)
	at org.apache.commons.lang3.text.StrTokenizerTest.testBasicIgnoreTrimmed4(StrTokenizerTest.java:492)

testBasicQuotedTrimmed1(org.apache.commons.lang3.text.StrTokenizerTest)  Time elapsed: 0 sec  <<< ERROR!
java.lang.StringIndexOutOfBoundsException: Invalid length: 1
	at org.apache.commons.lang3.text.StrBuilder.append(StrBuilder.java:212)
	at org.apache.commons.lang3.text.StrTokenizer.readWithQuotes(StrTokenizer.java:804)
	at org.apache.commons.lang3.text.StrTokenizer.readNextToken(StrTokenizer.java:716)
	at org.apache.commons.lang3.text.StrTokenizer.tokenize(StrTokenizer.java:646)
	at org.apache.commons.lang3.text.StrTokenizer.checkTokenized(StrTokenizer.java:609)
	at org.apache.commons.lang3.text.StrTokenizer.hasNext(StrTokenizer.java:505)
	at org.apache.commons.lang3.text.StrTokenizer.next(StrTokenizer.java:517)
	at org.apache.commons.lang3.text.StrTokenizerTest.testBasicQuotedTrimmed1(StrTokenizerTest.java:411)

testBasicTrimmed1(org.apache.commons.lang3.text.StrTokenizerTest)  Time elapsed: 0.001 sec  <<< ERROR!
java.lang.StringIndexOutOfBoundsException: Invalid length: 1
	at org.apache.commons.lang3.text.StrBuilder.append(StrBuilder.java:212)
	at org.apache.commons.lang3.text.StrTokenizer.readWithQuotes(StrTokenizer.java:804)
	at org.apache.commons.lang3.text.StrTokenizer.readNextToken(StrTokenizer.java:718)
	at org.apache.commons.lang3.text.StrTokenizer.tokenize(StrTokenizer.java:646)
	at org.apache.commons.lang3.text.StrTokenizer.checkTokenized(StrTokenizer.java:609)
	at org.apache.commons.lang3.text.StrTokenizer.hasNext(StrTokenizer.java:505)
	at org.apache.commons.lang3.text.StrTokenizer.next(StrTokenizer.java:517)
	at org.apache.commons.lang3.text.StrTokenizerTest.testBasicTrimmed1(StrTokenizerTest.java:424)

testBasicTrimmed2(org.apache.commons.lang3.text.StrTokenizerTest)  Time elapsed: 0 sec  <<< ERROR!
java.lang.StringIndexOutOfBoundsException: Invalid length: 2
	at org.apache.commons.lang3.text.StrBuilder.append(StrBuilder.java:212)
	at org.apache.commons.lang3.text.StrTokenizer.readWithQuotes(StrTokenizer.java:804)
	at org.apache.commons.lang3.text.StrTokenizer.readNextToken(StrTokenizer.java:718)
	at org.apache.commons.lang3.text.StrTokenizer.tokenize(StrTokenizer.java:646)
	at org.apache.commons.lang3.text.StrTokenizer.checkTokenized(StrTokenizer.java:609)
	at org.apache.commons.lang3.text.StrTokenizer.hasNext(StrTokenizer.java:505)
	at org.apache.commons.lang3.text.StrTokenizer.next(StrTokenizer.java:517)
	at org.apache.commons.lang3.text.StrTokenizerTest.testBasicTrimmed2(StrTokenizerTest.java:437)

Running org.apache.commons.lang3.text.FormattableUtilsTest
Tests run: 5, Failures: 0, Errors: 0, Skipped: 0, Time elapsed: 0 sec - in org.apache.commons.lang3.text.FormattableUtilsTest
Running org.apache.commons.lang3.text.CompositeFormatTest
Tests run: 2, Failures: 0, Errors: 0, Skipped: 0, Time elapsed: 0.001 sec - in org.apache.commons.lang3.text.CompositeFormatTest
Running org.apache.commons.lang3.text.WordUtilsTest
Tests run: 12, Failures: 0, Errors: 0, Skipped: 0, Time elapsed: 0.001 sec - in org.apache.commons.lang3.text.WordUtilsTest
Running org.apache.commons.lang3.text.StrLookupTest
Tests run: 5, Failures: 0, Errors: 0, Skipped: 0, Time elapsed: 0.002 sec - in org.apache.commons.lang3.text.StrLookupTest
Running org.apache.commons.lang3.text.StrBuilderAppendInsertTest
Tests run: 51, Failures: 0, Errors: 2, Skipped: 0, Time elapsed: 0.022 sec <<< FAILURE! - in org.apache.commons.lang3.text.StrBuilderAppendInsertTest
testAppendln_CharArray_int_int(org.apache.commons.lang3.text.StrBuilderAppendInsertTest)  Time elapsed: 0 sec  <<< ERROR!
java.lang.StringIndexOutOfBoundsException: Invalid length: 3
	at org.apache.commons.lang3.text.StrBuilder.append(StrBuilder.java:212)
	at org.apache.commons.lang3.text.StrBuilderAppendInsertTest$12.append(StrBuilderAppendInsertTest.java:810)
	at org.apache.commons.lang3.text.StrBuilder.appendln(StrBuilder.java:249)
	at org.apache.commons.lang3.text.StrBuilderAppendInsertTest.testAppendln_CharArray_int_int(StrBuilderAppendInsertTest.java:818)

testAppend_CharArray_int_int(org.apache.commons.lang3.text.StrBuilderAppendInsertTest)  Time elapsed: 0.001 sec  <<< ERROR!
java.lang.StringIndexOutOfBoundsException: Invalid length: 3
	at org.apache.commons.lang3.text.StrBuilder.append(StrBuilder.java:212)
	at org.apache.commons.lang3.text.StrBuilderAppendInsertTest.testAppend_CharArray_int_int(StrBuilderAppendInsertTest.java:463)

Running org.apache.commons.lang3.text.ExtendedMessageFormatTest
Tests run: 10, Failures: 0, Errors: 0, Skipped: 0, Time elapsed: 0.859 sec - in org.apache.commons.lang3.text.ExtendedMessageFormatTest
Running org.apache.commons.lang3.text.StrSubstitutorTest
Tests run: 40, Failures: 0, Errors: 11, Skipped: 0, Time elapsed: 0.028 sec <<< FAILURE! - in org.apache.commons.lang3.text.StrSubstitutorTest
testReplaceEscaping(org.apache.commons.lang3.text.StrSubstitutorTest)  Time elapsed: 0.001 sec  <<< ERROR!
java.lang.StringIndexOutOfBoundsException: Invalid length: 38
	at org.apache.commons.lang3.text.StrBuilder.append(StrBuilder.java:212)
	at org.apache.commons.lang3.text.StrSubstitutor.replace(StrSubstitutor.java:459)
	at org.apache.commons.lang3.text.StrSubstitutorTest.doTestReplace(StrSubstitutorTest.java:643)
	at org.apache.commons.lang3.text.StrSubstitutorTest.testReplaceEscaping(StrSubstitutorTest.java:163)

testReplaceNoPrefixSuffix(org.apache.commons.lang3.text.StrSubstitutorTest)  Time elapsed: 0.001 sec  <<< ERROR!
java.lang.StringIndexOutOfBoundsException: Invalid length: 35
	at org.apache.commons.lang3.text.StrBuilder.append(StrBuilder.java:212)
	at org.apache.commons.lang3.text.StrSubstitutor.replace(StrSubstitutor.java:459)
	at org.apache.commons.lang3.text.StrSubstitutorTest.doTestReplace(StrSubstitutorTest.java:643)
	at org.apache.commons.lang3.text.StrSubstitutorTest.testReplaceNoPrefixSuffix(StrSubstitutorTest.java:212)

testReplaceToIdentical(org.apache.commons.lang3.text.StrSubstitutorTest)  Time elapsed: 0.001 sec  <<< ERROR!
java.lang.StringIndexOutOfBoundsException: Invalid length: 18
	at org.apache.commons.lang3.text.StrBuilder.append(StrBuilder.java:212)
	at org.apache.commons.lang3.text.StrSubstitutor.replace(StrSubstitutor.java:459)
	at org.apache.commons.lang3.text.StrSubstitutorTest.doTestReplace(StrSubstitutorTest.java:643)
	at org.apache.commons.lang3.text.StrSubstitutorTest.testReplaceToIdentical(StrSubstitutorTest.java:231)

testReplaceSimple(org.apache.commons.lang3.text.StrSubstitutorTest)  Time elapsed: 0.001 sec  <<< ERROR!
java.lang.StringIndexOutOfBoundsException: Invalid length: 37
	at org.apache.commons.lang3.text.StrBuilder.append(StrBuilder.java:212)
	at org.apache.commons.lang3.text.StrSubstitutor.replace(StrSubstitutor.java:459)
	at org.apache.commons.lang3.text.StrSubstitutorTest.doTestReplace(StrSubstitutorTest.java:643)
	at org.apache.commons.lang3.text.StrSubstitutorTest.testReplaceSimple(StrSubstitutorTest.java:63)

testReplaceRecursive(org.apache.commons.lang3.text.StrSubstitutorTest)  Time elapsed: 0.001 sec  <<< ERROR!
java.lang.StringIndexOutOfBoundsException: Invalid length: 37
	at org.apache.commons.lang3.text.StrBuilder.append(StrBuilder.java:212)
	at org.apache.commons.lang3.text.StrSubstitutor.replace(StrSubstitutor.java:459)
	at org.apache.commons.lang3.text.StrSubstitutorTest.doTestReplace(StrSubstitutorTest.java:643)
	at org.apache.commons.lang3.text.StrSubstitutorTest.testReplaceRecursive(StrSubstitutorTest.java:152)

testReplaceUnknownKey(org.apache.commons.lang3.text.StrSubstitutorTest)  Time elapsed: 0 sec  <<< ERROR!
java.lang.StringIndexOutOfBoundsException: Invalid length: 37
	at org.apache.commons.lang3.text.StrBuilder.append(StrBuilder.java:212)
	at org.apache.commons.lang3.text.StrSubstitutor.replace(StrSubstitutor.java:459)
	at org.apache.commons.lang3.text.StrSubstitutorTest.doTestReplace(StrSubstitutorTest.java:643)
	at org.apache.commons.lang3.text.StrSubstitutorTest.testReplaceUnknownKey(StrSubstitutorTest.java:113)

testReplaceNoPrefixNoSuffix(org.apache.commons.lang3.text.StrSubstitutorTest)  Time elapsed: 0 sec  <<< ERROR!
java.lang.StringIndexOutOfBoundsException: Invalid length: 34
	at org.apache.commons.lang3.text.StrBuilder.append(StrBuilder.java:212)
	at org.apache.commons.lang3.text.StrSubstitutor.replace(StrSubstitutor.java:459)
	at org.apache.commons.lang3.text.StrSubstitutorTest.doTestReplace(StrSubstitutorTest.java:643)
	at org.apache.commons.lang3.text.StrSubstitutorTest.testReplaceNoPrefixNoSuffix(StrSubstitutorTest.java:188)

testReplaceEmptyKeys(org.apache.commons.lang3.text.StrSubstitutorTest)  Time elapsed: 0.001 sec  <<< ERROR!
java.lang.StringIndexOutOfBoundsException: Invalid length: 31
	at org.apache.commons.lang3.text.StrBuilder.append(StrBuilder.java:212)
	at org.apache.commons.lang3.text.StrSubstitutor.replace(StrSubstitutor.java:459)
	at org.apache.commons.lang3.text.StrSubstitutorTest.doTestReplace(StrSubstitutorTest.java:643)
	at org.apache.commons.lang3.text.StrSubstitutorTest.testReplaceEmptyKeys(StrSubstitutorTest.java:220)

testReplaceComplexEscaping(org.apache.commons.lang3.text.StrSubstitutorTest)  Time elapsed: 0 sec  <<< ERROR!
java.lang.StringIndexOutOfBoundsException: Invalid length: 41
	at org.apache.commons.lang3.text.StrBuilder.append(StrBuilder.java:212)
	at org.apache.commons.lang3.text.StrSubstitutor.replace(StrSubstitutor.java:459)
	at org.apache.commons.lang3.text.StrSubstitutorTest.doTestReplace(StrSubstitutorTest.java:643)
	at org.apache.commons.lang3.text.StrSubstitutorTest.testReplaceComplexEscaping(StrSubstitutorTest.java:179)

testReplacePrefixNoSuffix(org.apache.commons.lang3.text.StrSubstitutorTest)  Time elapsed: 0.001 sec  <<< ERROR!
java.lang.StringIndexOutOfBoundsException: Invalid length: 46
	at org.apache.commons.lang3.text.StrBuilder.append(StrBuilder.java:212)
	at org.apache.commons.lang3.text.StrSubstitutor.replace(StrSubstitutor.java:459)
	at org.apache.commons.lang3.text.StrSubstitutorTest.doTestReplace(StrSubstitutorTest.java:643)
	at org.apache.commons.lang3.text.StrSubstitutorTest.testReplacePrefixNoSuffix(StrSubstitutorTest.java:204)

testReplaceIncompletePrefix(org.apache.commons.lang3.text.StrSubstitutorTest)  Time elapsed: 0 sec  <<< ERROR!
java.lang.StringIndexOutOfBoundsException: Invalid length: 36
	at org.apache.commons.lang3.text.StrBuilder.append(StrBuilder.java:212)
	at org.apache.commons.lang3.text.StrSubstitutor.replace(StrSubstitutor.java:459)
	at org.apache.commons.lang3.text.StrSubstitutorTest.doTestReplace(StrSubstitutorTest.java:643)
	at org.apache.commons.lang3.text.StrSubstitutorTest.testReplaceIncompletePrefix(StrSubstitutorTest.java:196)

Running org.apache.commons.lang3.text.StrBuilderTest
Tests run: 90, Failures: 0, Errors: 1, Skipped: 0, Time elapsed: 0.092 sec <<< FAILURE! - in org.apache.commons.lang3.text.StrBuilderTest
testAsWriter(org.apache.commons.lang3.text.StrBuilderTest)  Time elapsed: 0.001 sec  <<< ERROR!
java.lang.StringIndexOutOfBoundsException: Invalid length: 2
	at org.apache.commons.lang3.text.StrBuilder.append(StrBuilder.java:212)
	at org.apache.commons.lang3.text.StrBuilder$StrBuilderWriter.write(StrBuilder.java:644)
	at org.apache.commons.lang3.text.StrBuilderTest.testAsWriter(StrBuilderTest.java:1780)

Running org.apache.commons.lang3.StringEscapeUtilsTest
Tests run: 28, Failures: 0, Errors: 0, Skipped: 0, Time elapsed: 0.406 sec - in org.apache.commons.lang3.StringEscapeUtilsTest
Running org.apache.commons.lang3.AnnotationUtilsTest
Tests run: 10, Failures: 0, Errors: 0, Skipped: 0, Time elapsed: 0.016 sec - in org.apache.commons.lang3.AnnotationUtilsTest
Running org.apache.commons.lang3.ConversionTest
Tests run: 42, Failures: 0, Errors: 0, Skipped: 0, Time elapsed: 0.009 sec - in org.apache.commons.lang3.ConversionTest
Running org.apache.commons.lang3.StringUtilsTrimEmptyTest
Tests run: 15, Failures: 0, Errors: 0, Skipped: 0, Time elapsed: 0.009 sec - in org.apache.commons.lang3.StringUtilsTrimEmptyTest
Running org.apache.commons.lang3.EnumUtilsTest
Tests run: 34, Failures: 0, Errors: 0, Skipped: 0, Time elapsed: 0.009 sec - in org.apache.commons.lang3.EnumUtilsTest
Running org.apache.commons.lang3.exception.ExceptionUtilsTest
Tests run: 28, Failures: 0, Errors: 0, Skipped: 0, Time elapsed: 0.025 sec - in org.apache.commons.lang3.exception.ExceptionUtilsTest
Running org.apache.commons.lang3.exception.DefaultExceptionContextTest
Tests run: 8, Failures: 0, Errors: 0, Skipped: 0, Time elapsed: 0.005 sec - in org.apache.commons.lang3.exception.DefaultExceptionContextTest
Running org.apache.commons.lang3.exception.ContextedExceptionTest
Tests run: 14, Failures: 0, Errors: 0, Skipped: 0, Time elapsed: 0.019 sec - in org.apache.commons.lang3.exception.ContextedExceptionTest
Running org.apache.commons.lang3.exception.ContextedRuntimeExceptionTest
Tests run: 14, Failures: 0, Errors: 0, Skipped: 0, Time elapsed: 0.015 sec - in org.apache.commons.lang3.exception.ContextedRuntimeExceptionTest
Running org.apache.commons.lang3.BitFieldTest
Tests run: 15, Failures: 0, Errors: 0, Skipped: 0, Time elapsed: 0.002 sec - in org.apache.commons.lang3.BitFieldTest
Running org.apache.commons.lang3.ArrayUtilsRemoveMultipleTest
Tests run: 55, Failures: 0, Errors: 0, Skipped: 0, Time elapsed: 0.014 sec - in org.apache.commons.lang3.ArrayUtilsRemoveMultipleTest
Running org.apache.commons.lang3.HashSetvBitSetTest
Ratio=8% array=100 count=1 extract=20850175 bitset=1842829
Ratio=8% array=100 count=10 extract=20542024 bitset=1655047
Ratio=6% array=100 count=50 extract=23502079 bitset=1421562
Ratio=6% array=100 count=100 extract=12558470 bitset=767993
Ratio=75% array=1000 count=10 extract=7681013 bitset=5765581
Ratio=30% array=1000 count=100 extract=17371288 bitset=5301329
Ratio=7% array=1000 count=500 extract=47782223 bitset=3588959
Ratio=0% array=1000 count=1000 extract=78315279 bitset=781085
Ratio=1156% count=0 hash=706583 bits=8172021
Ratio=17% count=5 hash=1279513 bits=218656
Ratio=26% count=10 hash=1116966 bits=295282
Ratio=19% count=200 hash=22952110 bits=4499504
Ratio=13% count=50 hash=9663270 bits=1303675
Ratio=19% count=100 hash=17134841 bits=3352583
Ratio=20% count=1000 hash=89588090 bits=18360875
Ratio=19% count=2000 hash=179544001 bits=34834582
Tests run: 2, Failures: 0, Errors: 0, Skipped: 0, Time elapsed: 0.77 sec - in org.apache.commons.lang3.HashSetvBitSetTest
Running org.apache.commons.lang3.StringUtilsTest
Tests run: 124, Failures: 0, Errors: 0, Skipped: 0, Time elapsed: 0.243 sec - in org.apache.commons.lang3.StringUtilsTest
Running org.apache.commons.lang3.ArrayUtilsRemoveTest
Tests run: 19, Failures: 0, Errors: 0, Skipped: 0, Time elapsed: 0.01 sec - in org.apache.commons.lang3.ArrayUtilsRemoveTest
Running org.apache.commons.lang3.ObjectUtilsTest
Tests run: 36, Failures: 0, Errors: 0, Skipped: 0, Time elapsed: 0.021 sec - in org.apache.commons.lang3.ObjectUtilsTest
Running org.apache.commons.lang3.ClassPathUtilsTest
Tests run: 13, Failures: 0, Errors: 0, Skipped: 0, Time elapsed: 0.007 sec - in org.apache.commons.lang3.ClassPathUtilsTest
Running org.apache.commons.lang3.math.NumberUtilsTest
Tests run: 91, Failures: 0, Errors: 0, Skipped: 0, Time elapsed: 0.08 sec - in org.apache.commons.lang3.math.NumberUtilsTest
Running org.apache.commons.lang3.math.IEEE754rUtilsTest
Tests run: 3, Failures: 0, Errors: 0, Skipped: 0, Time elapsed: 0.008 sec - in org.apache.commons.lang3.math.IEEE754rUtilsTest
Running org.apache.commons.lang3.math.FractionTest
Tests run: 25, Failures: 0, Errors: 0, Skipped: 0, Time elapsed: 0.418 sec - in org.apache.commons.lang3.math.FractionTest
Running org.apache.commons.lang3.BooleanUtilsTest
Tests run: 72, Failures: 0, Errors: 0, Skipped: 0, Time elapsed: 0.025 sec - in org.apache.commons.lang3.BooleanUtilsTest
Running org.apache.commons.lang3.CharSequenceUtilsTest
Tests run: 2, Failures: 0, Errors: 0, Skipped: 0, Time elapsed: 0 sec - in org.apache.commons.lang3.CharSequenceUtilsTest
Running org.apache.commons.lang3.CharSetUtilsTest
Tests run: 11, Failures: 0, Errors: 0, Skipped: 0, Time elapsed: 0 sec - in org.apache.commons.lang3.CharSetUtilsTest
Running org.apache.commons.lang3.ArrayUtilsAddTest
Tests run: 13, Failures: 0, Errors: 0, Skipped: 0, Time elapsed: 0 sec - in org.apache.commons.lang3.ArrayUtilsAddTest
Running org.apache.commons.lang3.CharEncodingTest
Tests run: 6, Failures: 0, Errors: 0, Skipped: 0, Time elapsed: 0.04 sec - in org.apache.commons.lang3.CharEncodingTest
Running org.apache.commons.lang3.ClassUtilsTest
Tests run: 57, Failures: 0, Errors: 0, Skipped: 0, Time elapsed: 0.034 sec - in org.apache.commons.lang3.ClassUtilsTest
Running org.apache.commons.lang3.RangeTest
Tests run: 24, Failures: 0, Errors: 0, Skipped: 0, Time elapsed: 0.002 sec - in org.apache.commons.lang3.RangeTest
Running org.apache.commons.lang3.event.EventUtilsTest
Tests run: 8, Failures: 0, Errors: 0, Skipped: 0, Time elapsed: 0.043 sec - in org.apache.commons.lang3.event.EventUtilsTest
Running org.apache.commons.lang3.event.EventListenerSupportTest
Tests run: 9, Failures: 0, Errors: 0, Skipped: 0, Time elapsed: 0.055 sec - in org.apache.commons.lang3.event.EventListenerSupportTest
Running org.apache.commons.lang3.ArrayUtilsTest
Tests run: 205, Failures: 0, Errors: 0, Skipped: 0, Time elapsed: 0.043 sec - in org.apache.commons.lang3.ArrayUtilsTest
Running org.apache.commons.lang3.CharUtilsTest
Tests run: 24, Failures: 0, Errors: 0, Skipped: 0, Time elapsed: 0.005 sec - in org.apache.commons.lang3.CharUtilsTest
Running org.apache.commons.lang3.NotImplementedExceptionTest
Tests run: 1, Failures: 0, Errors: 0, Skipped: 0, Time elapsed: 0.001 sec - in org.apache.commons.lang3.NotImplementedExceptionTest
Running org.apache.commons.lang3.StringUtilsEqualsIndexOfTest
Tests run: 50, Failures: 0, Errors: 0, Skipped: 0, Time elapsed: 0.011 sec - in org.apache.commons.lang3.StringUtilsEqualsIndexOfTest
Running org.apache.commons.lang3.RandomUtilsTest
Tests run: 23, Failures: 0, Errors: 0, Skipped: 0, Time elapsed: 0 sec - in org.apache.commons.lang3.RandomUtilsTest

Results :


Tests in error: 
  StrBuilderAppendInsertTest.testAppend_CharArray_int_int:463 » StringIndexOutOfBounds
  StrBuilderAppendInsertTest.testAppendln_CharArray_int_int:818 » StringIndexOutOfBounds
  StrBuilderTest.testAsWriter:1780 » StringIndexOutOfBounds Invalid length: 2
  StrSubstitutorTest.testReplaceComplexEscaping:179->doTestReplace:643 » StringIndexOutOfBounds
  StrSubstitutorTest.testReplaceEmptyKeys:220->doTestReplace:643 » StringIndexOutOfBounds
  StrSubstitutorTest.testReplaceEscaping:163->doTestReplace:643 » StringIndexOutOfBounds
  StrSubstitutorTest.testReplaceIncompletePrefix:196->doTestReplace:643 » StringIndexOutOfBounds
  StrSubstitutorTest.testReplaceNoPrefixNoSuffix:188->doTestReplace:643 » StringIndexOutOfBounds
  StrSubstitutorTest.testReplaceNoPrefixSuffix:212->doTestReplace:643 » StringIndexOutOfBounds
  StrSubstitutorTest.testReplacePrefixNoSuffix:204->doTestReplace:643 » StringIndexOutOfBounds
  StrSubstitutorTest.testReplaceRecursive:152->doTestReplace:643 » StringIndexOutOfBounds
  StrSubstitutorTest.testReplaceSimple:63->doTestReplace:643 » StringIndexOutOfBounds
  StrSubstitutorTest.testReplaceToIdentical:231->doTestReplace:643 » StringIndexOutOfBounds
  StrSubstitutorTest.testReplaceUnknownKey:113->doTestReplace:643 » StringIndexOutOfBounds
  StrTokenizerTest.test1:56 » StringIndexOutOfBounds Invalid length: 1
  StrTokenizerTest.test2:77 » StringIndexOutOfBounds Invalid length: 1
  StrTokenizerTest.test3:98 » StringIndexOutOfBounds Invalid length: 1
  StrTokenizerTest.test4:119 » StringIndexOutOfBounds Invalid length: 1
  StrTokenizerTest.test5:141 » StringIndexOutOfBounds Invalid length: 1
  StrTokenizerTest.test6:163 » StringIndexOutOfBounds Invalid length: 1
  StrTokenizerTest.testBasicIgnoreTrimmed1:451 » StringIndexOutOfBounds Invalid ...
  StrTokenizerTest.testBasicIgnoreTrimmed2:465 » StringIndexOutOfBounds Invalid ...
  StrTokenizerTest.testBasicIgnoreTrimmed4:492 » StringIndexOutOfBounds Invalid ...
  StrTokenizerTest.testBasicQuoted3:352 » StringIndexOutOfBounds Invalid length:...
  StrTokenizerTest.testBasicQuoted4:364 » StringIndexOutOfBounds Invalid length:...
  StrTokenizerTest.testBasicQuoted5:377 » StringIndexOutOfBounds Invalid length:...
  StrTokenizerTest.testBasicQuotedTrimmed1:411 » StringIndexOutOfBounds Invalid ...
  StrTokenizerTest.testBasicTrimmed1:424 » StringIndexOutOfBounds Invalid length...
  StrTokenizerTest.testBasicTrimmed2:437 » StringIndexOutOfBounds Invalid length...
  StrTokenizerTest.testCSVSimpleNeedsTrim:531->testCSV:512->testXSVAbc:779 » StringIndexOutOfBounds


Tests run: 3526, Failures: 0, Errors: 30, Skipped: 97

[INFO] ------------------------------------------------------------------------
[INFO] BUILD FAILURE
[INFO] ------------------------------------------------------------------------
[INFO] Total time: 40.157s
[INFO] Finished at: Wed Aug 05 00:43:10 BST 2015
[INFO] Final Memory: 24M/412M
[INFO] ------------------------------------------------------------------------
[ERROR] Failed to execute goal org.apache.maven.plugins:maven-surefire-plugin:2.18:test (default-test) on project commons-lang3: There are test failures.
[ERROR] 
[ERROR] Please refer to /home/perham/Study/LittleDarwin/Cases/commons-lang3-3.4-src/target/surefire-reports for the individual test results.
[ERROR] -> [Help 1]
[ERROR] 
[ERROR] To see the full stack trace of the errors, re-run Maven with the -e switch.
[ERROR] Re-run Maven using the -X switch to enable full debug logging.
[ERROR] 
[ERROR] For more information about the errors and possible solutions, please read the following articles:
[ERROR] [Help 1] http://cwiki.apache.org/confluence/display/MAVEN/MojoFailureException
