[INFO] Scanning for projects...
[INFO]                                                                         
[INFO] ------------------------------------------------------------------------
[INFO] Building Apache Commons Lang 3.4
[INFO] ------------------------------------------------------------------------
[INFO] 
[INFO] --- maven-enforcer-plugin:1.3.1:enforce (enforce-maven-3) @ commons-lang3 ---
[INFO] 
[INFO] --- build-helper-maven-plugin:1.8:parse-version (parse-version) @ commons-lang3 ---
[INFO] 
[INFO] --- maven-antrun-plugin:1.8:run (javadoc.resources) @ commons-lang3 ---
[INFO] Executing tasks

main:
[INFO] Executed tasks
[INFO] 
[INFO] --- maven-remote-resources-plugin:1.5:process (default) @ commons-lang3 ---
[INFO] 
[INFO] --- buildnumber-maven-plugin:1.3:create (default) @ commons-lang3 ---
[INFO] Executing: /bin/sh -c cd /home/perham/Study/LittleDarwin/Cases/commons-lang3-3.4-src && svn --non-interactive info
[INFO] Working directory: /home/perham/Study/LittleDarwin/Cases/commons-lang3-3.4-src
[INFO] Storing buildNumber: ?????? at timestamp: 1438724844450
[INFO] Executing: /bin/sh -c cd /home/perham/Study/LittleDarwin/Cases/commons-lang3-3.4-src && svn --non-interactive info
[INFO] Working directory: /home/perham/Study/LittleDarwin/Cases/commons-lang3-3.4-src
[INFO] Storing buildScmBranch: UNKNOWN_BRANCH
[INFO] 
[INFO] --- maven-resources-plugin:2.7:resources (default-resources) @ commons-lang3 ---
[INFO] Using 'ISO-8859-1' encoding to copy filtered resources.
[INFO] Copying 0 resource
[INFO] Copying 2 resources to META-INF
[INFO] 
[INFO] --- maven-compiler-plugin:3.2:compile (default-compile) @ commons-lang3 ---
[INFO] Changes detected - recompiling the module!
[INFO] Compiling 133 source files to /home/perham/Study/LittleDarwin/Cases/commons-lang3-3.4-src/target/classes
[INFO] /home/perham/Study/LittleDarwin/Cases/commons-lang3-3.4-src/src/main/java/org/apache/commons/lang3/SerializationUtils.java: /home/perham/Study/LittleDarwin/Cases/commons-lang3-3.4-src/src/main/java/org/apache/commons/lang3/SerializationUtils.java uses unchecked or unsafe operations.
[INFO] /home/perham/Study/LittleDarwin/Cases/commons-lang3-3.4-src/src/main/java/org/apache/commons/lang3/SerializationUtils.java: Recompile with -Xlint:unchecked for details.
[INFO] 
[INFO] --- maven-bundle-plugin:2.5.3:manifest (bundle-manifest) @ commons-lang3 ---
[INFO] 
[INFO] --- animal-sniffer-maven-plugin:1.13:check (checkAPIcompatibility) @ commons-lang3 ---
[INFO] Checking unresolved references to org.codehaus.mojo.signature:java16:1.0
[INFO] 
[INFO] --- maven-resources-plugin:2.7:testResources (default-testResources) @ commons-lang3 ---
[INFO] Using 'ISO-8859-1' encoding to copy filtered resources.
[INFO] Copying 2 resources
[INFO] Copying 2 resources to META-INF
[INFO] 
[INFO] --- maven-compiler-plugin:3.2:testCompile (default-testCompile) @ commons-lang3 ---
[INFO] Nothing to compile - all classes are up to date
[INFO] 
[INFO] --- maven-surefire-plugin:2.18:test (default-test) @ commons-lang3 ---
[INFO] Surefire report directory: /home/perham/Study/LittleDarwin/Cases/commons-lang3-3.4-src/target/surefire-reports

-------------------------------------------------------
 T E S T S
-------------------------------------------------------
Running org.apache.commons.lang3.ValidateTest
Tests run: 63, Failures: 0, Errors: 0, Skipped: 0, Time elapsed: 0.042 sec - in org.apache.commons.lang3.ValidateTest
Running org.apache.commons.lang3.LocaleUtilsTest
Tests run: 15, Failures: 0, Errors: 0, Skipped: 0, Time elapsed: 0.038 sec - in org.apache.commons.lang3.LocaleUtilsTest
Running org.apache.commons.lang3.tuple.MutableTripleTest
Tests run: 8, Failures: 0, Errors: 0, Skipped: 0, Time elapsed: 0.022 sec - in org.apache.commons.lang3.tuple.MutableTripleTest
Running org.apache.commons.lang3.tuple.TripleTest
Tests run: 10, Failures: 0, Errors: 0, Skipped: 0, Time elapsed: 0.014 sec - in org.apache.commons.lang3.tuple.TripleTest
Running org.apache.commons.lang3.tuple.ImmutablePairTest
Tests run: 6, Failures: 0, Errors: 0, Skipped: 0, Time elapsed: 0.006 sec - in org.apache.commons.lang3.tuple.ImmutablePairTest
Running org.apache.commons.lang3.tuple.MutablePairTest
Tests run: 8, Failures: 0, Errors: 0, Skipped: 0, Time elapsed: 0.002 sec - in org.apache.commons.lang3.tuple.MutablePairTest
Running org.apache.commons.lang3.tuple.ImmutableTripleTest
Tests run: 6, Failures: 0, Errors: 0, Skipped: 0, Time elapsed: 0.001 sec - in org.apache.commons.lang3.tuple.ImmutableTripleTest
Running org.apache.commons.lang3.tuple.PairTest
Tests run: 9, Failures: 0, Errors: 0, Skipped: 0, Time elapsed: 0.001 sec - in org.apache.commons.lang3.tuple.PairTest
Running org.apache.commons.lang3.StringUtilsIsTest
Tests run: 8, Failures: 0, Errors: 0, Skipped: 0, Time elapsed: 0.002 sec - in org.apache.commons.lang3.StringUtilsIsTest
Running org.apache.commons.lang3.JavaVersionTest
Tests run: 3, Failures: 0, Errors: 0, Skipped: 0, Time elapsed: 0 sec - in org.apache.commons.lang3.JavaVersionTest
Running org.apache.commons.lang3.builder.NoFieldNamesToStringStyleTest
Tests run: 8, Failures: 0, Errors: 0, Skipped: 0, Time elapsed: 0 sec - in org.apache.commons.lang3.builder.NoFieldNamesToStringStyleTest
Running org.apache.commons.lang3.builder.ShortPrefixToStringStyleTest
Tests run: 8, Failures: 0, Errors: 0, Skipped: 0, Time elapsed: 0.001 sec - in org.apache.commons.lang3.builder.ShortPrefixToStringStyleTest
Running org.apache.commons.lang3.builder.DiffResultTest
Tests run: 9, Failures: 0, Errors: 0, Skipped: 0, Time elapsed: 0.005 sec - in org.apache.commons.lang3.builder.DiffResultTest
Running org.apache.commons.lang3.builder.CompareToBuilderTest
Tests run: 48, Failures: 0, Errors: 0, Skipped: 0, Time elapsed: 0.021 sec - in org.apache.commons.lang3.builder.CompareToBuilderTest
Running org.apache.commons.lang3.builder.MultilineRecursiveToStringStyleTest
Tests run: 10, Failures: 0, Errors: 0, Skipped: 0, Time elapsed: 0 sec - in org.apache.commons.lang3.builder.MultilineRecursiveToStringStyleTest
Running org.apache.commons.lang3.builder.RecursiveToStringStyleTest
Tests run: 8, Failures: 0, Errors: 0, Skipped: 0, Time elapsed: 0 sec - in org.apache.commons.lang3.builder.RecursiveToStringStyleTest
Running org.apache.commons.lang3.builder.DefaultToStringStyleTest
Tests run: 8, Failures: 0, Errors: 0, Skipped: 0, Time elapsed: 0.001 sec - in org.apache.commons.lang3.builder.DefaultToStringStyleTest
Running org.apache.commons.lang3.builder.ReflectionToStringBuilderExcludeTest
Tests run: 11, Failures: 0, Errors: 0, Skipped: 0, Time elapsed: 0.002 sec - in org.apache.commons.lang3.builder.ReflectionToStringBuilderExcludeTest
Running org.apache.commons.lang3.builder.StandardToStringStyleTest
Tests run: 8, Failures: 0, Errors: 0, Skipped: 0, Time elapsed: 0.001 sec - in org.apache.commons.lang3.builder.StandardToStringStyleTest
Running org.apache.commons.lang3.builder.ToStringStyleTest
Tests run: 12, Failures: 0, Errors: 0, Skipped: 0, Time elapsed: 0.007 sec - in org.apache.commons.lang3.builder.ToStringStyleTest
Running org.apache.commons.lang3.builder.DiffTest
Tests run: 4, Failures: 0, Errors: 0, Skipped: 0, Time elapsed: 0.003 sec - in org.apache.commons.lang3.builder.DiffTest
Running org.apache.commons.lang3.builder.SimpleToStringStyleTest
Tests run: 8, Failures: 0, Errors: 0, Skipped: 0, Time elapsed: 0.007 sec - in org.apache.commons.lang3.builder.SimpleToStringStyleTest
Running org.apache.commons.lang3.builder.MultiLineToStringStyleTest
Tests run: 8, Failures: 0, Errors: 0, Skipped: 0, Time elapsed: 0.008 sec - in org.apache.commons.lang3.builder.MultiLineToStringStyleTest
Running org.apache.commons.lang3.builder.ToStringStyleConcurrencyTest
Tests run: 3, Failures: 0, Errors: 0, Skipped: 0, Time elapsed: 4.742 sec - in org.apache.commons.lang3.builder.ToStringStyleConcurrencyTest
Running org.apache.commons.lang3.builder.ReflectionToStringBuilderMutateInspectConcurrencyTest
Tests run: 1, Failures: 0, Errors: 0, Skipped: 1, Time elapsed: 0.004 sec - in org.apache.commons.lang3.builder.ReflectionToStringBuilderMutateInspectConcurrencyTest
Running org.apache.commons.lang3.builder.ToStringBuilderTest
Tests run: 74, Failures: 0, Errors: 0, Skipped: 1, Time elapsed: 0.054 sec - in org.apache.commons.lang3.builder.ToStringBuilderTest
Running org.apache.commons.lang3.builder.EqualsBuilderTest
Tests run: 48, Failures: 0, Errors: 0, Skipped: 0, Time elapsed: 0.004 sec - in org.apache.commons.lang3.builder.EqualsBuilderTest
Running org.apache.commons.lang3.builder.HashCodeBuilderAndEqualsBuilderTest
Tests run: 4, Failures: 0, Errors: 0, Skipped: 0, Time elapsed: 0 sec - in org.apache.commons.lang3.builder.HashCodeBuilderAndEqualsBuilderTest
Running org.apache.commons.lang3.builder.ReflectionToStringBuilderConcurrencyTest
Tests run: 3, Failures: 0, Errors: 0, Skipped: 3, Time elapsed: 0 sec - in org.apache.commons.lang3.builder.ReflectionToStringBuilderConcurrencyTest
Running org.apache.commons.lang3.builder.JsonToStringStyleTest
Tests run: 9, Failures: 0, Errors: 0, Skipped: 0, Time elapsed: 0.001 sec - in org.apache.commons.lang3.builder.JsonToStringStyleTest
Running org.apache.commons.lang3.builder.NoClassNameToStringStyleTest
Tests run: 8, Failures: 0, Errors: 0, Skipped: 0, Time elapsed: 0.002 sec - in org.apache.commons.lang3.builder.NoClassNameToStringStyleTest
Running org.apache.commons.lang3.builder.DiffBuilderTest
Tests run: 30, Failures: 0, Errors: 0, Skipped: 0, Time elapsed: 0.042 sec - in org.apache.commons.lang3.builder.DiffBuilderTest
Running org.apache.commons.lang3.builder.HashCodeBuilderTest
Tests run: 44, Failures: 0, Errors: 0, Skipped: 0, Time elapsed: 0.021 sec - in org.apache.commons.lang3.builder.HashCodeBuilderTest
Running org.apache.commons.lang3.concurrent.AtomicInitializerTest
Tests run: 3, Failures: 0, Errors: 0, Skipped: 0, Time elapsed: 0.011 sec - in org.apache.commons.lang3.concurrent.AtomicInitializerTest
Running org.apache.commons.lang3.concurrent.CallableBackgroundInitializerTest
Tests run: 4, Failures: 0, Errors: 0, Skipped: 0, Time elapsed: 0.001 sec - in org.apache.commons.lang3.concurrent.CallableBackgroundInitializerTest
Running org.apache.commons.lang3.concurrent.BackgroundInitializerTest
Tests run: 15, Failures: 0, Errors: 0, Skipped: 0, Time elapsed: 0.02 sec - in org.apache.commons.lang3.concurrent.BackgroundInitializerTest
Running org.apache.commons.lang3.concurrent.LazyInitializerTest
Tests run: 3, Failures: 0, Errors: 0, Skipped: 0, Time elapsed: 0.006 sec - in org.apache.commons.lang3.concurrent.LazyInitializerTest
Running org.apache.commons.lang3.concurrent.BasicThreadFactoryTest
Tests run: 15, Failures: 0, Errors: 0, Skipped: 0, Time elapsed: 0.033 sec - in org.apache.commons.lang3.concurrent.BasicThreadFactoryTest
Running org.apache.commons.lang3.concurrent.ConstantInitializerTest
Tests run: 7, Failures: 0, Errors: 0, Skipped: 0, Time elapsed: 0.001 sec - in org.apache.commons.lang3.concurrent.ConstantInitializerTest
Running org.apache.commons.lang3.concurrent.MultiBackgroundInitializerTest
Tests run: 17, Failures: 0, Errors: 0, Skipped: 0, Time elapsed: 0.092 sec - in org.apache.commons.lang3.concurrent.MultiBackgroundInitializerTest
Running org.apache.commons.lang3.concurrent.AtomicSafeInitializerTest
Tests run: 4, Failures: 0, Errors: 0, Skipped: 0, Time elapsed: 0.007 sec - in org.apache.commons.lang3.concurrent.AtomicSafeInitializerTest
Running org.apache.commons.lang3.concurrent.ConcurrentUtilsTest
Tests run: 40, Failures: 0, Errors: 0, Skipped: 0, Time elapsed: 0.013 sec - in org.apache.commons.lang3.concurrent.ConcurrentUtilsTest
Running org.apache.commons.lang3.concurrent.TimedSemaphoreTest
Tests run: 15, Failures: 0, Errors: 0, Skipped: 0, Time elapsed: 1.185 sec - in org.apache.commons.lang3.concurrent.TimedSemaphoreTest
Running org.apache.commons.lang3.StringUtilsSubstringTest
Tests run: 14, Failures: 0, Errors: 0, Skipped: 0, Time elapsed: 0.002 sec - in org.apache.commons.lang3.StringUtilsSubstringTest
Running org.apache.commons.lang3.SystemUtilsTest
Tests run: 12, Failures: 0, Errors: 0, Skipped: 0, Time elapsed: 0.006 sec - in org.apache.commons.lang3.SystemUtilsTest
Running org.apache.commons.lang3.CharRangeTest
Tests run: 16, Failures: 0, Errors: 0, Skipped: 0, Time elapsed: 0.035 sec - in org.apache.commons.lang3.CharRangeTest
Running org.apache.commons.lang3.CharSetTest
Tests run: 14, Failures: 0, Errors: 0, Skipped: 0, Time elapsed: 0.009 sec - in org.apache.commons.lang3.CharSetTest
Running org.apache.commons.lang3.StringUtilsStartsEndsWithTest
Tests run: 6, Failures: 0, Errors: 0, Skipped: 0, Time elapsed: 0.002 sec - in org.apache.commons.lang3.StringUtilsStartsEndsWithTest
Running org.apache.commons.lang3.RandomStringUtilsTest
Tests run: 11, Failures: 0, Errors: 0, Skipped: 0, Time elapsed: 0.035 sec - in org.apache.commons.lang3.RandomStringUtilsTest
Running org.apache.commons.lang3.SerializationUtilsTest
Tests run: 26, Failures: 0, Errors: 0, Skipped: 0, Time elapsed: 0.053 sec - in org.apache.commons.lang3.SerializationUtilsTest
Running org.apache.commons.lang3.time.StopWatchTest
Tests run: 8, Failures: 0, Errors: 0, Skipped: 0, Time elapsed: 4.758 sec - in org.apache.commons.lang3.time.StopWatchTest
Running org.apache.commons.lang3.time.DateUtilsRoundingTest
Tests run: 22, Failures: 0, Errors: 0, Skipped: 0, Time elapsed: 0.175 sec - in org.apache.commons.lang3.time.DateUtilsRoundingTest
Running org.apache.commons.lang3.time.FastDateParserTest
Tests run: 33, Failures: 0, Errors: 0, Skipped: 0, Time elapsed: 2.544 sec - in org.apache.commons.lang3.time.FastDateParserTest
Running org.apache.commons.lang3.time.FastDateFormat_ParserTest
Tests run: 33, Failures: 0, Errors: 0, Skipped: 0, Time elapsed: 0.79 sec - in org.apache.commons.lang3.time.FastDateFormat_ParserTest
Running org.apache.commons.lang3.time.DurationFormatUtilsTest
Tests run: 25, Failures: 0, Errors: 0, Skipped: 0, Time elapsed: 1.01 sec - in org.apache.commons.lang3.time.DurationFormatUtilsTest
Running org.apache.commons.lang3.time.DateFormatUtilsTest
Tests run: 10, Failures: 0, Errors: 0, Skipped: 0, Time elapsed: 0.002 sec - in org.apache.commons.lang3.time.DateFormatUtilsTest
Running org.apache.commons.lang3.time.DateUtilsFragmentTest
Tests run: 57, Failures: 0, Errors: 0, Skipped: 0, Time elapsed: 0.011 sec - in org.apache.commons.lang3.time.DateUtilsFragmentTest
Running org.apache.commons.lang3.time.FastDatePrinterTimeZonesTest
Tests run: 617, Failures: 0, Errors: 0, Skipped: 0, Time elapsed: 0.252 sec - in org.apache.commons.lang3.time.FastDatePrinterTimeZonesTest
Running org.apache.commons.lang3.time.FastDateFormatTest
>>FastDateFormatTest: FastDateParser:20142  SimpleDateFormat:3813
Tests run: 14, Failures: 0, Errors: 0, Skipped: 0, Time elapsed: 2.733 sec - in org.apache.commons.lang3.time.FastDateFormatTest
Running org.apache.commons.lang3.time.FastDateFormat_PrinterTest
Tests run: 17, Failures: 0, Errors: 0, Skipped: 0, Time elapsed: 0.007 sec - in org.apache.commons.lang3.time.FastDateFormat_PrinterTest
Running org.apache.commons.lang3.time.FastDatePrinterTest
Tests run: 17, Failures: 0, Errors: 0, Skipped: 0, Time elapsed: 0.009 sec - in org.apache.commons.lang3.time.FastDatePrinterTest
Running org.apache.commons.lang3.time.FastDateParserSDFTest
Tests run: 276, Failures: 0, Errors: 0, Skipped: 92, Time elapsed: 0.078 sec - in org.apache.commons.lang3.time.FastDateParserSDFTest
Running org.apache.commons.lang3.time.DateUtilsTest
DateUtilsTest: Default Locale=en_US
Tests run: 38, Failures: 0, Errors: 0, Skipped: 0, Time elapsed: 0.02 sec - in org.apache.commons.lang3.time.DateUtilsTest
Running org.apache.commons.lang3.reflect.InheritanceUtilsTest
Tests run: 9, Failures: 0, Errors: 0, Skipped: 0, Time elapsed: 0.002 sec - in org.apache.commons.lang3.reflect.InheritanceUtilsTest
Running org.apache.commons.lang3.reflect.MethodUtilsTest
Tests run: 23, Failures: 0, Errors: 0, Skipped: 0, Time elapsed: 0.037 sec - in org.apache.commons.lang3.reflect.MethodUtilsTest
Running org.apache.commons.lang3.reflect.ConstructorUtilsTest
Tests run: 7, Failures: 0, Errors: 0, Skipped: 0, Time elapsed: 0.005 sec - in org.apache.commons.lang3.reflect.ConstructorUtilsTest
Running org.apache.commons.lang3.reflect.FieldUtilsTest
Tests run: 64, Failures: 0, Errors: 0, Skipped: 0, Time elapsed: 0.035 sec - in org.apache.commons.lang3.reflect.FieldUtilsTest
Running org.apache.commons.lang3.reflect.TypeLiteralTest
Tests run: 4, Failures: 0, Errors: 0, Skipped: 0, Time elapsed: 0.017 sec - in org.apache.commons.lang3.reflect.TypeLiteralTest
Running org.apache.commons.lang3.reflect.TypeUtilsTest
Tests run: 19, Failures: 0, Errors: 0, Skipped: 0, Time elapsed: 0.037 sec - in org.apache.commons.lang3.reflect.TypeUtilsTest
Running org.apache.commons.lang3.mutable.MutableByteTest
Tests run: 17, Failures: 0, Errors: 0, Skipped: 0, Time elapsed: 0.003 sec - in org.apache.commons.lang3.mutable.MutableByteTest
Running org.apache.commons.lang3.mutable.MutableShortTest
Tests run: 14, Failures: 0, Errors: 0, Skipped: 0, Time elapsed: 0.002 sec - in org.apache.commons.lang3.mutable.MutableShortTest
Running org.apache.commons.lang3.mutable.MutableIntTest
Tests run: 17, Failures: 0, Errors: 0, Skipped: 0, Time elapsed: 0.011 sec - in org.apache.commons.lang3.mutable.MutableIntTest
Running org.apache.commons.lang3.mutable.MutableDoubleTest
Tests run: 18, Failures: 0, Errors: 0, Skipped: 0, Time elapsed: 0 sec - in org.apache.commons.lang3.mutable.MutableDoubleTest
Running org.apache.commons.lang3.mutable.MutableFloatTest
Tests run: 18, Failures: 0, Errors: 0, Skipped: 0, Time elapsed: 0.005 sec - in org.apache.commons.lang3.mutable.MutableFloatTest
Running org.apache.commons.lang3.mutable.MutableLongTest
Tests run: 17, Failures: 0, Errors: 0, Skipped: 0, Time elapsed: 0.007 sec - in org.apache.commons.lang3.mutable.MutableLongTest
Running org.apache.commons.lang3.mutable.MutableBooleanTest
Tests run: 9, Failures: 0, Errors: 0, Skipped: 0, Time elapsed: 0.004 sec - in org.apache.commons.lang3.mutable.MutableBooleanTest
Running org.apache.commons.lang3.mutable.MutableObjectTest
Tests run: 5, Failures: 0, Errors: 0, Skipped: 0, Time elapsed: 0.002 sec - in org.apache.commons.lang3.mutable.MutableObjectTest
Running org.apache.commons.lang3.text.translate.UnicodeEscaperTest
Tests run: 3, Failures: 0, Errors: 0, Skipped: 0, Time elapsed: 0.002 sec - in org.apache.commons.lang3.text.translate.UnicodeEscaperTest
Running org.apache.commons.lang3.text.translate.EntityArraysTest
Tests run: 3, Failures: 0, Errors: 0, Skipped: 0, Time elapsed: 0.002 sec - in org.apache.commons.lang3.text.translate.EntityArraysTest
Running org.apache.commons.lang3.text.translate.UnicodeUnpairedSurrogateRemoverTest
Tests run: 2, Failures: 0, Errors: 0, Skipped: 0, Time elapsed: 0.001 sec - in org.apache.commons.lang3.text.translate.UnicodeUnpairedSurrogateRemoverTest
Running org.apache.commons.lang3.text.translate.NumericEntityUnescaperTest
Tests run: 3, Failures: 0, Errors: 0, Skipped: 0, Time elapsed: 0.002 sec - in org.apache.commons.lang3.text.translate.NumericEntityUnescaperTest
Running org.apache.commons.lang3.text.translate.NumericEntityEscaperTest
Tests run: 4, Failures: 0, Errors: 0, Skipped: 0, Time elapsed: 0.002 sec - in org.apache.commons.lang3.text.translate.NumericEntityEscaperTest
Running org.apache.commons.lang3.text.translate.LookupTranslatorTest
Tests run: 2, Failures: 0, Errors: 0, Skipped: 0, Time elapsed: 0.002 sec - in org.apache.commons.lang3.text.translate.LookupTranslatorTest
Running org.apache.commons.lang3.text.translate.UnicodeUnescaperTest
Tests run: 3, Failures: 0, Errors: 0, Skipped: 0, Time elapsed: 0.001 sec - in org.apache.commons.lang3.text.translate.UnicodeUnescaperTest
Running org.apache.commons.lang3.text.translate.OctalUnescaperTest
Tests run: 1, Failures: 0, Errors: 0, Skipped: 0, Time elapsed: 0.001 sec - in org.apache.commons.lang3.text.translate.OctalUnescaperTest
Running org.apache.commons.lang3.text.StrMatcherTest
Tests run: 14, Failures: 0, Errors: 0, Skipped: 0, Time elapsed: 0.008 sec - in org.apache.commons.lang3.text.StrMatcherTest
Running org.apache.commons.lang3.text.StrTokenizerTest
Tests run: 55, Failures: 0, Errors: 49, Skipped: 0, Time elapsed: 0.042 sec <<< FAILURE! - in org.apache.commons.lang3.text.StrTokenizerTest
testCSVSimple(org.apache.commons.lang3.text.StrTokenizerTest)  Time elapsed: 0.01 sec  <<< ERROR!
java.lang.StringIndexOutOfBoundsException: end < start
	at org.apache.commons.lang3.text.StrBuilder.validateRange(StrBuilder.java:612)
	at org.apache.commons.lang3.text.StrBuilder.substring(StrBuilder.java:491)
	at org.apache.commons.lang3.text.StrTokenizer.readWithQuotes(StrTokenizer.java:781)
	at org.apache.commons.lang3.text.StrTokenizer.readNextToken(StrTokenizer.java:718)
	at org.apache.commons.lang3.text.StrTokenizer.tokenize(StrTokenizer.java:646)
	at org.apache.commons.lang3.text.StrTokenizer.checkTokenized(StrTokenizer.java:609)
	at org.apache.commons.lang3.text.StrTokenizer.hasPrevious(StrTokenizer.java:540)
	at org.apache.commons.lang3.text.StrTokenizer.previousToken(StrTokenizer.java:421)
	at org.apache.commons.lang3.text.StrTokenizerTest.testXSVAbc(StrTokenizerTest.java:779)
	at org.apache.commons.lang3.text.StrTokenizerTest.testCSV(StrTokenizerTest.java:512)
	at org.apache.commons.lang3.text.StrTokenizerTest.testCSVSimple(StrTokenizerTest.java:524)

testBasicDelim1(org.apache.commons.lang3.text.StrTokenizerTest)  Time elapsed: 0.001 sec  <<< ERROR!
java.lang.StringIndexOutOfBoundsException: end < start
	at org.apache.commons.lang3.text.StrBuilder.validateRange(StrBuilder.java:612)
	at org.apache.commons.lang3.text.StrBuilder.substring(StrBuilder.java:491)
	at org.apache.commons.lang3.text.StrTokenizer.readWithQuotes(StrTokenizer.java:781)
	at org.apache.commons.lang3.text.StrTokenizer.readNextToken(StrTokenizer.java:718)
	at org.apache.commons.lang3.text.StrTokenizer.tokenize(StrTokenizer.java:646)
	at org.apache.commons.lang3.text.StrTokenizer.checkTokenized(StrTokenizer.java:609)
	at org.apache.commons.lang3.text.StrTokenizer.hasNext(StrTokenizer.java:505)
	at org.apache.commons.lang3.text.StrTokenizer.next(StrTokenizer.java:517)
	at org.apache.commons.lang3.text.StrTokenizerTest.testBasicDelim1(StrTokenizerTest.java:285)

testBasicDelim2(org.apache.commons.lang3.text.StrTokenizerTest)  Time elapsed: 0.001 sec  <<< ERROR!
java.lang.StringIndexOutOfBoundsException: end < start
	at org.apache.commons.lang3.text.StrBuilder.validateRange(StrBuilder.java:612)
	at org.apache.commons.lang3.text.StrBuilder.substring(StrBuilder.java:491)
	at org.apache.commons.lang3.text.StrTokenizer.readWithQuotes(StrTokenizer.java:816)
	at org.apache.commons.lang3.text.StrTokenizer.readNextToken(StrTokenizer.java:718)
	at org.apache.commons.lang3.text.StrTokenizer.tokenize(StrTokenizer.java:646)
	at org.apache.commons.lang3.text.StrTokenizer.checkTokenized(StrTokenizer.java:609)
	at org.apache.commons.lang3.text.StrTokenizer.hasNext(StrTokenizer.java:505)
	at org.apache.commons.lang3.text.StrTokenizer.next(StrTokenizer.java:517)
	at org.apache.commons.lang3.text.StrTokenizerTest.testBasicDelim2(StrTokenizerTest.java:295)

testBasicEmpty1(org.apache.commons.lang3.text.StrTokenizerTest)  Time elapsed: 0 sec  <<< ERROR!
java.lang.StringIndexOutOfBoundsException: end < start
	at org.apache.commons.lang3.text.StrBuilder.validateRange(StrBuilder.java:612)
	at org.apache.commons.lang3.text.StrBuilder.substring(StrBuilder.java:491)
	at org.apache.commons.lang3.text.StrTokenizer.readWithQuotes(StrTokenizer.java:781)
	at org.apache.commons.lang3.text.StrTokenizer.readNextToken(StrTokenizer.java:718)
	at org.apache.commons.lang3.text.StrTokenizer.tokenize(StrTokenizer.java:646)
	at org.apache.commons.lang3.text.StrTokenizer.checkTokenized(StrTokenizer.java:609)
	at org.apache.commons.lang3.text.StrTokenizer.hasNext(StrTokenizer.java:505)
	at org.apache.commons.lang3.text.StrTokenizer.next(StrTokenizer.java:517)
	at org.apache.commons.lang3.text.StrTokenizerTest.testBasicEmpty1(StrTokenizerTest.java:304)

testBasicEmpty2(org.apache.commons.lang3.text.StrTokenizerTest)  Time elapsed: 0 sec  <<< ERROR!
java.lang.StringIndexOutOfBoundsException: end < start
	at org.apache.commons.lang3.text.StrBuilder.validateRange(StrBuilder.java:612)
	at org.apache.commons.lang3.text.StrBuilder.substring(StrBuilder.java:491)
	at org.apache.commons.lang3.text.StrTokenizer.readWithQuotes(StrTokenizer.java:781)
	at org.apache.commons.lang3.text.StrTokenizer.readNextToken(StrTokenizer.java:718)
	at org.apache.commons.lang3.text.StrTokenizer.tokenize(StrTokenizer.java:646)
	at org.apache.commons.lang3.text.StrTokenizer.checkTokenized(StrTokenizer.java:609)
	at org.apache.commons.lang3.text.StrTokenizer.hasNext(StrTokenizer.java:505)
	at org.apache.commons.lang3.text.StrTokenizer.next(StrTokenizer.java:517)
	at org.apache.commons.lang3.text.StrTokenizerTest.testBasicEmpty2(StrTokenizerTest.java:317)

testConstructor_charArray_char(org.apache.commons.lang3.text.StrTokenizerTest)  Time elapsed: 0.001 sec  <<< ERROR!
java.lang.StringIndexOutOfBoundsException: end < start
	at org.apache.commons.lang3.text.StrBuilder.validateRange(StrBuilder.java:612)
	at org.apache.commons.lang3.text.StrBuilder.substring(StrBuilder.java:491)
	at org.apache.commons.lang3.text.StrTokenizer.readWithQuotes(StrTokenizer.java:781)
	at org.apache.commons.lang3.text.StrTokenizer.readNextToken(StrTokenizer.java:718)
	at org.apache.commons.lang3.text.StrTokenizer.tokenize(StrTokenizer.java:646)
	at org.apache.commons.lang3.text.StrTokenizer.checkTokenized(StrTokenizer.java:609)
	at org.apache.commons.lang3.text.StrTokenizer.hasNext(StrTokenizer.java:505)
	at org.apache.commons.lang3.text.StrTokenizer.next(StrTokenizer.java:517)
	at org.apache.commons.lang3.text.StrTokenizerTest.testConstructor_charArray_char(StrTokenizerTest.java:691)

testTSV(org.apache.commons.lang3.text.StrTokenizerTest)  Time elapsed: 0.001 sec  <<< ERROR!
java.lang.StringIndexOutOfBoundsException: end < start
	at org.apache.commons.lang3.text.StrBuilder.validateRange(StrBuilder.java:612)
	at org.apache.commons.lang3.text.StrBuilder.substring(StrBuilder.java:491)
	at org.apache.commons.lang3.text.StrTokenizer.readWithQuotes(StrTokenizer.java:781)
	at org.apache.commons.lang3.text.StrTokenizer.readNextToken(StrTokenizer.java:718)
	at org.apache.commons.lang3.text.StrTokenizer.tokenize(StrTokenizer.java:646)
	at org.apache.commons.lang3.text.StrTokenizer.checkTokenized(StrTokenizer.java:609)
	at org.apache.commons.lang3.text.StrTokenizer.hasPrevious(StrTokenizer.java:540)
	at org.apache.commons.lang3.text.StrTokenizer.previousToken(StrTokenizer.java:421)
	at org.apache.commons.lang3.text.StrTokenizerTest.testXSVAbc(StrTokenizerTest.java:779)
	at org.apache.commons.lang3.text.StrTokenizerTest.testTSV(StrTokenizerTest.java:765)

testIteration(org.apache.commons.lang3.text.StrTokenizerTest)  Time elapsed: 0 sec  <<< ERROR!
java.lang.StringIndexOutOfBoundsException: end < start
	at org.apache.commons.lang3.text.StrBuilder.validateRange(StrBuilder.java:612)
	at org.apache.commons.lang3.text.StrBuilder.substring(StrBuilder.java:491)
	at org.apache.commons.lang3.text.StrTokenizer.readWithQuotes(StrTokenizer.java:781)
	at org.apache.commons.lang3.text.StrTokenizer.readNextToken(StrTokenizer.java:718)
	at org.apache.commons.lang3.text.StrTokenizer.tokenize(StrTokenizer.java:646)
	at org.apache.commons.lang3.text.StrTokenizer.checkTokenized(StrTokenizer.java:609)
	at org.apache.commons.lang3.text.StrTokenizer.hasPrevious(StrTokenizer.java:540)
	at org.apache.commons.lang3.text.StrTokenizerTest.testIteration(StrTokenizerTest.java:803)

testConstructor_String_char_char(org.apache.commons.lang3.text.StrTokenizerTest)  Time elapsed: 0 sec  <<< ERROR!
java.lang.StringIndexOutOfBoundsException: end < start
	at org.apache.commons.lang3.text.StrBuilder.validateRange(StrBuilder.java:612)
	at org.apache.commons.lang3.text.StrBuilder.substring(StrBuilder.java:491)
	at org.apache.commons.lang3.text.StrTokenizer.readWithQuotes(StrTokenizer.java:781)
	at org.apache.commons.lang3.text.StrTokenizer.readNextToken(StrTokenizer.java:718)
	at org.apache.commons.lang3.text.StrTokenizer.tokenize(StrTokenizer.java:646)
	at org.apache.commons.lang3.text.StrTokenizer.checkTokenized(StrTokenizer.java:609)
	at org.apache.commons.lang3.text.StrTokenizer.hasNext(StrTokenizer.java:505)
	at org.apache.commons.lang3.text.StrTokenizer.next(StrTokenizer.java:517)
	at org.apache.commons.lang3.text.StrTokenizerTest.testConstructor_String_char_char(StrTokenizerTest.java:660)

testReset(org.apache.commons.lang3.text.StrTokenizerTest)  Time elapsed: 0.001 sec  <<< ERROR!
java.lang.StringIndexOutOfBoundsException: end < start
	at org.apache.commons.lang3.text.StrBuilder.validateRange(StrBuilder.java:612)
	at org.apache.commons.lang3.text.StrBuilder.substring(StrBuilder.java:491)
	at org.apache.commons.lang3.text.StrTokenizer.readWithQuotes(StrTokenizer.java:781)
	at org.apache.commons.lang3.text.StrTokenizer.readNextToken(StrTokenizer.java:718)
	at org.apache.commons.lang3.text.StrTokenizer.tokenize(StrTokenizer.java:646)
	at org.apache.commons.lang3.text.StrTokenizer.checkTokenized(StrTokenizer.java:609)
	at org.apache.commons.lang3.text.StrTokenizer.hasNext(StrTokenizer.java:505)
	at org.apache.commons.lang3.text.StrTokenizer.next(StrTokenizer.java:517)
	at org.apache.commons.lang3.text.StrTokenizerTest.testReset(StrTokenizerTest.java:723)

testReset_charArray(org.apache.commons.lang3.text.StrTokenizerTest)  Time elapsed: 0 sec  <<< ERROR!
java.lang.StringIndexOutOfBoundsException: end < start
	at org.apache.commons.lang3.text.StrBuilder.validateRange(StrBuilder.java:612)
	at org.apache.commons.lang3.text.StrBuilder.substring(StrBuilder.java:491)
	at org.apache.commons.lang3.text.StrTokenizer.readWithQuotes(StrTokenizer.java:816)
	at org.apache.commons.lang3.text.StrTokenizer.readNextToken(StrTokenizer.java:718)
	at org.apache.commons.lang3.text.StrTokenizer.tokenize(StrTokenizer.java:646)
	at org.apache.commons.lang3.text.StrTokenizer.checkTokenized(StrTokenizer.java:609)
	at org.apache.commons.lang3.text.StrTokenizer.hasNext(StrTokenizer.java:505)
	at org.apache.commons.lang3.text.StrTokenizer.next(StrTokenizer.java:517)
	at org.apache.commons.lang3.text.StrTokenizerTest.testReset_charArray(StrTokenizerTest.java:755)

testToString(org.apache.commons.lang3.text.StrTokenizerTest)  Time elapsed: 0.001 sec  <<< ERROR!
java.lang.StringIndexOutOfBoundsException: end < start
	at org.apache.commons.lang3.text.StrBuilder.validateRange(StrBuilder.java:612)
	at org.apache.commons.lang3.text.StrBuilder.substring(StrBuilder.java:491)
	at org.apache.commons.lang3.text.StrTokenizer.readWithQuotes(StrTokenizer.java:781)
	at org.apache.commons.lang3.text.StrTokenizer.readNextToken(StrTokenizer.java:718)
	at org.apache.commons.lang3.text.StrTokenizer.tokenize(StrTokenizer.java:646)
	at org.apache.commons.lang3.text.StrTokenizer.checkTokenized(StrTokenizer.java:609)
	at org.apache.commons.lang3.text.StrTokenizer.hasNext(StrTokenizer.java:505)
	at org.apache.commons.lang3.text.StrTokenizer.next(StrTokenizer.java:517)
	at org.apache.commons.lang3.text.StrTokenizerTest.testToString(StrTokenizerTest.java:876)

testTokenizeSubclassOutputChange(org.apache.commons.lang3.text.StrTokenizerTest)  Time elapsed: 0 sec  <<< ERROR!
java.lang.StringIndexOutOfBoundsException: end < start
	at org.apache.commons.lang3.text.StrBuilder.validateRange(StrBuilder.java:612)
	at org.apache.commons.lang3.text.StrBuilder.substring(StrBuilder.java:491)
	at org.apache.commons.lang3.text.StrTokenizer.readWithQuotes(StrTokenizer.java:781)
	at org.apache.commons.lang3.text.StrTokenizer.readNextToken(StrTokenizer.java:718)
	at org.apache.commons.lang3.text.StrTokenizer.tokenize(StrTokenizer.java:646)
	at org.apache.commons.lang3.text.StrTokenizerTest$3.tokenize(StrTokenizerTest.java:861)
	at org.apache.commons.lang3.text.StrTokenizer.checkTokenized(StrTokenizer.java:609)
	at org.apache.commons.lang3.text.StrTokenizer.hasNext(StrTokenizer.java:505)
	at org.apache.commons.lang3.text.StrTokenizer.next(StrTokenizer.java:517)
	at org.apache.commons.lang3.text.StrTokenizerTest.testTokenizeSubclassOutputChange(StrTokenizerTest.java:866)

testListArray(org.apache.commons.lang3.text.StrTokenizerTest)  Time elapsed: 0 sec  <<< ERROR!
java.lang.StringIndexOutOfBoundsException: end < start
	at org.apache.commons.lang3.text.StrBuilder.validateRange(StrBuilder.java:612)
	at org.apache.commons.lang3.text.StrBuilder.substring(StrBuilder.java:491)
	at org.apache.commons.lang3.text.StrTokenizer.readWithQuotes(StrTokenizer.java:781)
	at org.apache.commons.lang3.text.StrTokenizer.readNextToken(StrTokenizer.java:718)
	at org.apache.commons.lang3.text.StrTokenizer.tokenize(StrTokenizer.java:646)
	at org.apache.commons.lang3.text.StrTokenizer.checkTokenized(StrTokenizer.java:609)
	at org.apache.commons.lang3.text.StrTokenizer.getTokenArray(StrTokenizer.java:433)
	at org.apache.commons.lang3.text.StrTokenizerTest.testListArray(StrTokenizerTest.java:503)

testBasicQuoted1(org.apache.commons.lang3.text.StrTokenizerTest)  Time elapsed: 0 sec  <<< ERROR!
java.lang.StringIndexOutOfBoundsException: end < start
	at org.apache.commons.lang3.text.StrBuilder.validateRange(StrBuilder.java:612)
	at org.apache.commons.lang3.text.StrBuilder.substring(StrBuilder.java:491)
	at org.apache.commons.lang3.text.StrTokenizer.readWithQuotes(StrTokenizer.java:781)
	at org.apache.commons.lang3.text.StrTokenizer.readNextToken(StrTokenizer.java:718)
	at org.apache.commons.lang3.text.StrTokenizer.tokenize(StrTokenizer.java:646)
	at org.apache.commons.lang3.text.StrTokenizer.checkTokenized(StrTokenizer.java:609)
	at org.apache.commons.lang3.text.StrTokenizer.hasNext(StrTokenizer.java:505)
	at org.apache.commons.lang3.text.StrTokenizer.next(StrTokenizer.java:517)
	at org.apache.commons.lang3.text.StrTokenizerTest.testBasicQuoted1(StrTokenizerTest.java:328)

testBasicQuoted2(org.apache.commons.lang3.text.StrTokenizerTest)  Time elapsed: 0 sec  <<< ERROR!
java.lang.StringIndexOutOfBoundsException: end < start
	at org.apache.commons.lang3.text.StrBuilder.validateRange(StrBuilder.java:612)
	at org.apache.commons.lang3.text.StrBuilder.substring(StrBuilder.java:491)
	at org.apache.commons.lang3.text.StrTokenizer.readWithQuotes(StrTokenizer.java:781)
	at org.apache.commons.lang3.text.StrTokenizer.readNextToken(StrTokenizer.java:718)
	at org.apache.commons.lang3.text.StrTokenizer.tokenize(StrTokenizer.java:646)
	at org.apache.commons.lang3.text.StrTokenizer.checkTokenized(StrTokenizer.java:609)
	at org.apache.commons.lang3.text.StrTokenizer.hasNext(StrTokenizer.java:505)
	at org.apache.commons.lang3.text.StrTokenizer.next(StrTokenizer.java:517)
	at org.apache.commons.lang3.text.StrTokenizerTest.testBasicQuoted2(StrTokenizerTest.java:340)

testBasicQuoted3(org.apache.commons.lang3.text.StrTokenizerTest)  Time elapsed: 0 sec  <<< ERROR!
java.lang.StringIndexOutOfBoundsException: end < start
	at org.apache.commons.lang3.text.StrBuilder.validateRange(StrBuilder.java:612)
	at org.apache.commons.lang3.text.StrBuilder.substring(StrBuilder.java:491)
	at org.apache.commons.lang3.text.StrTokenizer.readWithQuotes(StrTokenizer.java:781)
	at org.apache.commons.lang3.text.StrTokenizer.readNextToken(StrTokenizer.java:718)
	at org.apache.commons.lang3.text.StrTokenizer.tokenize(StrTokenizer.java:646)
	at org.apache.commons.lang3.text.StrTokenizer.checkTokenized(StrTokenizer.java:609)
	at org.apache.commons.lang3.text.StrTokenizer.hasNext(StrTokenizer.java:505)
	at org.apache.commons.lang3.text.StrTokenizer.next(StrTokenizer.java:517)
	at org.apache.commons.lang3.text.StrTokenizerTest.testBasicQuoted3(StrTokenizerTest.java:352)

testBasicQuoted4(org.apache.commons.lang3.text.StrTokenizerTest)  Time elapsed: 0 sec  <<< ERROR!
java.lang.StringIndexOutOfBoundsException: end < start
	at org.apache.commons.lang3.text.StrBuilder.validateRange(StrBuilder.java:612)
	at org.apache.commons.lang3.text.StrBuilder.substring(StrBuilder.java:491)
	at org.apache.commons.lang3.text.StrTokenizer.readWithQuotes(StrTokenizer.java:781)
	at org.apache.commons.lang3.text.StrTokenizer.readNextToken(StrTokenizer.java:718)
	at org.apache.commons.lang3.text.StrTokenizer.tokenize(StrTokenizer.java:646)
	at org.apache.commons.lang3.text.StrTokenizer.checkTokenized(StrTokenizer.java:609)
	at org.apache.commons.lang3.text.StrTokenizer.hasNext(StrTokenizer.java:505)
	at org.apache.commons.lang3.text.StrTokenizer.next(StrTokenizer.java:517)
	at org.apache.commons.lang3.text.StrTokenizerTest.testBasicQuoted4(StrTokenizerTest.java:364)

testBasicQuoted5(org.apache.commons.lang3.text.StrTokenizerTest)  Time elapsed: 0 sec  <<< ERROR!
java.lang.StringIndexOutOfBoundsException: end < start
	at org.apache.commons.lang3.text.StrBuilder.validateRange(StrBuilder.java:612)
	at org.apache.commons.lang3.text.StrBuilder.substring(StrBuilder.java:491)
	at org.apache.commons.lang3.text.StrTokenizer.readWithQuotes(StrTokenizer.java:781)
	at org.apache.commons.lang3.text.StrTokenizer.readNextToken(StrTokenizer.java:718)
	at org.apache.commons.lang3.text.StrTokenizer.tokenize(StrTokenizer.java:646)
	at org.apache.commons.lang3.text.StrTokenizer.checkTokenized(StrTokenizer.java:609)
	at org.apache.commons.lang3.text.StrTokenizer.hasNext(StrTokenizer.java:505)
	at org.apache.commons.lang3.text.StrTokenizer.next(StrTokenizer.java:517)
	at org.apache.commons.lang3.text.StrTokenizerTest.testBasicQuoted5(StrTokenizerTest.java:377)

testBasicQuoted6(org.apache.commons.lang3.text.StrTokenizerTest)  Time elapsed: 0 sec  <<< ERROR!
java.lang.StringIndexOutOfBoundsException: end < start
	at org.apache.commons.lang3.text.StrBuilder.validateRange(StrBuilder.java:612)
	at org.apache.commons.lang3.text.StrBuilder.substring(StrBuilder.java:491)
	at org.apache.commons.lang3.text.StrTokenizer.readWithQuotes(StrTokenizer.java:781)
	at org.apache.commons.lang3.text.StrTokenizer.readNextToken(StrTokenizer.java:718)
	at org.apache.commons.lang3.text.StrTokenizer.tokenize(StrTokenizer.java:646)
	at org.apache.commons.lang3.text.StrTokenizer.checkTokenized(StrTokenizer.java:609)
	at org.apache.commons.lang3.text.StrTokenizer.hasNext(StrTokenizer.java:505)
	at org.apache.commons.lang3.text.StrTokenizer.next(StrTokenizer.java:517)
	at org.apache.commons.lang3.text.StrTokenizerTest.testBasicQuoted6(StrTokenizerTest.java:388)

testBasicQuoted7(org.apache.commons.lang3.text.StrTokenizerTest)  Time elapsed: 0.001 sec  <<< ERROR!
java.lang.StringIndexOutOfBoundsException: end < start
	at org.apache.commons.lang3.text.StrBuilder.validateRange(StrBuilder.java:612)
	at org.apache.commons.lang3.text.StrBuilder.substring(StrBuilder.java:491)
	at org.apache.commons.lang3.text.StrTokenizer.readWithQuotes(StrTokenizer.java:781)
	at org.apache.commons.lang3.text.StrTokenizer.readNextToken(StrTokenizer.java:718)
	at org.apache.commons.lang3.text.StrTokenizer.tokenize(StrTokenizer.java:646)
	at org.apache.commons.lang3.text.StrTokenizer.checkTokenized(StrTokenizer.java:609)
	at org.apache.commons.lang3.text.StrTokenizer.hasNext(StrTokenizer.java:505)
	at org.apache.commons.lang3.text.StrTokenizer.next(StrTokenizer.java:517)
	at org.apache.commons.lang3.text.StrTokenizerTest.testBasicQuoted7(StrTokenizerTest.java:398)

testReset_String(org.apache.commons.lang3.text.StrTokenizerTest)  Time elapsed: 0 sec  <<< ERROR!
java.lang.StringIndexOutOfBoundsException: end < start
	at org.apache.commons.lang3.text.StrBuilder.validateRange(StrBuilder.java:612)
	at org.apache.commons.lang3.text.StrBuilder.substring(StrBuilder.java:491)
	at org.apache.commons.lang3.text.StrTokenizer.readWithQuotes(StrTokenizer.java:781)
	at org.apache.commons.lang3.text.StrTokenizer.readNextToken(StrTokenizer.java:718)
	at org.apache.commons.lang3.text.StrTokenizer.tokenize(StrTokenizer.java:646)
	at org.apache.commons.lang3.text.StrTokenizer.checkTokenized(StrTokenizer.java:609)
	at org.apache.commons.lang3.text.StrTokenizer.hasNext(StrTokenizer.java:505)
	at org.apache.commons.lang3.text.StrTokenizer.next(StrTokenizer.java:517)
	at org.apache.commons.lang3.text.StrTokenizerTest.testReset_String(StrTokenizerTest.java:740)

testConstructor_String(org.apache.commons.lang3.text.StrTokenizerTest)  Time elapsed: 0 sec  <<< ERROR!
java.lang.StringIndexOutOfBoundsException: end < start
	at org.apache.commons.lang3.text.StrBuilder.validateRange(StrBuilder.java:612)
	at org.apache.commons.lang3.text.StrBuilder.substring(StrBuilder.java:491)
	at org.apache.commons.lang3.text.StrTokenizer.readWithQuotes(StrTokenizer.java:781)
	at org.apache.commons.lang3.text.StrTokenizer.readNextToken(StrTokenizer.java:718)
	at org.apache.commons.lang3.text.StrTokenizer.tokenize(StrTokenizer.java:646)
	at org.apache.commons.lang3.text.StrTokenizer.checkTokenized(StrTokenizer.java:609)
	at org.apache.commons.lang3.text.StrTokenizer.hasNext(StrTokenizer.java:505)
	at org.apache.commons.lang3.text.StrTokenizer.next(StrTokenizer.java:517)
	at org.apache.commons.lang3.text.StrTokenizerTest.testConstructor_String(StrTokenizerTest.java:627)

test1(org.apache.commons.lang3.text.StrTokenizerTest)  Time elapsed: 0.001 sec  <<< ERROR!
java.lang.StringIndexOutOfBoundsException: end < start
	at org.apache.commons.lang3.text.StrBuilder.validateRange(StrBuilder.java:612)
	at org.apache.commons.lang3.text.StrBuilder.substring(StrBuilder.java:491)
	at org.apache.commons.lang3.text.StrTokenizer.readWithQuotes(StrTokenizer.java:781)
	at org.apache.commons.lang3.text.StrTokenizer.readNextToken(StrTokenizer.java:718)
	at org.apache.commons.lang3.text.StrTokenizer.tokenize(StrTokenizer.java:646)
	at org.apache.commons.lang3.text.StrTokenizer.checkTokenized(StrTokenizer.java:609)
	at org.apache.commons.lang3.text.StrTokenizer.getTokenArray(StrTokenizer.java:433)
	at org.apache.commons.lang3.text.StrTokenizerTest.test1(StrTokenizerTest.java:56)

test2(org.apache.commons.lang3.text.StrTokenizerTest)  Time elapsed: 0 sec  <<< ERROR!
java.lang.StringIndexOutOfBoundsException: end < start
	at org.apache.commons.lang3.text.StrBuilder.validateRange(StrBuilder.java:612)
	at org.apache.commons.lang3.text.StrBuilder.substring(StrBuilder.java:491)
	at org.apache.commons.lang3.text.StrTokenizer.readWithQuotes(StrTokenizer.java:781)
	at org.apache.commons.lang3.text.StrTokenizer.readNextToken(StrTokenizer.java:718)
	at org.apache.commons.lang3.text.StrTokenizer.tokenize(StrTokenizer.java:646)
	at org.apache.commons.lang3.text.StrTokenizer.checkTokenized(StrTokenizer.java:609)
	at org.apache.commons.lang3.text.StrTokenizer.getTokenArray(StrTokenizer.java:433)
	at org.apache.commons.lang3.text.StrTokenizerTest.test2(StrTokenizerTest.java:77)

test3(org.apache.commons.lang3.text.StrTokenizerTest)  Time elapsed: 0 sec  <<< ERROR!
java.lang.StringIndexOutOfBoundsException: end < start
	at org.apache.commons.lang3.text.StrBuilder.validateRange(StrBuilder.java:612)
	at org.apache.commons.lang3.text.StrBuilder.substring(StrBuilder.java:491)
	at org.apache.commons.lang3.text.StrTokenizer.readWithQuotes(StrTokenizer.java:781)
	at org.apache.commons.lang3.text.StrTokenizer.readNextToken(StrTokenizer.java:718)
	at org.apache.commons.lang3.text.StrTokenizer.tokenize(StrTokenizer.java:646)
	at org.apache.commons.lang3.text.StrTokenizer.checkTokenized(StrTokenizer.java:609)
	at org.apache.commons.lang3.text.StrTokenizer.getTokenArray(StrTokenizer.java:433)
	at org.apache.commons.lang3.text.StrTokenizerTest.test3(StrTokenizerTest.java:98)

test4(org.apache.commons.lang3.text.StrTokenizerTest)  Time elapsed: 0 sec  <<< ERROR!
java.lang.StringIndexOutOfBoundsException: end < start
	at org.apache.commons.lang3.text.StrBuilder.validateRange(StrBuilder.java:612)
	at org.apache.commons.lang3.text.StrBuilder.substring(StrBuilder.java:491)
	at org.apache.commons.lang3.text.StrTokenizer.readWithQuotes(StrTokenizer.java:781)
	at org.apache.commons.lang3.text.StrTokenizer.readNextToken(StrTokenizer.java:718)
	at org.apache.commons.lang3.text.StrTokenizer.tokenize(StrTokenizer.java:646)
	at org.apache.commons.lang3.text.StrTokenizer.checkTokenized(StrTokenizer.java:609)
	at org.apache.commons.lang3.text.StrTokenizer.getTokenArray(StrTokenizer.java:433)
	at org.apache.commons.lang3.text.StrTokenizerTest.test4(StrTokenizerTest.java:119)

test5(org.apache.commons.lang3.text.StrTokenizerTest)  Time elapsed: 0 sec  <<< ERROR!
java.lang.StringIndexOutOfBoundsException: end < start
	at org.apache.commons.lang3.text.StrBuilder.validateRange(StrBuilder.java:612)
	at org.apache.commons.lang3.text.StrBuilder.substring(StrBuilder.java:491)
	at org.apache.commons.lang3.text.StrTokenizer.readWithQuotes(StrTokenizer.java:781)
	at org.apache.commons.lang3.text.StrTokenizer.readNextToken(StrTokenizer.java:718)
	at org.apache.commons.lang3.text.StrTokenizer.tokenize(StrTokenizer.java:646)
	at org.apache.commons.lang3.text.StrTokenizer.checkTokenized(StrTokenizer.java:609)
	at org.apache.commons.lang3.text.StrTokenizer.getTokenArray(StrTokenizer.java:433)
	at org.apache.commons.lang3.text.StrTokenizerTest.test5(StrTokenizerTest.java:141)

test6(org.apache.commons.lang3.text.StrTokenizerTest)  Time elapsed: 0 sec  <<< ERROR!
java.lang.StringIndexOutOfBoundsException: end < start
	at org.apache.commons.lang3.text.StrBuilder.validateRange(StrBuilder.java:612)
	at org.apache.commons.lang3.text.StrBuilder.substring(StrBuilder.java:491)
	at org.apache.commons.lang3.text.StrTokenizer.readWithQuotes(StrTokenizer.java:781)
	at org.apache.commons.lang3.text.StrTokenizer.readNextToken(StrTokenizer.java:718)
	at org.apache.commons.lang3.text.StrTokenizer.tokenize(StrTokenizer.java:646)
	at org.apache.commons.lang3.text.StrTokenizer.checkTokenized(StrTokenizer.java:609)
	at org.apache.commons.lang3.text.StrTokenizer.getTokenArray(StrTokenizer.java:433)
	at org.apache.commons.lang3.text.StrTokenizerTest.test6(StrTokenizerTest.java:163)

test7(org.apache.commons.lang3.text.StrTokenizerTest)  Time elapsed: 0 sec  <<< ERROR!
java.lang.StringIndexOutOfBoundsException: end < start
	at org.apache.commons.lang3.text.StrBuilder.validateRange(StrBuilder.java:612)
	at org.apache.commons.lang3.text.StrBuilder.substring(StrBuilder.java:491)
	at org.apache.commons.lang3.text.StrTokenizer.readWithQuotes(StrTokenizer.java:781)
	at org.apache.commons.lang3.text.StrTokenizer.readNextToken(StrTokenizer.java:718)
	at org.apache.commons.lang3.text.StrTokenizer.tokenize(StrTokenizer.java:646)
	at org.apache.commons.lang3.text.StrTokenizer.checkTokenized(StrTokenizer.java:609)
	at org.apache.commons.lang3.text.StrTokenizer.getTokenArray(StrTokenizer.java:433)
	at org.apache.commons.lang3.text.StrTokenizerTest.test7(StrTokenizerTest.java:198)

test8(org.apache.commons.lang3.text.StrTokenizerTest)  Time elapsed: 0 sec  <<< ERROR!
java.lang.StringIndexOutOfBoundsException: end < start
	at org.apache.commons.lang3.text.StrBuilder.validateRange(StrBuilder.java:612)
	at org.apache.commons.lang3.text.StrBuilder.substring(StrBuilder.java:491)
	at org.apache.commons.lang3.text.StrTokenizer.readWithQuotes(StrTokenizer.java:781)
	at org.apache.commons.lang3.text.StrTokenizer.readNextToken(StrTokenizer.java:718)
	at org.apache.commons.lang3.text.StrTokenizer.tokenize(StrTokenizer.java:646)
	at org.apache.commons.lang3.text.StrTokenizer.checkTokenized(StrTokenizer.java:609)
	at org.apache.commons.lang3.text.StrTokenizer.getTokenArray(StrTokenizer.java:433)
	at org.apache.commons.lang3.text.StrTokenizerTest.test8(StrTokenizerTest.java:219)

testConstructor_String_char(org.apache.commons.lang3.text.StrTokenizerTest)  Time elapsed: 0 sec  <<< ERROR!
java.lang.StringIndexOutOfBoundsException: end < start
	at org.apache.commons.lang3.text.StrBuilder.validateRange(StrBuilder.java:612)
	at org.apache.commons.lang3.text.StrBuilder.substring(StrBuilder.java:491)
	at org.apache.commons.lang3.text.StrTokenizer.readWithQuotes(StrTokenizer.java:781)
	at org.apache.commons.lang3.text.StrTokenizer.readNextToken(StrTokenizer.java:718)
	at org.apache.commons.lang3.text.StrTokenizer.tokenize(StrTokenizer.java:646)
	at org.apache.commons.lang3.text.StrTokenizer.checkTokenized(StrTokenizer.java:609)
	at org.apache.commons.lang3.text.StrTokenizer.hasNext(StrTokenizer.java:505)
	at org.apache.commons.lang3.text.StrTokenizer.next(StrTokenizer.java:517)
	at org.apache.commons.lang3.text.StrTokenizerTest.testConstructor_String_char(StrTokenizerTest.java:643)

testTokenizeSubclassInputChange(org.apache.commons.lang3.text.StrTokenizerTest)  Time elapsed: 0.001 sec  <<< ERROR!
java.lang.StringIndexOutOfBoundsException: end < start
	at org.apache.commons.lang3.text.StrBuilder.validateRange(StrBuilder.java:612)
	at org.apache.commons.lang3.text.StrBuilder.substring(StrBuilder.java:491)
	at org.apache.commons.lang3.text.StrTokenizer.readWithQuotes(StrTokenizer.java:781)
	at org.apache.commons.lang3.text.StrTokenizer.readNextToken(StrTokenizer.java:718)
	at org.apache.commons.lang3.text.StrTokenizer.tokenize(StrTokenizer.java:646)
	at org.apache.commons.lang3.text.StrTokenizerTest$2.tokenize(StrTokenizerTest.java:848)
	at org.apache.commons.lang3.text.StrTokenizer.checkTokenized(StrTokenizer.java:609)
	at org.apache.commons.lang3.text.StrTokenizer.hasNext(StrTokenizer.java:505)
	at org.apache.commons.lang3.text.StrTokenizer.next(StrTokenizer.java:517)
	at org.apache.commons.lang3.text.StrTokenizerTest.testTokenizeSubclassInputChange(StrTokenizerTest.java:851)

testConstructor_charArray(org.apache.commons.lang3.text.StrTokenizerTest)  Time elapsed: 0.001 sec  <<< ERROR!
java.lang.StringIndexOutOfBoundsException: end < start
	at org.apache.commons.lang3.text.StrBuilder.validateRange(StrBuilder.java:612)
	at org.apache.commons.lang3.text.StrBuilder.substring(StrBuilder.java:491)
	at org.apache.commons.lang3.text.StrTokenizer.readWithQuotes(StrTokenizer.java:781)
	at org.apache.commons.lang3.text.StrTokenizer.readNextToken(StrTokenizer.java:718)
	at org.apache.commons.lang3.text.StrTokenizer.tokenize(StrTokenizer.java:646)
	at org.apache.commons.lang3.text.StrTokenizer.checkTokenized(StrTokenizer.java:609)
	at org.apache.commons.lang3.text.StrTokenizer.hasNext(StrTokenizer.java:505)
	at org.apache.commons.lang3.text.StrTokenizer.next(StrTokenizer.java:517)
	at org.apache.commons.lang3.text.StrTokenizerTest.testConstructor_charArray(StrTokenizerTest.java:675)

testConstructor_charArray_char_char(org.apache.commons.lang3.text.StrTokenizerTest)  Time elapsed: 0 sec  <<< ERROR!
java.lang.StringIndexOutOfBoundsException: end < start
	at org.apache.commons.lang3.text.StrBuilder.validateRange(StrBuilder.java:612)
	at org.apache.commons.lang3.text.StrBuilder.substring(StrBuilder.java:491)
	at org.apache.commons.lang3.text.StrTokenizer.readWithQuotes(StrTokenizer.java:781)
	at org.apache.commons.lang3.text.StrTokenizer.readNextToken(StrTokenizer.java:718)
	at org.apache.commons.lang3.text.StrTokenizer.tokenize(StrTokenizer.java:646)
	at org.apache.commons.lang3.text.StrTokenizer.checkTokenized(StrTokenizer.java:609)
	at org.apache.commons.lang3.text.StrTokenizer.hasNext(StrTokenizer.java:505)
	at org.apache.commons.lang3.text.StrTokenizer.next(StrTokenizer.java:517)
	at org.apache.commons.lang3.text.StrTokenizerTest.testConstructor_charArray_char_char(StrTokenizerTest.java:708)

testCSVSimpleNeedsTrim(org.apache.commons.lang3.text.StrTokenizerTest)  Time elapsed: 0.001 sec  <<< ERROR!
java.lang.StringIndexOutOfBoundsException: end < start
	at org.apache.commons.lang3.text.StrBuilder.validateRange(StrBuilder.java:612)
	at org.apache.commons.lang3.text.StrBuilder.substring(StrBuilder.java:491)
	at org.apache.commons.lang3.text.StrTokenizer.readWithQuotes(StrTokenizer.java:781)
	at org.apache.commons.lang3.text.StrTokenizer.readNextToken(StrTokenizer.java:718)
	at org.apache.commons.lang3.text.StrTokenizer.tokenize(StrTokenizer.java:646)
	at org.apache.commons.lang3.text.StrTokenizer.checkTokenized(StrTokenizer.java:609)
	at org.apache.commons.lang3.text.StrTokenizer.hasPrevious(StrTokenizer.java:540)
	at org.apache.commons.lang3.text.StrTokenizer.previousToken(StrTokenizer.java:421)
	at org.apache.commons.lang3.text.StrTokenizerTest.testXSVAbc(StrTokenizerTest.java:779)
	at org.apache.commons.lang3.text.StrTokenizerTest.testCSV(StrTokenizerTest.java:512)
	at org.apache.commons.lang3.text.StrTokenizerTest.testCSVSimpleNeedsTrim(StrTokenizerTest.java:529)

testBasicIgnoreTrimmed1(org.apache.commons.lang3.text.StrTokenizerTest)  Time elapsed: 0 sec  <<< ERROR!
java.lang.StringIndexOutOfBoundsException: end < start
	at org.apache.commons.lang3.text.StrBuilder.validateRange(StrBuilder.java:612)
	at org.apache.commons.lang3.text.StrBuilder.substring(StrBuilder.java:491)
	at org.apache.commons.lang3.text.StrTokenizer.readWithQuotes(StrTokenizer.java:781)
	at org.apache.commons.lang3.text.StrTokenizer.readNextToken(StrTokenizer.java:718)
	at org.apache.commons.lang3.text.StrTokenizer.tokenize(StrTokenizer.java:646)
	at org.apache.commons.lang3.text.StrTokenizer.checkTokenized(StrTokenizer.java:609)
	at org.apache.commons.lang3.text.StrTokenizer.hasNext(StrTokenizer.java:505)
	at org.apache.commons.lang3.text.StrTokenizer.next(StrTokenizer.java:517)
	at org.apache.commons.lang3.text.StrTokenizerTest.testBasicIgnoreTrimmed1(StrTokenizerTest.java:451)

testBasicIgnoreTrimmed2(org.apache.commons.lang3.text.StrTokenizerTest)  Time elapsed: 0.001 sec  <<< ERROR!
java.lang.StringIndexOutOfBoundsException: end < start
	at org.apache.commons.lang3.text.StrBuilder.validateRange(StrBuilder.java:612)
	at org.apache.commons.lang3.text.StrBuilder.substring(StrBuilder.java:491)
	at org.apache.commons.lang3.text.StrTokenizer.readWithQuotes(StrTokenizer.java:781)
	at org.apache.commons.lang3.text.StrTokenizer.readNextToken(StrTokenizer.java:718)
	at org.apache.commons.lang3.text.StrTokenizer.tokenize(StrTokenizer.java:646)
	at org.apache.commons.lang3.text.StrTokenizer.checkTokenized(StrTokenizer.java:609)
	at org.apache.commons.lang3.text.StrTokenizer.hasNext(StrTokenizer.java:505)
	at org.apache.commons.lang3.text.StrTokenizer.next(StrTokenizer.java:517)
	at org.apache.commons.lang3.text.StrTokenizerTest.testBasicIgnoreTrimmed2(StrTokenizerTest.java:465)

testBasicIgnoreTrimmed3(org.apache.commons.lang3.text.StrTokenizerTest)  Time elapsed: 0 sec  <<< ERROR!
java.lang.StringIndexOutOfBoundsException: end < start
	at org.apache.commons.lang3.text.StrBuilder.validateRange(StrBuilder.java:612)
	at org.apache.commons.lang3.text.StrBuilder.substring(StrBuilder.java:491)
	at org.apache.commons.lang3.text.StrTokenizer.readWithQuotes(StrTokenizer.java:781)
	at org.apache.commons.lang3.text.StrTokenizer.readNextToken(StrTokenizer.java:718)
	at org.apache.commons.lang3.text.StrTokenizer.tokenize(StrTokenizer.java:646)
	at org.apache.commons.lang3.text.StrTokenizer.checkTokenized(StrTokenizer.java:609)
	at org.apache.commons.lang3.text.StrTokenizer.hasNext(StrTokenizer.java:505)
	at org.apache.commons.lang3.text.StrTokenizer.next(StrTokenizer.java:517)
	at org.apache.commons.lang3.text.StrTokenizerTest.testBasicIgnoreTrimmed3(StrTokenizerTest.java:478)

testBasicIgnoreTrimmed4(org.apache.commons.lang3.text.StrTokenizerTest)  Time elapsed: 0.001 sec  <<< ERROR!
java.lang.StringIndexOutOfBoundsException: end < start
	at org.apache.commons.lang3.text.StrBuilder.validateRange(StrBuilder.java:612)
	at org.apache.commons.lang3.text.StrBuilder.substring(StrBuilder.java:491)
	at org.apache.commons.lang3.text.StrTokenizer.readWithQuotes(StrTokenizer.java:781)
	at org.apache.commons.lang3.text.StrTokenizer.readNextToken(StrTokenizer.java:718)
	at org.apache.commons.lang3.text.StrTokenizer.tokenize(StrTokenizer.java:646)
	at org.apache.commons.lang3.text.StrTokenizer.checkTokenized(StrTokenizer.java:609)
	at org.apache.commons.lang3.text.StrTokenizer.hasNext(StrTokenizer.java:505)
	at org.apache.commons.lang3.text.StrTokenizer.next(StrTokenizer.java:517)
	at org.apache.commons.lang3.text.StrTokenizerTest.testBasicIgnoreTrimmed4(StrTokenizerTest.java:492)

testBasicQuotedTrimmed1(org.apache.commons.lang3.text.StrTokenizerTest)  Time elapsed: 0 sec  <<< ERROR!
java.lang.StringIndexOutOfBoundsException: end < start
	at org.apache.commons.lang3.text.StrBuilder.validateRange(StrBuilder.java:612)
	at org.apache.commons.lang3.text.StrBuilder.substring(StrBuilder.java:491)
	at org.apache.commons.lang3.text.StrTokenizer.readWithQuotes(StrTokenizer.java:781)
	at org.apache.commons.lang3.text.StrTokenizer.readNextToken(StrTokenizer.java:718)
	at org.apache.commons.lang3.text.StrTokenizer.tokenize(StrTokenizer.java:646)
	at org.apache.commons.lang3.text.StrTokenizer.checkTokenized(StrTokenizer.java:609)
	at org.apache.commons.lang3.text.StrTokenizer.hasNext(StrTokenizer.java:505)
	at org.apache.commons.lang3.text.StrTokenizer.next(StrTokenizer.java:517)
	at org.apache.commons.lang3.text.StrTokenizerTest.testBasicQuotedTrimmed1(StrTokenizerTest.java:411)

testBasic1(org.apache.commons.lang3.text.StrTokenizerTest)  Time elapsed: 0.001 sec  <<< ERROR!
java.lang.StringIndexOutOfBoundsException: end < start
	at org.apache.commons.lang3.text.StrBuilder.validateRange(StrBuilder.java:612)
	at org.apache.commons.lang3.text.StrBuilder.substring(StrBuilder.java:491)
	at org.apache.commons.lang3.text.StrTokenizer.readWithQuotes(StrTokenizer.java:781)
	at org.apache.commons.lang3.text.StrTokenizer.readNextToken(StrTokenizer.java:718)
	at org.apache.commons.lang3.text.StrTokenizer.tokenize(StrTokenizer.java:646)
	at org.apache.commons.lang3.text.StrTokenizer.checkTokenized(StrTokenizer.java:609)
	at org.apache.commons.lang3.text.StrTokenizer.hasNext(StrTokenizer.java:505)
	at org.apache.commons.lang3.text.StrTokenizer.next(StrTokenizer.java:517)
	at org.apache.commons.lang3.text.StrTokenizerTest.testBasic1(StrTokenizerTest.java:235)

testBasic2(org.apache.commons.lang3.text.StrTokenizerTest)  Time elapsed: 0 sec  <<< ERROR!
java.lang.StringIndexOutOfBoundsException: end < start
	at org.apache.commons.lang3.text.StrBuilder.validateRange(StrBuilder.java:612)
	at org.apache.commons.lang3.text.StrBuilder.substring(StrBuilder.java:491)
	at org.apache.commons.lang3.text.StrTokenizer.readWithQuotes(StrTokenizer.java:781)
	at org.apache.commons.lang3.text.StrTokenizer.readNextToken(StrTokenizer.java:718)
	at org.apache.commons.lang3.text.StrTokenizer.tokenize(StrTokenizer.java:646)
	at org.apache.commons.lang3.text.StrTokenizer.checkTokenized(StrTokenizer.java:609)
	at org.apache.commons.lang3.text.StrTokenizer.hasNext(StrTokenizer.java:505)
	at org.apache.commons.lang3.text.StrTokenizer.next(StrTokenizer.java:517)
	at org.apache.commons.lang3.text.StrTokenizerTest.testBasic2(StrTokenizerTest.java:245)

testBasic3(org.apache.commons.lang3.text.StrTokenizerTest)  Time elapsed: 0.001 sec  <<< ERROR!
java.lang.StringIndexOutOfBoundsException: end < start
	at org.apache.commons.lang3.text.StrBuilder.validateRange(StrBuilder.java:612)
	at org.apache.commons.lang3.text.StrBuilder.substring(StrBuilder.java:491)
	at org.apache.commons.lang3.text.StrTokenizer.readWithQuotes(StrTokenizer.java:781)
	at org.apache.commons.lang3.text.StrTokenizer.readNextToken(StrTokenizer.java:718)
	at org.apache.commons.lang3.text.StrTokenizer.tokenize(StrTokenizer.java:646)
	at org.apache.commons.lang3.text.StrTokenizer.checkTokenized(StrTokenizer.java:609)
	at org.apache.commons.lang3.text.StrTokenizer.hasNext(StrTokenizer.java:505)
	at org.apache.commons.lang3.text.StrTokenizer.next(StrTokenizer.java:517)
	at org.apache.commons.lang3.text.StrTokenizerTest.testBasic3(StrTokenizerTest.java:255)

testBasic4(org.apache.commons.lang3.text.StrTokenizerTest)  Time elapsed: 0 sec  <<< ERROR!
java.lang.StringIndexOutOfBoundsException: end < start
	at org.apache.commons.lang3.text.StrBuilder.validateRange(StrBuilder.java:612)
	at org.apache.commons.lang3.text.StrBuilder.substring(StrBuilder.java:491)
	at org.apache.commons.lang3.text.StrTokenizer.readWithQuotes(StrTokenizer.java:781)
	at org.apache.commons.lang3.text.StrTokenizer.readNextToken(StrTokenizer.java:718)
	at org.apache.commons.lang3.text.StrTokenizer.tokenize(StrTokenizer.java:646)
	at org.apache.commons.lang3.text.StrTokenizer.checkTokenized(StrTokenizer.java:609)
	at org.apache.commons.lang3.text.StrTokenizer.hasNext(StrTokenizer.java:505)
	at org.apache.commons.lang3.text.StrTokenizer.next(StrTokenizer.java:517)
	at org.apache.commons.lang3.text.StrTokenizerTest.testBasic4(StrTokenizerTest.java:265)

testBasic5(org.apache.commons.lang3.text.StrTokenizerTest)  Time elapsed: 0 sec  <<< ERROR!
java.lang.StringIndexOutOfBoundsException: end < start
	at org.apache.commons.lang3.text.StrBuilder.validateRange(StrBuilder.java:612)
	at org.apache.commons.lang3.text.StrBuilder.substring(StrBuilder.java:491)
	at org.apache.commons.lang3.text.StrTokenizer.readWithQuotes(StrTokenizer.java:781)
	at org.apache.commons.lang3.text.StrTokenizer.readNextToken(StrTokenizer.java:718)
	at org.apache.commons.lang3.text.StrTokenizer.tokenize(StrTokenizer.java:646)
	at org.apache.commons.lang3.text.StrTokenizer.checkTokenized(StrTokenizer.java:609)
	at org.apache.commons.lang3.text.StrTokenizer.hasNext(StrTokenizer.java:505)
	at org.apache.commons.lang3.text.StrTokenizer.next(StrTokenizer.java:517)
	at org.apache.commons.lang3.text.StrTokenizerTest.testBasic5(StrTokenizerTest.java:275)

testCloneReset(org.apache.commons.lang3.text.StrTokenizerTest)  Time elapsed: 0 sec  <<< ERROR!
java.lang.StringIndexOutOfBoundsException: end < start
	at org.apache.commons.lang3.text.StrBuilder.validateRange(StrBuilder.java:612)
	at org.apache.commons.lang3.text.StrBuilder.substring(StrBuilder.java:491)
	at org.apache.commons.lang3.text.StrTokenizer.readWithQuotes(StrTokenizer.java:816)
	at org.apache.commons.lang3.text.StrTokenizer.readNextToken(StrTokenizer.java:718)
	at org.apache.commons.lang3.text.StrTokenizer.tokenize(StrTokenizer.java:646)
	at org.apache.commons.lang3.text.StrTokenizer.checkTokenized(StrTokenizer.java:609)
	at org.apache.commons.lang3.text.StrTokenizer.hasNext(StrTokenizer.java:505)
	at org.apache.commons.lang3.text.StrTokenizer.nextToken(StrTokenizer.java:409)
	at org.apache.commons.lang3.text.StrTokenizerTest.testCloneReset(StrTokenizerTest.java:612)

testBasicTrimmed1(org.apache.commons.lang3.text.StrTokenizerTest)  Time elapsed: 0.001 sec  <<< ERROR!
java.lang.StringIndexOutOfBoundsException: end < start
	at org.apache.commons.lang3.text.StrBuilder.validateRange(StrBuilder.java:612)
	at org.apache.commons.lang3.text.StrBuilder.substring(StrBuilder.java:491)
	at org.apache.commons.lang3.text.StrTokenizer.readWithQuotes(StrTokenizer.java:781)
	at org.apache.commons.lang3.text.StrTokenizer.readNextToken(StrTokenizer.java:718)
	at org.apache.commons.lang3.text.StrTokenizer.tokenize(StrTokenizer.java:646)
	at org.apache.commons.lang3.text.StrTokenizer.checkTokenized(StrTokenizer.java:609)
	at org.apache.commons.lang3.text.StrTokenizer.hasNext(StrTokenizer.java:505)
	at org.apache.commons.lang3.text.StrTokenizer.next(StrTokenizer.java:517)
	at org.apache.commons.lang3.text.StrTokenizerTest.testBasicTrimmed1(StrTokenizerTest.java:424)

testBasicTrimmed2(org.apache.commons.lang3.text.StrTokenizerTest)  Time elapsed: 0 sec  <<< ERROR!
java.lang.StringIndexOutOfBoundsException: end < start
	at org.apache.commons.lang3.text.StrBuilder.validateRange(StrBuilder.java:612)
	at org.apache.commons.lang3.text.StrBuilder.substring(StrBuilder.java:491)
	at org.apache.commons.lang3.text.StrTokenizer.readWithQuotes(StrTokenizer.java:781)
	at org.apache.commons.lang3.text.StrTokenizer.readNextToken(StrTokenizer.java:718)
	at org.apache.commons.lang3.text.StrTokenizer.tokenize(StrTokenizer.java:646)
	at org.apache.commons.lang3.text.StrTokenizer.checkTokenized(StrTokenizer.java:609)
	at org.apache.commons.lang3.text.StrTokenizer.hasNext(StrTokenizer.java:505)
	at org.apache.commons.lang3.text.StrTokenizer.next(StrTokenizer.java:517)
	at org.apache.commons.lang3.text.StrTokenizerTest.testBasicTrimmed2(StrTokenizerTest.java:437)

Running org.apache.commons.lang3.text.FormattableUtilsTest
Tests run: 5, Failures: 0, Errors: 0, Skipped: 0, Time elapsed: 0 sec - in org.apache.commons.lang3.text.FormattableUtilsTest
Running org.apache.commons.lang3.text.CompositeFormatTest
Tests run: 2, Failures: 0, Errors: 0, Skipped: 0, Time elapsed: 0.001 sec - in org.apache.commons.lang3.text.CompositeFormatTest
Running org.apache.commons.lang3.text.WordUtilsTest
Tests run: 12, Failures: 0, Errors: 0, Skipped: 0, Time elapsed: 0.003 sec - in org.apache.commons.lang3.text.WordUtilsTest
Running org.apache.commons.lang3.text.StrLookupTest
Tests run: 5, Failures: 0, Errors: 0, Skipped: 0, Time elapsed: 0.004 sec - in org.apache.commons.lang3.text.StrLookupTest
Running org.apache.commons.lang3.text.StrBuilderAppendInsertTest
Tests run: 51, Failures: 0, Errors: 0, Skipped: 0, Time elapsed: 0.014 sec - in org.apache.commons.lang3.text.StrBuilderAppendInsertTest
Running org.apache.commons.lang3.text.ExtendedMessageFormatTest
Tests run: 10, Failures: 0, Errors: 0, Skipped: 0, Time elapsed: 0.86 sec - in org.apache.commons.lang3.text.ExtendedMessageFormatTest
Running org.apache.commons.lang3.text.StrSubstitutorTest
Tests run: 40, Failures: 0, Errors: 29, Skipped: 0, Time elapsed: 0.041 sec <<< FAILURE! - in org.apache.commons.lang3.text.StrSubstitutorTest
testReplaceEscaping(org.apache.commons.lang3.text.StrSubstitutorTest)  Time elapsed: 0.002 sec  <<< ERROR!
java.lang.StringIndexOutOfBoundsException: end < start
	at org.apache.commons.lang3.text.StrBuilder.validateRange(StrBuilder.java:612)
	at org.apache.commons.lang3.text.StrBuilder.replace(StrBuilder.java:412)
	at org.apache.commons.lang3.text.StrSubstitutor.substitute(StrSubstitutor.java:851)
	at org.apache.commons.lang3.text.StrSubstitutor.substitute(StrSubstitutor.java:735)
	at org.apache.commons.lang3.text.StrSubstitutor.replace(StrSubstitutor.java:395)
	at org.apache.commons.lang3.text.StrSubstitutorTest.doTestReplace(StrSubstitutorTest.java:634)
	at org.apache.commons.lang3.text.StrSubstitutorTest.testReplaceEscaping(StrSubstitutorTest.java:163)

testSubstituteDefaultProperties(org.apache.commons.lang3.text.StrSubstitutorTest)  Time elapsed: 0.001 sec  <<< ERROR!
java.lang.StringIndexOutOfBoundsException: end < start
	at org.apache.commons.lang3.text.StrBuilder.validateRange(StrBuilder.java:612)
	at org.apache.commons.lang3.text.StrBuilder.replace(StrBuilder.java:412)
	at org.apache.commons.lang3.text.StrSubstitutor.substitute(StrSubstitutor.java:851)
	at org.apache.commons.lang3.text.StrSubstitutor.substitute(StrSubstitutor.java:735)
	at org.apache.commons.lang3.text.StrSubstitutor.replace(StrSubstitutor.java:597)
	at org.apache.commons.lang3.text.StrSubstitutor.replace(StrSubstitutor.java:181)
	at org.apache.commons.lang3.text.StrSubstitutor.replace(StrSubstitutor.java:220)
	at org.apache.commons.lang3.text.StrSubstitutorTest.testSubstituteDefaultProperties(StrSubstitutorTest.java:615)

testReplaceNoPrefixSuffix(org.apache.commons.lang3.text.StrSubstitutorTest)  Time elapsed: 0 sec  <<< ERROR!
java.lang.StringIndexOutOfBoundsException: end < start
	at org.apache.commons.lang3.text.StrBuilder.validateRange(StrBuilder.java:612)
	at org.apache.commons.lang3.text.StrBuilder.replace(StrBuilder.java:412)
	at org.apache.commons.lang3.text.StrSubstitutor.substitute(StrSubstitutor.java:851)
	at org.apache.commons.lang3.text.StrSubstitutor.substitute(StrSubstitutor.java:735)
	at org.apache.commons.lang3.text.StrSubstitutor.replace(StrSubstitutor.java:395)
	at org.apache.commons.lang3.text.StrSubstitutorTest.doTestReplace(StrSubstitutorTest.java:634)
	at org.apache.commons.lang3.text.StrSubstitutorTest.testReplaceNoPrefixSuffix(StrSubstitutorTest.java:212)

testCyclicReplacement(org.apache.commons.lang3.text.StrSubstitutorTest)  Time elapsed: 0.001 sec  <<< ERROR!
java.lang.StringIndexOutOfBoundsException: end < start
	at org.apache.commons.lang3.text.StrBuilder.validateRange(StrBuilder.java:612)
	at org.apache.commons.lang3.text.StrBuilder.replace(StrBuilder.java:412)
	at org.apache.commons.lang3.text.StrSubstitutor.substitute(StrSubstitutor.java:851)
	at org.apache.commons.lang3.text.StrSubstitutor.substitute(StrSubstitutor.java:735)
	at org.apache.commons.lang3.text.StrSubstitutor.replace(StrSubstitutor.java:395)
	at org.apache.commons.lang3.text.StrSubstitutorTest.testCyclicReplacement(StrSubstitutorTest.java:251)

testReplaceToIdentical(org.apache.commons.lang3.text.StrSubstitutorTest)  Time elapsed: 0.001 sec  <<< ERROR!
java.lang.StringIndexOutOfBoundsException: end < start
	at org.apache.commons.lang3.text.StrBuilder.validateRange(StrBuilder.java:612)
	at org.apache.commons.lang3.text.StrBuilder.replace(StrBuilder.java:412)
	at org.apache.commons.lang3.text.StrSubstitutor.substitute(StrSubstitutor.java:851)
	at org.apache.commons.lang3.text.StrSubstitutor.substitute(StrSubstitutor.java:735)
	at org.apache.commons.lang3.text.StrSubstitutor.replace(StrSubstitutor.java:395)
	at org.apache.commons.lang3.text.StrSubstitutorTest.doTestReplace(StrSubstitutorTest.java:634)
	at org.apache.commons.lang3.text.StrSubstitutorTest.testReplaceToIdentical(StrSubstitutorTest.java:231)

testReplaceSimple(org.apache.commons.lang3.text.StrSubstitutorTest)  Time elapsed: 0.001 sec  <<< ERROR!
java.lang.StringIndexOutOfBoundsException: end < start
	at org.apache.commons.lang3.text.StrBuilder.validateRange(StrBuilder.java:612)
	at org.apache.commons.lang3.text.StrBuilder.replace(StrBuilder.java:412)
	at org.apache.commons.lang3.text.StrSubstitutor.substitute(StrSubstitutor.java:851)
	at org.apache.commons.lang3.text.StrSubstitutor.substitute(StrSubstitutor.java:735)
	at org.apache.commons.lang3.text.StrSubstitutor.replace(StrSubstitutor.java:395)
	at org.apache.commons.lang3.text.StrSubstitutorTest.doTestReplace(StrSubstitutorTest.java:634)
	at org.apache.commons.lang3.text.StrSubstitutorTest.testReplaceSimple(StrSubstitutorTest.java:63)

testStaticReplacePrefixSuffix(org.apache.commons.lang3.text.StrSubstitutorTest)  Time elapsed: 0.001 sec  <<< ERROR!
java.lang.StringIndexOutOfBoundsException: end < start
	at org.apache.commons.lang3.text.StrBuilder.validateRange(StrBuilder.java:612)
	at org.apache.commons.lang3.text.StrBuilder.replace(StrBuilder.java:412)
	at org.apache.commons.lang3.text.StrSubstitutor.substitute(StrSubstitutor.java:851)
	at org.apache.commons.lang3.text.StrSubstitutor.substitute(StrSubstitutor.java:735)
	at org.apache.commons.lang3.text.StrSubstitutor.replace(StrSubstitutor.java:597)
	at org.apache.commons.lang3.text.StrSubstitutor.replace(StrSubstitutor.java:198)
	at org.apache.commons.lang3.text.StrSubstitutorTest.testStaticReplacePrefixSuffix(StrSubstitutorTest.java:573)

testReplaceRecursive(org.apache.commons.lang3.text.StrSubstitutorTest)  Time elapsed: 0 sec  <<< ERROR!
java.lang.StringIndexOutOfBoundsException: end < start
	at org.apache.commons.lang3.text.StrBuilder.validateRange(StrBuilder.java:612)
	at org.apache.commons.lang3.text.StrBuilder.replace(StrBuilder.java:412)
	at org.apache.commons.lang3.text.StrSubstitutor.substitute(StrSubstitutor.java:851)
	at org.apache.commons.lang3.text.StrSubstitutor.substitute(StrSubstitutor.java:735)
	at org.apache.commons.lang3.text.StrSubstitutor.replace(StrSubstitutor.java:395)
	at org.apache.commons.lang3.text.StrSubstitutorTest.doTestReplace(StrSubstitutorTest.java:634)
	at org.apache.commons.lang3.text.StrSubstitutorTest.testReplaceRecursive(StrSubstitutorTest.java:152)

testConstructorMapPrefixSuffix(org.apache.commons.lang3.text.StrSubstitutorTest)  Time elapsed: 0 sec  <<< ERROR!
java.lang.StringIndexOutOfBoundsException: end < start
	at org.apache.commons.lang3.text.StrBuilder.validateRange(StrBuilder.java:612)
	at org.apache.commons.lang3.text.StrBuilder.replace(StrBuilder.java:412)
	at org.apache.commons.lang3.text.StrSubstitutor.substitute(StrSubstitutor.java:851)
	at org.apache.commons.lang3.text.StrSubstitutor.substitute(StrSubstitutor.java:735)
	at org.apache.commons.lang3.text.StrSubstitutor.replace(StrSubstitutor.java:395)
	at org.apache.commons.lang3.text.StrSubstitutorTest.testConstructorMapPrefixSuffix(StrSubstitutorTest.java:441)

testSamePrefixAndSuffix(org.apache.commons.lang3.text.StrSubstitutorTest)  Time elapsed: 0 sec  <<< ERROR!
java.lang.StringIndexOutOfBoundsException: end < start
	at org.apache.commons.lang3.text.StrBuilder.validateRange(StrBuilder.java:612)
	at org.apache.commons.lang3.text.StrBuilder.replace(StrBuilder.java:412)
	at org.apache.commons.lang3.text.StrSubstitutor.substitute(StrSubstitutor.java:851)
	at org.apache.commons.lang3.text.StrSubstitutor.substitute(StrSubstitutor.java:735)
	at org.apache.commons.lang3.text.StrSubstitutor.replace(StrSubstitutor.java:597)
	at org.apache.commons.lang3.text.StrSubstitutor.replace(StrSubstitutor.java:198)
	at org.apache.commons.lang3.text.StrSubstitutorTest.testSamePrefixAndSuffix(StrSubstitutorTest.java:624)

testStaticReplace(org.apache.commons.lang3.text.StrSubstitutorTest)  Time elapsed: 0 sec  <<< ERROR!
java.lang.StringIndexOutOfBoundsException: end < start
	at org.apache.commons.lang3.text.StrBuilder.validateRange(StrBuilder.java:612)
	at org.apache.commons.lang3.text.StrBuilder.replace(StrBuilder.java:412)
	at org.apache.commons.lang3.text.StrSubstitutor.substitute(StrSubstitutor.java:851)
	at org.apache.commons.lang3.text.StrSubstitutor.substitute(StrSubstitutor.java:735)
	at org.apache.commons.lang3.text.StrSubstitutor.replace(StrSubstitutor.java:597)
	at org.apache.commons.lang3.text.StrSubstitutor.replace(StrSubstitutor.java:181)
	at org.apache.commons.lang3.text.StrSubstitutorTest.testStaticReplace(StrSubstitutorTest.java:563)

testReplaceUnknownKey(org.apache.commons.lang3.text.StrSubstitutorTest)  Time elapsed: 0 sec  <<< ERROR!
java.lang.StringIndexOutOfBoundsException: end < start
	at org.apache.commons.lang3.text.StrBuilder.validateRange(StrBuilder.java:612)
	at org.apache.commons.lang3.text.StrBuilder.replace(StrBuilder.java:412)
	at org.apache.commons.lang3.text.StrSubstitutor.substitute(StrSubstitutor.java:851)
	at org.apache.commons.lang3.text.StrSubstitutor.substitute(StrSubstitutor.java:735)
	at org.apache.commons.lang3.text.StrSubstitutor.replace(StrSubstitutor.java:395)
	at org.apache.commons.lang3.text.StrSubstitutorTest.doTestReplace(StrSubstitutorTest.java:634)
	at org.apache.commons.lang3.text.StrSubstitutorTest.testReplaceUnknownKey(StrSubstitutorTest.java:113)

testReplaceNoPrefixNoSuffix(org.apache.commons.lang3.text.StrSubstitutorTest)  Time elapsed: 0.001 sec  <<< ERROR!
java.lang.StringIndexOutOfBoundsException: end < start
	at org.apache.commons.lang3.text.StrBuilder.validateRange(StrBuilder.java:612)
	at org.apache.commons.lang3.text.StrBuilder.replace(StrBuilder.java:412)
	at org.apache.commons.lang3.text.StrSubstitutor.substitute(StrSubstitutor.java:851)
	at org.apache.commons.lang3.text.StrSubstitutor.substitute(StrSubstitutor.java:735)
	at org.apache.commons.lang3.text.StrSubstitutor.replace(StrSubstitutor.java:395)
	at org.apache.commons.lang3.text.StrSubstitutorTest.doTestReplace(StrSubstitutorTest.java:634)
	at org.apache.commons.lang3.text.StrSubstitutorTest.testReplaceNoPrefixNoSuffix(StrSubstitutorTest.java:188)

testStaticReplaceSystemProperties(org.apache.commons.lang3.text.StrSubstitutorTest)  Time elapsed: 0.001 sec  <<< ERROR!
java.lang.StringIndexOutOfBoundsException: end < start
	at org.apache.commons.lang3.text.StrBuilder.validateRange(StrBuilder.java:612)
	at org.apache.commons.lang3.text.StrBuilder.replace(StrBuilder.java:412)
	at org.apache.commons.lang3.text.StrSubstitutor.substitute(StrSubstitutor.java:851)
	at org.apache.commons.lang3.text.StrSubstitutor.substitute(StrSubstitutor.java:735)
	at org.apache.commons.lang3.text.StrSubstitutor.replace(StrSubstitutor.java:597)
	at org.apache.commons.lang3.text.StrSubstitutor.replaceSystemProperties(StrSubstitutor.java:231)
	at org.apache.commons.lang3.text.StrSubstitutorTest.testStaticReplaceSystemProperties(StrSubstitutorTest.java:587)

testReplaceInVariableRecursive(org.apache.commons.lang3.text.StrSubstitutorTest)  Time elapsed: 0.001 sec  <<< ERROR!
java.lang.StringIndexOutOfBoundsException: end < start
	at org.apache.commons.lang3.text.StrBuilder.validateRange(StrBuilder.java:612)
	at org.apache.commons.lang3.text.StrBuilder.replace(StrBuilder.java:412)
	at org.apache.commons.lang3.text.StrSubstitutor.substitute(StrSubstitutor.java:851)
	at org.apache.commons.lang3.text.StrSubstitutor.substitute(StrSubstitutor.java:735)
	at org.apache.commons.lang3.text.StrSubstitutor.substitute(StrSubstitutor.java:805)
	at org.apache.commons.lang3.text.StrSubstitutor.substitute(StrSubstitutor.java:735)
	at org.apache.commons.lang3.text.StrSubstitutor.substitute(StrSubstitutor.java:805)
	at org.apache.commons.lang3.text.StrSubstitutor.substitute(StrSubstitutor.java:735)
	at org.apache.commons.lang3.text.StrSubstitutor.replace(StrSubstitutor.java:395)
	at org.apache.commons.lang3.text.StrSubstitutorTest.testReplaceInVariableRecursive(StrSubstitutorTest.java:357)

testReplaceAdjacentAtEnd(org.apache.commons.lang3.text.StrSubstitutorTest)  Time elapsed: 0.001 sec  <<< ERROR!
java.lang.StringIndexOutOfBoundsException: end < start
	at org.apache.commons.lang3.text.StrBuilder.validateRange(StrBuilder.java:612)
	at org.apache.commons.lang3.text.StrBuilder.replace(StrBuilder.java:412)
	at org.apache.commons.lang3.text.StrSubstitutor.substitute(StrSubstitutor.java:851)
	at org.apache.commons.lang3.text.StrSubstitutor.substitute(StrSubstitutor.java:735)
	at org.apache.commons.lang3.text.StrSubstitutor.replace(StrSubstitutor.java:395)
	at org.apache.commons.lang3.text.StrSubstitutorTest.testReplaceAdjacentAtEnd(StrSubstitutorTest.java:136)

testReplaceSolo(org.apache.commons.lang3.text.StrSubstitutorTest)  Time elapsed: 0 sec  <<< ERROR!
java.lang.StringIndexOutOfBoundsException: end < start
	at org.apache.commons.lang3.text.StrBuilder.validateRange(StrBuilder.java:612)
	at org.apache.commons.lang3.text.StrBuilder.replace(StrBuilder.java:412)
	at org.apache.commons.lang3.text.StrSubstitutor.substitute(StrSubstitutor.java:851)
	at org.apache.commons.lang3.text.StrSubstitutor.substitute(StrSubstitutor.java:735)
	at org.apache.commons.lang3.text.StrSubstitutor.replace(StrSubstitutor.java:395)
	at org.apache.commons.lang3.text.StrSubstitutorTest.doTestReplace(StrSubstitutorTest.java:634)
	at org.apache.commons.lang3.text.StrSubstitutorTest.testReplaceSolo(StrSubstitutorTest.java:71)

testLANG1055(org.apache.commons.lang3.text.StrSubstitutorTest)  Time elapsed: 0.001 sec  <<< ERROR!
java.lang.StringIndexOutOfBoundsException: end < start
	at org.apache.commons.lang3.text.StrBuilder.validateRange(StrBuilder.java:612)
	at org.apache.commons.lang3.text.StrBuilder.replace(StrBuilder.java:412)
	at org.apache.commons.lang3.text.StrSubstitutor.substitute(StrSubstitutor.java:851)
	at org.apache.commons.lang3.text.StrSubstitutor.substitute(StrSubstitutor.java:735)
	at org.apache.commons.lang3.text.StrSubstitutor.replace(StrSubstitutor.java:597)
	at org.apache.commons.lang3.text.StrSubstitutor.replace(StrSubstitutor.java:181)
	at org.apache.commons.lang3.text.StrSubstitutor.replace(StrSubstitutor.java:220)
	at org.apache.commons.lang3.text.StrSubstitutorTest.testLANG1055(StrSubstitutorTest.java:599)

testReplaceChangedMap(org.apache.commons.lang3.text.StrSubstitutorTest)  Time elapsed: 0 sec  <<< ERROR!
java.lang.StringIndexOutOfBoundsException: end < start
	at org.apache.commons.lang3.text.StrBuilder.validateRange(StrBuilder.java:612)
	at org.apache.commons.lang3.text.StrBuilder.replace(StrBuilder.java:412)
	at org.apache.commons.lang3.text.StrSubstitutor.substitute(StrSubstitutor.java:851)
	at org.apache.commons.lang3.text.StrSubstitutor.substitute(StrSubstitutor.java:735)
	at org.apache.commons.lang3.text.StrSubstitutor.replace(StrSubstitutor.java:395)
	at org.apache.commons.lang3.text.StrSubstitutorTest.testReplaceChangedMap(StrSubstitutorTest.java:105)

testReplaceEmptyKeys(org.apache.commons.lang3.text.StrSubstitutorTest)  Time elapsed: 0.001 sec  <<< ERROR!
java.lang.StringIndexOutOfBoundsException: end < start
	at org.apache.commons.lang3.text.StrBuilder.validateRange(StrBuilder.java:612)
	at org.apache.commons.lang3.text.StrBuilder.replace(StrBuilder.java:412)
	at org.apache.commons.lang3.text.StrSubstitutor.substitute(StrSubstitutor.java:851)
	at org.apache.commons.lang3.text.StrSubstitutor.substitute(StrSubstitutor.java:735)
	at org.apache.commons.lang3.text.StrSubstitutor.replace(StrSubstitutor.java:395)
	at org.apache.commons.lang3.text.StrSubstitutorTest.doTestReplace(StrSubstitutorTest.java:634)
	at org.apache.commons.lang3.text.StrSubstitutorTest.testReplaceEmptyKeys(StrSubstitutorTest.java:220)

testDefaultValueDelimiters(org.apache.commons.lang3.text.StrSubstitutorTest)  Time elapsed: 0.001 sec  <<< ERROR!
java.lang.StringIndexOutOfBoundsException: end < start
	at org.apache.commons.lang3.text.StrBuilder.validateRange(StrBuilder.java:612)
	at org.apache.commons.lang3.text.StrBuilder.replace(StrBuilder.java:412)
	at org.apache.commons.lang3.text.StrSubstitutor.substitute(StrSubstitutor.java:851)
	at org.apache.commons.lang3.text.StrSubstitutor.substitute(StrSubstitutor.java:735)
	at org.apache.commons.lang3.text.StrSubstitutor.replace(StrSubstitutor.java:395)
	at org.apache.commons.lang3.text.StrSubstitutorTest.testDefaultValueDelimiters(StrSubstitutorTest.java:374)

testReplaceComplexEscaping(org.apache.commons.lang3.text.StrSubstitutorTest)  Time elapsed: 0 sec  <<< ERROR!
java.lang.StringIndexOutOfBoundsException: end < start
	at org.apache.commons.lang3.text.StrBuilder.validateRange(StrBuilder.java:612)
	at org.apache.commons.lang3.text.StrBuilder.replace(StrBuilder.java:412)
	at org.apache.commons.lang3.text.StrSubstitutor.substitute(StrSubstitutor.java:851)
	at org.apache.commons.lang3.text.StrSubstitutor.substitute(StrSubstitutor.java:735)
	at org.apache.commons.lang3.text.StrSubstitutor.replace(StrSubstitutor.java:395)
	at org.apache.commons.lang3.text.StrSubstitutorTest.doTestReplace(StrSubstitutorTest.java:634)
	at org.apache.commons.lang3.text.StrSubstitutorTest.testReplaceComplexEscaping(StrSubstitutorTest.java:179)

testReplaceInVariable(org.apache.commons.lang3.text.StrSubstitutorTest)  Time elapsed: 0 sec  <<< ERROR!
java.lang.StringIndexOutOfBoundsException: end < start
	at org.apache.commons.lang3.text.StrBuilder.validateRange(StrBuilder.java:612)
	at org.apache.commons.lang3.text.StrBuilder.replace(StrBuilder.java:412)
	at org.apache.commons.lang3.text.StrSubstitutor.substitute(StrSubstitutor.java:851)
	at org.apache.commons.lang3.text.StrSubstitutor.substitute(StrSubstitutor.java:735)
	at org.apache.commons.lang3.text.StrSubstitutor.substitute(StrSubstitutor.java:805)
	at org.apache.commons.lang3.text.StrSubstitutor.substitute(StrSubstitutor.java:735)
	at org.apache.commons.lang3.text.StrSubstitutor.replace(StrSubstitutor.java:395)
	at org.apache.commons.lang3.text.StrSubstitutorTest.testReplaceInVariable(StrSubstitutorTest.java:311)

testReplacePrefixNoSuffix(org.apache.commons.lang3.text.StrSubstitutorTest)  Time elapsed: 0 sec  <<< ERROR!
java.lang.StringIndexOutOfBoundsException: end < start
	at org.apache.commons.lang3.text.StrBuilder.validateRange(StrBuilder.java:612)
	at org.apache.commons.lang3.text.StrBuilder.replace(StrBuilder.java:412)
	at org.apache.commons.lang3.text.StrSubstitutor.substitute(StrSubstitutor.java:851)
	at org.apache.commons.lang3.text.StrSubstitutor.substitute(StrSubstitutor.java:735)
	at org.apache.commons.lang3.text.StrSubstitutor.replace(StrSubstitutor.java:395)
	at org.apache.commons.lang3.text.StrSubstitutorTest.doTestReplace(StrSubstitutorTest.java:634)
	at org.apache.commons.lang3.text.StrSubstitutorTest.testReplacePrefixNoSuffix(StrSubstitutorTest.java:204)

testResolveVariable(org.apache.commons.lang3.text.StrSubstitutorTest)  Time elapsed: 0 sec  <<< ERROR!
java.lang.StringIndexOutOfBoundsException: end < start
	at org.apache.commons.lang3.text.StrBuilder.validateRange(StrBuilder.java:612)
	at org.apache.commons.lang3.text.StrBuilder.replace(StrBuilder.java:412)
	at org.apache.commons.lang3.text.StrSubstitutor.substitute(StrSubstitutor.java:851)
	at org.apache.commons.lang3.text.StrSubstitutor.substitute(StrSubstitutor.java:735)
	at org.apache.commons.lang3.text.StrSubstitutor.replaceIn(StrSubstitutor.java:697)
	at org.apache.commons.lang3.text.StrSubstitutorTest.testResolveVariable(StrSubstitutorTest.java:419)

testReplaceInVariableDisabled(org.apache.commons.lang3.text.StrSubstitutorTest)  Time elapsed: 0 sec  <<< ERROR!
java.lang.StringIndexOutOfBoundsException: end < start
	at org.apache.commons.lang3.text.StrBuilder.validateRange(StrBuilder.java:612)
	at org.apache.commons.lang3.text.StrBuilder.replace(StrBuilder.java:412)
	at org.apache.commons.lang3.text.StrSubstitutor.substitute(StrSubstitutor.java:851)
	at org.apache.commons.lang3.text.StrSubstitutor.substitute(StrSubstitutor.java:735)
	at org.apache.commons.lang3.text.StrSubstitutor.replace(StrSubstitutor.java:395)
	at org.apache.commons.lang3.text.StrSubstitutorTest.testReplaceInVariableDisabled(StrSubstitutorTest.java:335)

testReplaceIncompletePrefix(org.apache.commons.lang3.text.StrSubstitutorTest)  Time elapsed: 0 sec  <<< ERROR!
java.lang.StringIndexOutOfBoundsException: end < start
	at org.apache.commons.lang3.text.StrBuilder.validateRange(StrBuilder.java:612)
	at org.apache.commons.lang3.text.StrBuilder.replace(StrBuilder.java:412)
	at org.apache.commons.lang3.text.StrSubstitutor.substitute(StrSubstitutor.java:851)
	at org.apache.commons.lang3.text.StrSubstitutor.substitute(StrSubstitutor.java:735)
	at org.apache.commons.lang3.text.StrSubstitutor.replace(StrSubstitutor.java:395)
	at org.apache.commons.lang3.text.StrSubstitutorTest.doTestReplace(StrSubstitutorTest.java:634)
	at org.apache.commons.lang3.text.StrSubstitutorTest.testReplaceIncompletePrefix(StrSubstitutorTest.java:196)

testReplaceAdjacentAtStart(org.apache.commons.lang3.text.StrSubstitutorTest)  Time elapsed: 0.001 sec  <<< ERROR!
java.lang.StringIndexOutOfBoundsException: end < start
	at org.apache.commons.lang3.text.StrBuilder.validateRange(StrBuilder.java:612)
	at org.apache.commons.lang3.text.StrBuilder.replace(StrBuilder.java:412)
	at org.apache.commons.lang3.text.StrSubstitutor.substitute(StrSubstitutor.java:851)
	at org.apache.commons.lang3.text.StrSubstitutor.substitute(StrSubstitutor.java:735)
	at org.apache.commons.lang3.text.StrSubstitutor.replace(StrSubstitutor.java:395)
	at org.apache.commons.lang3.text.StrSubstitutorTest.testReplaceAdjacentAtStart(StrSubstitutorTest.java:125)

testConstructorMapFull(org.apache.commons.lang3.text.StrSubstitutorTest)  Time elapsed: 0 sec  <<< ERROR!
java.lang.StringIndexOutOfBoundsException: end < start
	at org.apache.commons.lang3.text.StrBuilder.validateRange(StrBuilder.java:612)
	at org.apache.commons.lang3.text.StrBuilder.replace(StrBuilder.java:412)
	at org.apache.commons.lang3.text.StrSubstitutor.substitute(StrSubstitutor.java:851)
	at org.apache.commons.lang3.text.StrSubstitutor.substitute(StrSubstitutor.java:735)
	at org.apache.commons.lang3.text.StrSubstitutor.replace(StrSubstitutor.java:395)
	at org.apache.commons.lang3.text.StrSubstitutorTest.testConstructorMapFull(StrSubstitutorTest.java:452)

Running org.apache.commons.lang3.text.StrBuilderTest
Tests run: 90, Failures: 0, Errors: 17, Skipped: 0, Time elapsed: 0.066 sec <<< FAILURE! - in org.apache.commons.lang3.text.StrBuilderTest
testAsTokenizer(org.apache.commons.lang3.text.StrBuilderTest)  Time elapsed: 0.003 sec  <<< ERROR!
java.lang.StringIndexOutOfBoundsException: end < start
	at org.apache.commons.lang3.text.StrBuilder.validateRange(StrBuilder.java:612)
	at org.apache.commons.lang3.text.StrBuilder.substring(StrBuilder.java:491)
	at org.apache.commons.lang3.text.StrTokenizer.readWithQuotes(StrTokenizer.java:781)
	at org.apache.commons.lang3.text.StrTokenizer.readNextToken(StrTokenizer.java:718)
	at org.apache.commons.lang3.text.StrTokenizer.tokenize(StrTokenizer.java:646)
	at org.apache.commons.lang3.text.StrBuilder$StrBuilderTokenizer.tokenize(StrBuilder.java:616)
	at org.apache.commons.lang3.text.StrTokenizer.checkTokenized(StrTokenizer.java:606)
	at org.apache.commons.lang3.text.StrTokenizer.getTokenArray(StrTokenizer.java:433)
	at org.apache.commons.lang3.text.StrBuilderTest.testAsTokenizer(StrBuilderTest.java:1665)

testDeleteFirst_StrMatcher(org.apache.commons.lang3.text.StrBuilderTest)  Time elapsed: 0.001 sec  <<< ERROR!
java.lang.StringIndexOutOfBoundsException: end < start
	at org.apache.commons.lang3.text.StrBuilder.validateRange(StrBuilder.java:612)
	at org.apache.commons.lang3.text.StrBuilder.replace(StrBuilder.java:438)
	at org.apache.commons.lang3.text.StrBuilder.deleteFirst(StrBuilder.java:406)
	at org.apache.commons.lang3.text.StrBuilderTest.testDeleteFirst_StrMatcher(StrBuilderTest.java:726)

testReplaceFirst_StrMatcher_String(org.apache.commons.lang3.text.StrBuilderTest)  Time elapsed: 0.001 sec  <<< ERROR!
java.lang.StringIndexOutOfBoundsException: end < start
	at org.apache.commons.lang3.text.StrBuilder.validateRange(StrBuilder.java:612)
	at org.apache.commons.lang3.text.StrBuilder.replace(StrBuilder.java:438)
	at org.apache.commons.lang3.text.StrBuilder.replaceFirst(StrBuilder.java:437)
	at org.apache.commons.lang3.text.StrBuilderTest.testReplaceFirst_StrMatcher_String(StrBuilderTest.java:907)

testSubSequenceIntInt(org.apache.commons.lang3.text.StrBuilderTest)  Time elapsed: 0.001 sec  <<< ERROR!
java.lang.StringIndexOutOfBoundsException: end < start
	at org.apache.commons.lang3.text.StrBuilder.validateRange(StrBuilder.java:612)
	at org.apache.commons.lang3.text.StrBuilder.substring(StrBuilder.java:491)
	at org.apache.commons.lang3.text.StrBuilder.subSequence(StrBuilder.java:489)
	at org.apache.commons.lang3.text.StrBuilderTest.testSubSequenceIntInt(StrBuilderTest.java:1222)

testReplace_StrMatcher_String_int_int_int_VaryEndIndex(org.apache.commons.lang3.text.StrBuilderTest)  Time elapsed: 0 sec  <<< ERROR!
java.lang.StringIndexOutOfBoundsException: end < start
	at org.apache.commons.lang3.text.StrBuilder.validateRange(StrBuilder.java:612)
	at org.apache.commons.lang3.text.StrBuilder.replace(StrBuilder.java:438)
	at org.apache.commons.lang3.text.StrBuilderTest.testReplace_StrMatcher_String_int_int_int_VaryEndIndex(StrBuilderTest.java:1047)

testTrim(org.apache.commons.lang3.text.StrBuilderTest)  Time elapsed: 0.001 sec  <<< ERROR!
java.lang.StringIndexOutOfBoundsException: end < start
	at org.apache.commons.lang3.text.StrBuilder.validateRange(StrBuilder.java:612)
	at org.apache.commons.lang3.text.StrBuilder.delete(StrBuilder.java:379)
	at org.apache.commons.lang3.text.StrBuilder.trim(StrBuilder.java:467)
	at org.apache.commons.lang3.text.StrBuilderTest.testTrim(StrBuilderTest.java:1147)

testSubstringIntInt(org.apache.commons.lang3.text.StrBuilderTest)  Time elapsed: 0 sec  <<< ERROR!
java.lang.StringIndexOutOfBoundsException: end < start
	at org.apache.commons.lang3.text.StrBuilder.validateRange(StrBuilder.java:612)
	at org.apache.commons.lang3.text.StrBuilder.substring(StrBuilder.java:491)
	at org.apache.commons.lang3.text.StrBuilderTest.testSubstringIntInt(StrBuilderTest.java:1250)

testDeleteIntInt(org.apache.commons.lang3.text.StrBuilderTest)  Time elapsed: 0 sec  <<< ERROR!
java.lang.StringIndexOutOfBoundsException: end < start
	at org.apache.commons.lang3.text.StrBuilder.validateRange(StrBuilder.java:612)
	at org.apache.commons.lang3.text.StrBuilder.delete(StrBuilder.java:379)
	at org.apache.commons.lang3.text.StrBuilderTest.testDeleteIntInt(StrBuilderTest.java:592)

testReplace_StrMatcher_String_int_int_int_VaryCount(org.apache.commons.lang3.text.StrBuilderTest)  Time elapsed: 0 sec  <<< ERROR!
java.lang.StringIndexOutOfBoundsException: end < start
	at org.apache.commons.lang3.text.StrBuilder.validateRange(StrBuilder.java:612)
	at org.apache.commons.lang3.text.StrBuilder.replace(StrBuilder.java:438)
	at org.apache.commons.lang3.text.StrBuilderTest.testReplace_StrMatcher_String_int_int_int_VaryCount(StrBuilderTest.java:1101)

testReplace_int_int_String(org.apache.commons.lang3.text.StrBuilderTest)  Time elapsed: 0.001 sec  <<< ERROR!
java.lang.StringIndexOutOfBoundsException: end < start
	at org.apache.commons.lang3.text.StrBuilder.validateRange(StrBuilder.java:612)
	at org.apache.commons.lang3.text.StrBuilder.replace(StrBuilder.java:412)
	at org.apache.commons.lang3.text.StrBuilderTest.testReplace_int_int_String(StrBuilderTest.java:744)

testReplaceAll_StrMatcher_String(org.apache.commons.lang3.text.StrBuilderTest)  Time elapsed: 0.001 sec  <<< ERROR!
java.lang.StringIndexOutOfBoundsException: end < start
	at org.apache.commons.lang3.text.StrBuilder.validateRange(StrBuilder.java:612)
	at org.apache.commons.lang3.text.StrBuilder.replace(StrBuilder.java:438)
	at org.apache.commons.lang3.text.StrBuilder.replaceAll(StrBuilder.java:436)
	at org.apache.commons.lang3.text.StrBuilderTest.testReplaceAll_StrMatcher_String(StrBuilderTest.java:873)

testReplace_StrMatcher_String_int_int_int_VaryStartIndex(org.apache.commons.lang3.text.StrBuilderTest)  Time elapsed: 0 sec  <<< ERROR!
java.lang.StringIndexOutOfBoundsException: end < start
	at org.apache.commons.lang3.text.StrBuilder.validateRange(StrBuilder.java:612)
	at org.apache.commons.lang3.text.StrBuilder.replace(StrBuilder.java:438)
	at org.apache.commons.lang3.text.StrBuilderTest.testReplace_StrMatcher_String_int_int_int_VaryStartIndex(StrBuilderTest.java:986)

testSubstringInt(org.apache.commons.lang3.text.StrBuilderTest)  Time elapsed: 0 sec  <<< ERROR!
java.lang.StringIndexOutOfBoundsException: end < start
	at org.apache.commons.lang3.text.StrBuilder.validateRange(StrBuilder.java:612)
	at org.apache.commons.lang3.text.StrBuilder.substring(StrBuilder.java:491)
	at org.apache.commons.lang3.text.StrBuilder.substring(StrBuilder.java:490)
	at org.apache.commons.lang3.text.StrBuilderTest.testSubstringInt(StrBuilderTest.java:1231)

testReplace_StrMatcher_String_int_int_int_VaryMatcher(org.apache.commons.lang3.text.StrBuilderTest)  Time elapsed: 0.001 sec  <<< ERROR!
java.lang.StringIndexOutOfBoundsException: end < start
	at org.apache.commons.lang3.text.StrBuilder.validateRange(StrBuilder.java:612)
	at org.apache.commons.lang3.text.StrBuilder.replace(StrBuilder.java:438)
	at org.apache.commons.lang3.text.StrBuilderTest.testReplace_StrMatcher_String_int_int_int_VaryMatcher(StrBuilderTest.java:942)

testReplace_StrMatcher_String_int_int_int_VaryReplace(org.apache.commons.lang3.text.StrBuilderTest)  Time elapsed: 0.001 sec  <<< ERROR!
java.lang.StringIndexOutOfBoundsException: end < start
	at org.apache.commons.lang3.text.StrBuilder.validateRange(StrBuilder.java:612)
	at org.apache.commons.lang3.text.StrBuilder.replace(StrBuilder.java:438)
	at org.apache.commons.lang3.text.StrBuilderTest.testReplace_StrMatcher_String_int_int_int_VaryReplace(StrBuilderTest.java:963)

testDeleteAll_StrMatcher(org.apache.commons.lang3.text.StrBuilderTest)  Time elapsed: 0.001 sec  <<< ERROR!
java.lang.StringIndexOutOfBoundsException: end < start
	at org.apache.commons.lang3.text.StrBuilder.validateRange(StrBuilder.java:612)
	at org.apache.commons.lang3.text.StrBuilder.replace(StrBuilder.java:438)
	at org.apache.commons.lang3.text.StrBuilder.deleteAll(StrBuilder.java:405)
	at org.apache.commons.lang3.text.StrBuilderTest.testDeleteAll_StrMatcher(StrBuilderTest.java:709)

testToCharArrayIntInt(org.apache.commons.lang3.text.StrBuilderTest)  Time elapsed: 0.001 sec  <<< ERROR!
java.lang.StringIndexOutOfBoundsException: end < start
	at org.apache.commons.lang3.text.StrBuilder.validateRange(StrBuilder.java:612)
	at org.apache.commons.lang3.text.StrBuilder.toCharArray(StrBuilder.java:77)
	at org.apache.commons.lang3.text.StrBuilderTest.testToCharArrayIntInt(StrBuilderTest.java:487)

Running org.apache.commons.lang3.StringEscapeUtilsTest
Tests run: 28, Failures: 0, Errors: 0, Skipped: 0, Time elapsed: 0.445 sec - in org.apache.commons.lang3.StringEscapeUtilsTest
Running org.apache.commons.lang3.AnnotationUtilsTest
Tests run: 10, Failures: 0, Errors: 0, Skipped: 0, Time elapsed: 0.017 sec - in org.apache.commons.lang3.AnnotationUtilsTest
Running org.apache.commons.lang3.ConversionTest
Tests run: 42, Failures: 0, Errors: 0, Skipped: 0, Time elapsed: 0.011 sec - in org.apache.commons.lang3.ConversionTest
Running org.apache.commons.lang3.StringUtilsTrimEmptyTest
Tests run: 15, Failures: 0, Errors: 0, Skipped: 0, Time elapsed: 0.009 sec - in org.apache.commons.lang3.StringUtilsTrimEmptyTest
Running org.apache.commons.lang3.EnumUtilsTest
Tests run: 34, Failures: 0, Errors: 0, Skipped: 0, Time elapsed: 0.011 sec - in org.apache.commons.lang3.EnumUtilsTest
Running org.apache.commons.lang3.exception.ExceptionUtilsTest
Tests run: 28, Failures: 0, Errors: 0, Skipped: 0, Time elapsed: 0.027 sec - in org.apache.commons.lang3.exception.ExceptionUtilsTest
Running org.apache.commons.lang3.exception.DefaultExceptionContextTest
Tests run: 8, Failures: 0, Errors: 0, Skipped: 0, Time elapsed: 0.008 sec - in org.apache.commons.lang3.exception.DefaultExceptionContextTest
Running org.apache.commons.lang3.exception.ContextedExceptionTest
Tests run: 14, Failures: 0, Errors: 0, Skipped: 0, Time elapsed: 0.006 sec - in org.apache.commons.lang3.exception.ContextedExceptionTest
Running org.apache.commons.lang3.exception.ContextedRuntimeExceptionTest
Tests run: 14, Failures: 0, Errors: 0, Skipped: 0, Time elapsed: 0.011 sec - in org.apache.commons.lang3.exception.ContextedRuntimeExceptionTest
Running org.apache.commons.lang3.BitFieldTest
Tests run: 15, Failures: 0, Errors: 0, Skipped: 0, Time elapsed: 0.002 sec - in org.apache.commons.lang3.BitFieldTest
Running org.apache.commons.lang3.ArrayUtilsRemoveMultipleTest
Tests run: 55, Failures: 0, Errors: 0, Skipped: 0, Time elapsed: 0.017 sec - in org.apache.commons.lang3.ArrayUtilsRemoveMultipleTest
Running org.apache.commons.lang3.HashSetvBitSetTest
Ratio=9% array=100 count=1 extract=22109858 bitset=2118625
Ratio=11% array=100 count=10 extract=17691590 bitset=2030278
Ratio=14% array=100 count=50 extract=11588038 bitset=1732184
Ratio=4% array=100 count=100 extract=10360169 bitset=467775
Ratio=182% array=1000 count=10 extract=7142636 bitset=13015667
Ratio=36% array=1000 count=100 extract=15626018 bitset=5645374
Ratio=8% array=1000 count=500 extract=45532632 bitset=3676502
Ratio=1% array=1000 count=1000 extract=75538010 bitset=778397
Ratio=4% count=0 hash=5029638 bits=203256
Ratio=7% count=5 hash=2750543 bits=206273
Ratio=31% count=10 hash=963559 bits=302097
Ratio=21% count=200 hash=21477104 bits=4541422
Ratio=13% count=50 hash=9739916 bits=1311692
Ratio=18% count=100 hash=18300189 bits=3367926
Ratio=21% count=1000 hash=81483968 bits=17329125
Ratio=20% count=2000 hash=163453671 bits=34180504
Tests run: 2, Failures: 0, Errors: 0, Skipped: 0, Time elapsed: 0.73 sec - in org.apache.commons.lang3.HashSetvBitSetTest
Running org.apache.commons.lang3.StringUtilsTest
Tests run: 124, Failures: 0, Errors: 0, Skipped: 0, Time elapsed: 0.107 sec - in org.apache.commons.lang3.StringUtilsTest
Running org.apache.commons.lang3.ArrayUtilsRemoveTest
Tests run: 19, Failures: 0, Errors: 0, Skipped: 0, Time elapsed: 0.001 sec - in org.apache.commons.lang3.ArrayUtilsRemoveTest
Running org.apache.commons.lang3.ObjectUtilsTest
Tests run: 36, Failures: 0, Errors: 0, Skipped: 0, Time elapsed: 0.014 sec - in org.apache.commons.lang3.ObjectUtilsTest
Running org.apache.commons.lang3.ClassPathUtilsTest
Tests run: 13, Failures: 0, Errors: 0, Skipped: 0, Time elapsed: 0.008 sec - in org.apache.commons.lang3.ClassPathUtilsTest
Running org.apache.commons.lang3.math.NumberUtilsTest
Tests run: 91, Failures: 0, Errors: 0, Skipped: 0, Time elapsed: 0.047 sec - in org.apache.commons.lang3.math.NumberUtilsTest
Running org.apache.commons.lang3.math.IEEE754rUtilsTest
Tests run: 3, Failures: 0, Errors: 0, Skipped: 0, Time elapsed: 0.002 sec - in org.apache.commons.lang3.math.IEEE754rUtilsTest
Running org.apache.commons.lang3.math.FractionTest
Tests run: 25, Failures: 0, Errors: 0, Skipped: 0, Time elapsed: 0.096 sec - in org.apache.commons.lang3.math.FractionTest
Running org.apache.commons.lang3.BooleanUtilsTest
Tests run: 72, Failures: 0, Errors: 0, Skipped: 0, Time elapsed: 0.016 sec - in org.apache.commons.lang3.BooleanUtilsTest
Running org.apache.commons.lang3.CharSequenceUtilsTest
Tests run: 2, Failures: 0, Errors: 0, Skipped: 0, Time elapsed: 0 sec - in org.apache.commons.lang3.CharSequenceUtilsTest
Running org.apache.commons.lang3.CharSetUtilsTest
Tests run: 11, Failures: 0, Errors: 0, Skipped: 0, Time elapsed: 0.001 sec - in org.apache.commons.lang3.CharSetUtilsTest
Running org.apache.commons.lang3.ArrayUtilsAddTest
Tests run: 13, Failures: 0, Errors: 0, Skipped: 0, Time elapsed: 0 sec - in org.apache.commons.lang3.ArrayUtilsAddTest
Running org.apache.commons.lang3.CharEncodingTest
Tests run: 6, Failures: 0, Errors: 0, Skipped: 0, Time elapsed: 0.021 sec - in org.apache.commons.lang3.CharEncodingTest
Running org.apache.commons.lang3.ClassUtilsTest
Tests run: 57, Failures: 0, Errors: 0, Skipped: 0, Time elapsed: 0.065 sec - in org.apache.commons.lang3.ClassUtilsTest
Running org.apache.commons.lang3.RangeTest
Tests run: 24, Failures: 0, Errors: 0, Skipped: 0, Time elapsed: 0.012 sec - in org.apache.commons.lang3.RangeTest
Running org.apache.commons.lang3.event.EventUtilsTest
Tests run: 8, Failures: 0, Errors: 0, Skipped: 0, Time elapsed: 0.014 sec - in org.apache.commons.lang3.event.EventUtilsTest
Running org.apache.commons.lang3.event.EventListenerSupportTest
Tests run: 9, Failures: 0, Errors: 0, Skipped: 0, Time elapsed: 0.023 sec - in org.apache.commons.lang3.event.EventListenerSupportTest
Running org.apache.commons.lang3.ArrayUtilsTest
Tests run: 205, Failures: 0, Errors: 0, Skipped: 0, Time elapsed: 0.066 sec - in org.apache.commons.lang3.ArrayUtilsTest
Running org.apache.commons.lang3.CharUtilsTest
Tests run: 24, Failures: 0, Errors: 0, Skipped: 0, Time elapsed: 0.003 sec - in org.apache.commons.lang3.CharUtilsTest
Running org.apache.commons.lang3.NotImplementedExceptionTest
Tests run: 1, Failures: 0, Errors: 0, Skipped: 0, Time elapsed: 0.005 sec - in org.apache.commons.lang3.NotImplementedExceptionTest
Running org.apache.commons.lang3.StringUtilsEqualsIndexOfTest
Tests run: 50, Failures: 0, Errors: 0, Skipped: 0, Time elapsed: 0.023 sec - in org.apache.commons.lang3.StringUtilsEqualsIndexOfTest
Running org.apache.commons.lang3.RandomUtilsTest
Tests run: 23, Failures: 0, Errors: 0, Skipped: 0, Time elapsed: 0.012 sec - in org.apache.commons.lang3.RandomUtilsTest

Results :


Tests in error: 
  StrBuilderTest.testAsTokenizer:1665 » StringIndexOutOfBounds end < start
  StrBuilderTest.testDeleteAll_StrMatcher:709 » StringIndexOutOfBounds end < sta...
  StrBuilderTest.testDeleteFirst_StrMatcher:726 » StringIndexOutOfBounds end < s...
  StrBuilderTest.testDeleteIntInt:592 » StringIndexOutOfBounds end < start
  StrBuilderTest.testReplaceAll_StrMatcher_String:873 » StringIndexOutOfBounds e...
  StrBuilderTest.testReplaceFirst_StrMatcher_String:907 » StringIndexOutOfBounds
  StrBuilderTest.testReplace_StrMatcher_String_int_int_int_VaryCount:1101 » StringIndexOutOfBounds
  StrBuilderTest.testReplace_StrMatcher_String_int_int_int_VaryEndIndex:1047 » StringIndexOutOfBounds
  StrBuilderTest.testReplace_StrMatcher_String_int_int_int_VaryMatcher:942 » StringIndexOutOfBounds
  StrBuilderTest.testReplace_StrMatcher_String_int_int_int_VaryReplace:963 » StringIndexOutOfBounds
  StrBuilderTest.testReplace_StrMatcher_String_int_int_int_VaryStartIndex:986 » StringIndexOutOfBounds
  StrBuilderTest.testReplace_int_int_String:744 » StringIndexOutOfBounds end < s...
  StrBuilderTest.testSubSequenceIntInt:1222 » StringIndexOutOfBounds end < start
  StrBuilderTest.testSubstringInt:1231 » StringIndexOutOfBounds end < start
  StrBuilderTest.testSubstringIntInt:1250 » StringIndexOutOfBounds end < start
  StrBuilderTest.testToCharArrayIntInt:487 » StringIndexOutOfBounds end < start
  StrBuilderTest.testTrim:1147 » StringIndexOutOfBounds end < start
  StrSubstitutorTest.testConstructorMapFull:452 » StringIndexOutOfBounds end < s...
  StrSubstitutorTest.testConstructorMapPrefixSuffix:441 » StringIndexOutOfBounds
  StrSubstitutorTest.testCyclicReplacement:251 » StringIndexOutOfBounds end < st...
  StrSubstitutorTest.testDefaultValueDelimiters:374 » StringIndexOutOfBounds end...
  StrSubstitutorTest.testLANG1055:599 » StringIndexOutOfBounds end < start
  StrSubstitutorTest.testReplaceAdjacentAtEnd:136 » StringIndexOutOfBounds end <...
  StrSubstitutorTest.testReplaceAdjacentAtStart:125 » StringIndexOutOfBounds end...
  StrSubstitutorTest.testReplaceChangedMap:105 » StringIndexOutOfBounds end < st...
  StrSubstitutorTest.testReplaceComplexEscaping:179->doTestReplace:634 » StringIndexOutOfBounds
  StrSubstitutorTest.testReplaceEmptyKeys:220->doTestReplace:634 » StringIndexOutOfBounds
  StrSubstitutorTest.testReplaceEscaping:163->doTestReplace:634 » StringIndexOutOfBounds
  StrSubstitutorTest.testReplaceInVariable:311 » StringIndexOutOfBounds end < st...
  StrSubstitutorTest.testReplaceInVariableDisabled:335 » StringIndexOutOfBounds ...
  StrSubstitutorTest.testReplaceInVariableRecursive:357 » StringIndexOutOfBounds
  StrSubstitutorTest.testReplaceIncompletePrefix:196->doTestReplace:634 » StringIndexOutOfBounds
  StrSubstitutorTest.testReplaceNoPrefixNoSuffix:188->doTestReplace:634 » StringIndexOutOfBounds
  StrSubstitutorTest.testReplaceNoPrefixSuffix:212->doTestReplace:634 » StringIndexOutOfBounds
  StrSubstitutorTest.testReplacePrefixNoSuffix:204->doTestReplace:634 » StringIndexOutOfBounds
  StrSubstitutorTest.testReplaceRecursive:152->doTestReplace:634 » StringIndexOutOfBounds
  StrSubstitutorTest.testReplaceSimple:63->doTestReplace:634 » StringIndexOutOfBounds
  StrSubstitutorTest.testReplaceSolo:71->doTestReplace:634 » StringIndexOutOfBounds
  StrSubstitutorTest.testReplaceToIdentical:231->doTestReplace:634 » StringIndexOutOfBounds
  StrSubstitutorTest.testReplaceUnknownKey:113->doTestReplace:634 » StringIndexOutOfBounds
  StrSubstitutorTest.testResolveVariable:419 » StringIndexOutOfBounds end < star...
  StrSubstitutorTest.testSamePrefixAndSuffix:624 » StringIndexOutOfBounds end < ...
  StrSubstitutorTest.testStaticReplace:563 » StringIndexOutOfBounds end < start
  StrSubstitutorTest.testStaticReplacePrefixSuffix:573 » StringIndexOutOfBounds ...
  StrSubstitutorTest.testStaticReplaceSystemProperties:587 » StringIndexOutOfBounds
  StrSubstitutorTest.testSubstituteDefaultProperties:615 » StringIndexOutOfBounds
  StrTokenizerTest.test1:56 » StringIndexOutOfBounds end < start
  StrTokenizerTest.test2:77 » StringIndexOutOfBounds end < start
  StrTokenizerTest.test3:98 » StringIndexOutOfBounds end < start
  StrTokenizerTest.test4:119 » StringIndexOutOfBounds end < start
  StrTokenizerTest.test5:141 » StringIndexOutOfBounds end < start
  StrTokenizerTest.test6:163 » StringIndexOutOfBounds end < start
  StrTokenizerTest.test7:198 » StringIndexOutOfBounds end < start
  StrTokenizerTest.test8:219 » StringIndexOutOfBounds end < start
  StrTokenizerTest.testBasic1:235 » StringIndexOutOfBounds end < start
  StrTokenizerTest.testBasic2:245 » StringIndexOutOfBounds end < start
  StrTokenizerTest.testBasic3:255 » StringIndexOutOfBounds end < start
  StrTokenizerTest.testBasic4:265 » StringIndexOutOfBounds end < start
  StrTokenizerTest.testBasic5:275 » StringIndexOutOfBounds end < start
  StrTokenizerTest.testBasicDelim1:285 » StringIndexOutOfBounds end < start
  StrTokenizerTest.testBasicDelim2:295 » StringIndexOutOfBounds end < start
  StrTokenizerTest.testBasicEmpty1:304 » StringIndexOutOfBounds end < start
  StrTokenizerTest.testBasicEmpty2:317 » StringIndexOutOfBounds end < start
  StrTokenizerTest.testBasicIgnoreTrimmed1:451 » StringIndexOutOfBounds end < st...
  StrTokenizerTest.testBasicIgnoreTrimmed2:465 » StringIndexOutOfBounds end < st...
  StrTokenizerTest.testBasicIgnoreTrimmed3:478 » StringIndexOutOfBounds end < st...
  StrTokenizerTest.testBasicIgnoreTrimmed4:492 » StringIndexOutOfBounds end < st...
  StrTokenizerTest.testBasicQuoted1:328 » StringIndexOutOfBounds end < start
  StrTokenizerTest.testBasicQuoted2:340 » StringIndexOutOfBounds end < start
  StrTokenizerTest.testBasicQuoted3:352 » StringIndexOutOfBounds end < start
  StrTokenizerTest.testBasicQuoted4:364 » StringIndexOutOfBounds end < start
  StrTokenizerTest.testBasicQuoted5:377 » StringIndexOutOfBounds end < start
  StrTokenizerTest.testBasicQuoted6:388 » StringIndexOutOfBounds end < start
  StrTokenizerTest.testBasicQuoted7:398 » StringIndexOutOfBounds end < start
  StrTokenizerTest.testBasicQuotedTrimmed1:411 » StringIndexOutOfBounds end < st...
  StrTokenizerTest.testBasicTrimmed1:424 » StringIndexOutOfBounds end < start
  StrTokenizerTest.testBasicTrimmed2:437 » StringIndexOutOfBounds end < start
  StrTokenizerTest.testCSVSimple:524->testCSV:512->testXSVAbc:779 » StringIndexOutOfBounds
  StrTokenizerTest.testCSVSimpleNeedsTrim:529->testCSV:512->testXSVAbc:779 » StringIndexOutOfBounds
  StrTokenizerTest.testCloneReset:612 » StringIndexOutOfBounds end < start
  StrTokenizerTest.testConstructor_String:627 » StringIndexOutOfBounds end < sta...
  StrTokenizerTest.testConstructor_String_char:643 » StringIndexOutOfBounds end ...
  StrTokenizerTest.testConstructor_String_char_char:660 » StringIndexOutOfBounds
  StrTokenizerTest.testConstructor_charArray:675 » StringIndexOutOfBounds end < ...
  StrTokenizerTest.testConstructor_charArray_char:691 » StringIndexOutOfBounds e...
  StrTokenizerTest.testConstructor_charArray_char_char:708 » StringIndexOutOfBounds
  StrTokenizerTest.testIteration:803 » StringIndexOutOfBounds end < start
  StrTokenizerTest.testListArray:503 » StringIndexOutOfBounds end < start
  StrTokenizerTest.testReset:723 » StringIndexOutOfBounds end < start
  StrTokenizerTest.testReset_String:740 » StringIndexOutOfBounds end < start
  StrTokenizerTest.testReset_charArray:755 » StringIndexOutOfBounds end < start
  StrTokenizerTest.testTSV:765->testXSVAbc:779 » StringIndexOutOfBounds end < st...
  StrTokenizerTest.testToString:876 » StringIndexOutOfBounds end < start
  StrTokenizerTest.testTokenizeSubclassInputChange:851 » StringIndexOutOfBounds ...
  StrTokenizerTest.testTokenizeSubclassOutputChange:866 » StringIndexOutOfBounds


Tests run: 3526, Failures: 0, Errors: 95, Skipped: 97

[INFO] ------------------------------------------------------------------------
[INFO] BUILD FAILURE
[INFO] ------------------------------------------------------------------------
[INFO] Total time: 37.904s
[INFO] Finished at: Tue Aug 04 22:47:58 BST 2015
[INFO] Final Memory: 25M/498M
[INFO] ------------------------------------------------------------------------
[ERROR] Failed to execute goal org.apache.maven.plugins:maven-surefire-plugin:2.18:test (default-test) on project commons-lang3: There are test failures.
[ERROR] 
[ERROR] Please refer to /home/perham/Study/LittleDarwin/Cases/commons-lang3-3.4-src/target/surefire-reports for the individual test results.
[ERROR] -> [Help 1]
[ERROR] 
[ERROR] To see the full stack trace of the errors, re-run Maven with the -e switch.
[ERROR] Re-run Maven using the -X switch to enable full debug logging.
[ERROR] 
[ERROR] For more information about the errors and possible solutions, please read the following articles:
[ERROR] [Help 1] http://cwiki.apache.org/confluence/display/MAVEN/MojoFailureException
