[INFO] Scanning for projects...
[INFO]                                                                         
[INFO] ------------------------------------------------------------------------
[INFO] Building Apache Commons Lang 3.4
[INFO] ------------------------------------------------------------------------
[INFO] 
[INFO] --- maven-enforcer-plugin:1.3.1:enforce (enforce-maven-3) @ commons-lang3 ---
[INFO] 
[INFO] --- build-helper-maven-plugin:1.8:parse-version (parse-version) @ commons-lang3 ---
[INFO] 
[INFO] --- maven-antrun-plugin:1.8:run (javadoc.resources) @ commons-lang3 ---
[INFO] Executing tasks

main:
[INFO] Executed tasks
[INFO] 
[INFO] --- maven-remote-resources-plugin:1.5:process (default) @ commons-lang3 ---
[INFO] 
[INFO] --- buildnumber-maven-plugin:1.3:create (default) @ commons-lang3 ---
[INFO] Executing: /bin/sh -c cd /home/perham/Study/LittleDarwin/Cases/commons-lang3-3.4-src && svn --non-interactive info
[INFO] Working directory: /home/perham/Study/LittleDarwin/Cases/commons-lang3-3.4-src
[INFO] Storing buildNumber: ?????? at timestamp: 1438677093871
[INFO] Executing: /bin/sh -c cd /home/perham/Study/LittleDarwin/Cases/commons-lang3-3.4-src && svn --non-interactive info
[INFO] Working directory: /home/perham/Study/LittleDarwin/Cases/commons-lang3-3.4-src
[INFO] Storing buildScmBranch: UNKNOWN_BRANCH
[INFO] 
[INFO] --- maven-resources-plugin:2.7:resources (default-resources) @ commons-lang3 ---
[INFO] Using 'ISO-8859-1' encoding to copy filtered resources.
[INFO] Copying 0 resource
[INFO] Copying 2 resources to META-INF
[INFO] 
[INFO] --- maven-compiler-plugin:3.2:compile (default-compile) @ commons-lang3 ---
[INFO] Changes detected - recompiling the module!
[INFO] Compiling 133 source files to /home/perham/Study/LittleDarwin/Cases/commons-lang3-3.4-src/target/classes
[INFO] /home/perham/Study/LittleDarwin/Cases/commons-lang3-3.4-src/src/main/java/org/apache/commons/lang3/SerializationUtils.java: /home/perham/Study/LittleDarwin/Cases/commons-lang3-3.4-src/src/main/java/org/apache/commons/lang3/SerializationUtils.java uses unchecked or unsafe operations.
[INFO] /home/perham/Study/LittleDarwin/Cases/commons-lang3-3.4-src/src/main/java/org/apache/commons/lang3/SerializationUtils.java: Recompile with -Xlint:unchecked for details.
[INFO] 
[INFO] --- maven-bundle-plugin:2.5.3:manifest (bundle-manifest) @ commons-lang3 ---
[INFO] 
[INFO] --- animal-sniffer-maven-plugin:1.13:check (checkAPIcompatibility) @ commons-lang3 ---
[INFO] Checking unresolved references to org.codehaus.mojo.signature:java16:1.0
[INFO] 
[INFO] --- maven-resources-plugin:2.7:testResources (default-testResources) @ commons-lang3 ---
[INFO] Using 'ISO-8859-1' encoding to copy filtered resources.
[INFO] Copying 2 resources
[INFO] Copying 2 resources to META-INF
[INFO] 
[INFO] --- maven-compiler-plugin:3.2:testCompile (default-testCompile) @ commons-lang3 ---
[INFO] Nothing to compile - all classes are up to date
[INFO] 
[INFO] --- maven-surefire-plugin:2.18:test (default-test) @ commons-lang3 ---
[INFO] Surefire report directory: /home/perham/Study/LittleDarwin/Cases/commons-lang3-3.4-src/target/surefire-reports

-------------------------------------------------------
 T E S T S
-------------------------------------------------------
Running org.apache.commons.lang3.ValidateTest
Tests run: 63, Failures: 0, Errors: 0, Skipped: 0, Time elapsed: 0.032 sec - in org.apache.commons.lang3.ValidateTest
Running org.apache.commons.lang3.LocaleUtilsTest
Tests run: 15, Failures: 0, Errors: 0, Skipped: 0, Time elapsed: 0.021 sec - in org.apache.commons.lang3.LocaleUtilsTest
Running org.apache.commons.lang3.tuple.MutableTripleTest
Tests run: 8, Failures: 0, Errors: 0, Skipped: 0, Time elapsed: 0.008 sec - in org.apache.commons.lang3.tuple.MutableTripleTest
Running org.apache.commons.lang3.tuple.TripleTest
Tests run: 10, Failures: 0, Errors: 0, Skipped: 0, Time elapsed: 0.009 sec - in org.apache.commons.lang3.tuple.TripleTest
Running org.apache.commons.lang3.tuple.ImmutablePairTest
Tests run: 6, Failures: 0, Errors: 0, Skipped: 0, Time elapsed: 0.005 sec - in org.apache.commons.lang3.tuple.ImmutablePairTest
Running org.apache.commons.lang3.tuple.MutablePairTest
Tests run: 8, Failures: 0, Errors: 0, Skipped: 0, Time elapsed: 0 sec - in org.apache.commons.lang3.tuple.MutablePairTest
Running org.apache.commons.lang3.tuple.ImmutableTripleTest
Tests run: 6, Failures: 0, Errors: 0, Skipped: 0, Time elapsed: 0 sec - in org.apache.commons.lang3.tuple.ImmutableTripleTest
Running org.apache.commons.lang3.tuple.PairTest
Tests run: 9, Failures: 0, Errors: 0, Skipped: 0, Time elapsed: 0.001 sec - in org.apache.commons.lang3.tuple.PairTest
Running org.apache.commons.lang3.StringUtilsIsTest
Tests run: 8, Failures: 0, Errors: 0, Skipped: 0, Time elapsed: 0.008 sec - in org.apache.commons.lang3.StringUtilsIsTest
Running org.apache.commons.lang3.JavaVersionTest
Tests run: 3, Failures: 0, Errors: 0, Skipped: 0, Time elapsed: 0 sec - in org.apache.commons.lang3.JavaVersionTest
Running org.apache.commons.lang3.builder.NoFieldNamesToStringStyleTest
Tests run: 8, Failures: 0, Errors: 0, Skipped: 0, Time elapsed: 0.011 sec - in org.apache.commons.lang3.builder.NoFieldNamesToStringStyleTest
Running org.apache.commons.lang3.builder.ShortPrefixToStringStyleTest
Tests run: 8, Failures: 0, Errors: 0, Skipped: 0, Time elapsed: 0.002 sec - in org.apache.commons.lang3.builder.ShortPrefixToStringStyleTest
Running org.apache.commons.lang3.builder.DiffResultTest
Tests run: 9, Failures: 0, Errors: 0, Skipped: 0, Time elapsed: 0.008 sec - in org.apache.commons.lang3.builder.DiffResultTest
Running org.apache.commons.lang3.builder.CompareToBuilderTest
Tests run: 48, Failures: 0, Errors: 0, Skipped: 0, Time elapsed: 0.018 sec - in org.apache.commons.lang3.builder.CompareToBuilderTest
Running org.apache.commons.lang3.builder.MultilineRecursiveToStringStyleTest
Tests run: 10, Failures: 0, Errors: 0, Skipped: 0, Time elapsed: 0.005 sec - in org.apache.commons.lang3.builder.MultilineRecursiveToStringStyleTest
Running org.apache.commons.lang3.builder.RecursiveToStringStyleTest
Tests run: 8, Failures: 0, Errors: 0, Skipped: 0, Time elapsed: 0.005 sec - in org.apache.commons.lang3.builder.RecursiveToStringStyleTest
Running org.apache.commons.lang3.builder.DefaultToStringStyleTest
Tests run: 8, Failures: 0, Errors: 0, Skipped: 0, Time elapsed: 0.006 sec - in org.apache.commons.lang3.builder.DefaultToStringStyleTest
Running org.apache.commons.lang3.builder.ReflectionToStringBuilderExcludeTest
Tests run: 11, Failures: 0, Errors: 0, Skipped: 0, Time elapsed: 0.002 sec - in org.apache.commons.lang3.builder.ReflectionToStringBuilderExcludeTest
Running org.apache.commons.lang3.builder.StandardToStringStyleTest
Tests run: 8, Failures: 0, Errors: 0, Skipped: 0, Time elapsed: 0.002 sec - in org.apache.commons.lang3.builder.StandardToStringStyleTest
Running org.apache.commons.lang3.builder.ToStringStyleTest
Tests run: 12, Failures: 0, Errors: 0, Skipped: 0, Time elapsed: 0.003 sec - in org.apache.commons.lang3.builder.ToStringStyleTest
Running org.apache.commons.lang3.builder.DiffTest
Tests run: 4, Failures: 0, Errors: 0, Skipped: 0, Time elapsed: 0 sec - in org.apache.commons.lang3.builder.DiffTest
Running org.apache.commons.lang3.builder.SimpleToStringStyleTest
Tests run: 8, Failures: 0, Errors: 0, Skipped: 0, Time elapsed: 0.003 sec - in org.apache.commons.lang3.builder.SimpleToStringStyleTest
Running org.apache.commons.lang3.builder.MultiLineToStringStyleTest
Tests run: 8, Failures: 0, Errors: 0, Skipped: 0, Time elapsed: 0.001 sec - in org.apache.commons.lang3.builder.MultiLineToStringStyleTest
Running org.apache.commons.lang3.builder.ToStringStyleConcurrencyTest
Tests run: 3, Failures: 0, Errors: 0, Skipped: 0, Time elapsed: 4.043 sec - in org.apache.commons.lang3.builder.ToStringStyleConcurrencyTest
Running org.apache.commons.lang3.builder.ReflectionToStringBuilderMutateInspectConcurrencyTest
Tests run: 1, Failures: 0, Errors: 0, Skipped: 1, Time elapsed: 0 sec - in org.apache.commons.lang3.builder.ReflectionToStringBuilderMutateInspectConcurrencyTest
Running org.apache.commons.lang3.builder.ToStringBuilderTest
Tests run: 74, Failures: 0, Errors: 0, Skipped: 1, Time elapsed: 0.065 sec - in org.apache.commons.lang3.builder.ToStringBuilderTest
Running org.apache.commons.lang3.builder.EqualsBuilderTest
Tests run: 48, Failures: 0, Errors: 0, Skipped: 0, Time elapsed: 0.013 sec - in org.apache.commons.lang3.builder.EqualsBuilderTest
Running org.apache.commons.lang3.builder.HashCodeBuilderAndEqualsBuilderTest
Tests run: 4, Failures: 0, Errors: 0, Skipped: 0, Time elapsed: 0.007 sec - in org.apache.commons.lang3.builder.HashCodeBuilderAndEqualsBuilderTest
Running org.apache.commons.lang3.builder.ReflectionToStringBuilderConcurrencyTest
Tests run: 3, Failures: 0, Errors: 0, Skipped: 3, Time elapsed: 0.002 sec - in org.apache.commons.lang3.builder.ReflectionToStringBuilderConcurrencyTest
Running org.apache.commons.lang3.builder.JsonToStringStyleTest
Tests run: 9, Failures: 0, Errors: 0, Skipped: 0, Time elapsed: 0.001 sec - in org.apache.commons.lang3.builder.JsonToStringStyleTest
Running org.apache.commons.lang3.builder.NoClassNameToStringStyleTest
Tests run: 8, Failures: 0, Errors: 0, Skipped: 0, Time elapsed: 0.002 sec - in org.apache.commons.lang3.builder.NoClassNameToStringStyleTest
Running org.apache.commons.lang3.builder.DiffBuilderTest
Tests run: 30, Failures: 0, Errors: 0, Skipped: 0, Time elapsed: 0.027 sec - in org.apache.commons.lang3.builder.DiffBuilderTest
Running org.apache.commons.lang3.builder.HashCodeBuilderTest
Tests run: 44, Failures: 0, Errors: 0, Skipped: 0, Time elapsed: 0.018 sec - in org.apache.commons.lang3.builder.HashCodeBuilderTest
Running org.apache.commons.lang3.concurrent.AtomicInitializerTest
Tests run: 3, Failures: 0, Errors: 0, Skipped: 0, Time elapsed: 0.008 sec - in org.apache.commons.lang3.concurrent.AtomicInitializerTest
Running org.apache.commons.lang3.concurrent.CallableBackgroundInitializerTest
Tests run: 4, Failures: 0, Errors: 4, Skipped: 0, Time elapsed: 0.011 sec <<< FAILURE! - in org.apache.commons.lang3.concurrent.CallableBackgroundInitializerTest
testInitNullCallable(org.apache.commons.lang3.concurrent.CallableBackgroundInitializerTest)  Time elapsed: 0.009 sec  <<< ERROR!
java.lang.Exception: Unexpected exception, expected<java.lang.IllegalArgumentException> but was<java.lang.IllegalStateException>
	at org.apache.commons.lang3.concurrent.BackgroundInitializer.setExternalExecutor(BackgroundInitializer.java:21)
	at org.apache.commons.lang3.concurrent.BackgroundInitializer.<init>(BackgroundInitializer.java:18)
	at org.apache.commons.lang3.concurrent.BackgroundInitializer.<init>(BackgroundInitializer.java:17)
	at org.apache.commons.lang3.concurrent.CallableBackgroundInitializer.<init>(CallableBackgroundInitializer.java:79)
	at org.apache.commons.lang3.concurrent.CallableBackgroundInitializerTest.testInitNullCallable(CallableBackgroundInitializerTest.java:43)

testInitExecutorNullCallable(org.apache.commons.lang3.concurrent.CallableBackgroundInitializerTest)  Time elapsed: 0 sec  <<< ERROR!
java.lang.Exception: Unexpected exception, expected<java.lang.IllegalArgumentException> but was<java.lang.IllegalStateException>
	at org.apache.commons.lang3.concurrent.BackgroundInitializer.setExternalExecutor(BackgroundInitializer.java:21)
	at org.apache.commons.lang3.concurrent.BackgroundInitializer.<init>(BackgroundInitializer.java:18)
	at org.apache.commons.lang3.concurrent.CallableBackgroundInitializer.<init>(CallableBackgroundInitializer.java:96)
	at org.apache.commons.lang3.concurrent.CallableBackgroundInitializerTest.testInitExecutorNullCallable(CallableBackgroundInitializerTest.java:68)

testInitialize(org.apache.commons.lang3.concurrent.CallableBackgroundInitializerTest)  Time elapsed: 0.001 sec  <<< ERROR!
java.lang.IllegalStateException: Cannot set ExecutorService after start()!
	at org.apache.commons.lang3.concurrent.BackgroundInitializer.setExternalExecutor(BackgroundInitializer.java:21)
	at org.apache.commons.lang3.concurrent.BackgroundInitializer.<init>(BackgroundInitializer.java:18)
	at org.apache.commons.lang3.concurrent.BackgroundInitializer.<init>(BackgroundInitializer.java:17)
	at org.apache.commons.lang3.concurrent.CallableBackgroundInitializer.<init>(CallableBackgroundInitializer.java:79)
	at org.apache.commons.lang3.concurrent.CallableBackgroundInitializerTest.testInitialize(CallableBackgroundInitializerTest.java:84)

testInitExecutor(org.apache.commons.lang3.concurrent.CallableBackgroundInitializerTest)  Time elapsed: 0 sec  <<< ERROR!
java.lang.IllegalStateException: Cannot set ExecutorService after start()!
	at org.apache.commons.lang3.concurrent.BackgroundInitializer.setExternalExecutor(BackgroundInitializer.java:21)
	at org.apache.commons.lang3.concurrent.BackgroundInitializer.<init>(BackgroundInitializer.java:18)
	at org.apache.commons.lang3.concurrent.CallableBackgroundInitializer.<init>(CallableBackgroundInitializer.java:96)
	at org.apache.commons.lang3.concurrent.CallableBackgroundInitializerTest.testInitExecutor(CallableBackgroundInitializerTest.java:53)

Running org.apache.commons.lang3.concurrent.BackgroundInitializerTest
Tests run: 15, Failures: 0, Errors: 14, Skipped: 0, Time elapsed: 0.008 sec <<< FAILURE! - in org.apache.commons.lang3.concurrent.BackgroundInitializerTest
testGetCheckedException(org.apache.commons.lang3.concurrent.BackgroundInitializerTest)  Time elapsed: 0 sec  <<< ERROR!
java.lang.IllegalStateException: Cannot set ExecutorService after start()!
	at org.apache.commons.lang3.concurrent.BackgroundInitializer.setExternalExecutor(BackgroundInitializer.java:21)
	at org.apache.commons.lang3.concurrent.BackgroundInitializer.<init>(BackgroundInitializer.java:18)
	at org.apache.commons.lang3.concurrent.BackgroundInitializer.<init>(BackgroundInitializer.java:17)
	at org.apache.commons.lang3.concurrent.BackgroundInitializerTest$BackgroundInitializerTestImpl.<init>(BackgroundInitializerTest.java:295)
	at org.apache.commons.lang3.concurrent.BackgroundInitializerTest.testGetCheckedException(BackgroundInitializerTest.java:200)

testGetActiveExecutorExternal(org.apache.commons.lang3.concurrent.BackgroundInitializerTest)  Time elapsed: 0.001 sec  <<< ERROR!
java.lang.IllegalStateException: Cannot set ExecutorService after start()!
	at org.apache.commons.lang3.concurrent.BackgroundInitializer.setExternalExecutor(BackgroundInitializer.java:21)
	at org.apache.commons.lang3.concurrent.BackgroundInitializer.<init>(BackgroundInitializer.java:18)
	at org.apache.commons.lang3.concurrent.BackgroundInitializerTest$BackgroundInitializerTestImpl.<init>(BackgroundInitializerTest.java:299)
	at org.apache.commons.lang3.concurrent.BackgroundInitializerTest.testGetActiveExecutorExternal(BackgroundInitializerTest.java:74)

testGetRuntimeException(org.apache.commons.lang3.concurrent.BackgroundInitializerTest)  Time elapsed: 0 sec  <<< ERROR!
java.lang.IllegalStateException: Cannot set ExecutorService after start()!
	at org.apache.commons.lang3.concurrent.BackgroundInitializer.setExternalExecutor(BackgroundInitializer.java:21)
	at org.apache.commons.lang3.concurrent.BackgroundInitializer.<init>(BackgroundInitializer.java:18)
	at org.apache.commons.lang3.concurrent.BackgroundInitializer.<init>(BackgroundInitializer.java:17)
	at org.apache.commons.lang3.concurrent.BackgroundInitializerTest$BackgroundInitializerTestImpl.<init>(BackgroundInitializerTest.java:295)
	at org.apache.commons.lang3.concurrent.BackgroundInitializerTest.testGetRuntimeException(BackgroundInitializerTest.java:182)

testIsStartedFalse(org.apache.commons.lang3.concurrent.BackgroundInitializerTest)  Time elapsed: 0.001 sec  <<< ERROR!
java.lang.IllegalStateException: Cannot set ExecutorService after start()!
	at org.apache.commons.lang3.concurrent.BackgroundInitializer.setExternalExecutor(BackgroundInitializer.java:21)
	at org.apache.commons.lang3.concurrent.BackgroundInitializer.<init>(BackgroundInitializer.java:18)
	at org.apache.commons.lang3.concurrent.BackgroundInitializer.<init>(BackgroundInitializer.java:17)
	at org.apache.commons.lang3.concurrent.BackgroundInitializerTest$BackgroundInitializerTestImpl.<init>(BackgroundInitializerTest.java:295)
	at org.apache.commons.lang3.concurrent.BackgroundInitializerTest.testIsStartedFalse(BackgroundInitializerTest.java:254)

testIsStartedTrue(org.apache.commons.lang3.concurrent.BackgroundInitializerTest)  Time elapsed: 0 sec  <<< ERROR!
java.lang.IllegalStateException: Cannot set ExecutorService after start()!
	at org.apache.commons.lang3.concurrent.BackgroundInitializer.setExternalExecutor(BackgroundInitializer.java:21)
	at org.apache.commons.lang3.concurrent.BackgroundInitializer.<init>(BackgroundInitializer.java:18)
	at org.apache.commons.lang3.concurrent.BackgroundInitializer.<init>(BackgroundInitializer.java:17)
	at org.apache.commons.lang3.concurrent.BackgroundInitializerTest$BackgroundInitializerTestImpl.<init>(BackgroundInitializerTest.java:295)
	at org.apache.commons.lang3.concurrent.BackgroundInitializerTest.testIsStartedTrue(BackgroundInitializerTest.java:263)

testGetActiveExecutorTemp(org.apache.commons.lang3.concurrent.BackgroundInitializerTest)  Time elapsed: 0.001 sec  <<< ERROR!
java.lang.IllegalStateException: Cannot set ExecutorService after start()!
	at org.apache.commons.lang3.concurrent.BackgroundInitializer.setExternalExecutor(BackgroundInitializer.java:21)
	at org.apache.commons.lang3.concurrent.BackgroundInitializer.<init>(BackgroundInitializer.java:18)
	at org.apache.commons.lang3.concurrent.BackgroundInitializer.<init>(BackgroundInitializer.java:17)
	at org.apache.commons.lang3.concurrent.BackgroundInitializerTest$BackgroundInitializerTestImpl.<init>(BackgroundInitializerTest.java:295)
	at org.apache.commons.lang3.concurrent.BackgroundInitializerTest.testGetActiveExecutorTemp(BackgroundInitializerTest.java:90)

testSetExternalExecutorAfterStart(org.apache.commons.lang3.concurrent.BackgroundInitializerTest)  Time elapsed: 0 sec  <<< ERROR!
java.lang.IllegalStateException: Cannot set ExecutorService after start()!
	at org.apache.commons.lang3.concurrent.BackgroundInitializer.setExternalExecutor(BackgroundInitializer.java:21)
	at org.apache.commons.lang3.concurrent.BackgroundInitializer.<init>(BackgroundInitializer.java:18)
	at org.apache.commons.lang3.concurrent.BackgroundInitializer.<init>(BackgroundInitializer.java:17)
	at org.apache.commons.lang3.concurrent.BackgroundInitializerTest$BackgroundInitializerTestImpl.<init>(BackgroundInitializerTest.java:295)
	at org.apache.commons.lang3.concurrent.BackgroundInitializerTest.testSetExternalExecutorAfterStart(BackgroundInitializerTest.java:137)

testInitialize(org.apache.commons.lang3.concurrent.BackgroundInitializerTest)  Time elapsed: 0.001 sec  <<< ERROR!
java.lang.IllegalStateException: Cannot set ExecutorService after start()!
	at org.apache.commons.lang3.concurrent.BackgroundInitializer.setExternalExecutor(BackgroundInitializer.java:21)
	at org.apache.commons.lang3.concurrent.BackgroundInitializer.<init>(BackgroundInitializer.java:18)
	at org.apache.commons.lang3.concurrent.BackgroundInitializer.<init>(BackgroundInitializer.java:17)
	at org.apache.commons.lang3.concurrent.BackgroundInitializerTest$BackgroundInitializerTestImpl.<init>(BackgroundInitializerTest.java:295)
	at org.apache.commons.lang3.concurrent.BackgroundInitializerTest.testInitialize(BackgroundInitializerTest.java:52)

testIsStartedAfterGet(org.apache.commons.lang3.concurrent.BackgroundInitializerTest)  Time elapsed: 0 sec  <<< ERROR!
java.lang.IllegalStateException: Cannot set ExecutorService after start()!
	at org.apache.commons.lang3.concurrent.BackgroundInitializer.setExternalExecutor(BackgroundInitializer.java:21)
	at org.apache.commons.lang3.concurrent.BackgroundInitializer.<init>(BackgroundInitializer.java:18)
	at org.apache.commons.lang3.concurrent.BackgroundInitializer.<init>(BackgroundInitializer.java:17)
	at org.apache.commons.lang3.concurrent.BackgroundInitializerTest$BackgroundInitializerTestImpl.<init>(BackgroundInitializerTest.java:295)
	at org.apache.commons.lang3.concurrent.BackgroundInitializerTest.testIsStartedAfterGet(BackgroundInitializerTest.java:273)

testGetActiveExecutorBeforeStart(org.apache.commons.lang3.concurrent.BackgroundInitializerTest)  Time elapsed: 0.001 sec  <<< ERROR!
java.lang.IllegalStateException: Cannot set ExecutorService after start()!
	at org.apache.commons.lang3.concurrent.BackgroundInitializer.setExternalExecutor(BackgroundInitializer.java:21)
	at org.apache.commons.lang3.concurrent.BackgroundInitializer.<init>(BackgroundInitializer.java:18)
	at org.apache.commons.lang3.concurrent.BackgroundInitializer.<init>(BackgroundInitializer.java:17)
	at org.apache.commons.lang3.concurrent.BackgroundInitializerTest$BackgroundInitializerTestImpl.<init>(BackgroundInitializerTest.java:295)
	at org.apache.commons.lang3.concurrent.BackgroundInitializerTest.testGetActiveExecutorBeforeStart(BackgroundInitializerTest.java:63)

testStartMultipleTimes(org.apache.commons.lang3.concurrent.BackgroundInitializerTest)  Time elapsed: 0 sec  <<< ERROR!
java.lang.IllegalStateException: Cannot set ExecutorService after start()!
	at org.apache.commons.lang3.concurrent.BackgroundInitializer.setExternalExecutor(BackgroundInitializer.java:21)
	at org.apache.commons.lang3.concurrent.BackgroundInitializer.<init>(BackgroundInitializer.java:18)
	at org.apache.commons.lang3.concurrent.BackgroundInitializer.<init>(BackgroundInitializer.java:17)
	at org.apache.commons.lang3.concurrent.BackgroundInitializerTest$BackgroundInitializerTestImpl.<init>(BackgroundInitializerTest.java:295)
	at org.apache.commons.lang3.concurrent.BackgroundInitializerTest.testStartMultipleTimes(BackgroundInitializerTest.java:157)

testInitializeTempExecutor(org.apache.commons.lang3.concurrent.BackgroundInitializerTest)  Time elapsed: 0 sec  <<< ERROR!
java.lang.IllegalStateException: Cannot set ExecutorService after start()!
	at org.apache.commons.lang3.concurrent.BackgroundInitializer.setExternalExecutor(BackgroundInitializer.java:21)
	at org.apache.commons.lang3.concurrent.BackgroundInitializer.<init>(BackgroundInitializer.java:18)
	at org.apache.commons.lang3.concurrent.BackgroundInitializer.<init>(BackgroundInitializer.java:17)
	at org.apache.commons.lang3.concurrent.BackgroundInitializerTest$BackgroundInitializerTestImpl.<init>(BackgroundInitializerTest.java:295)
	at org.apache.commons.lang3.concurrent.BackgroundInitializerTest.testInitializeTempExecutor(BackgroundInitializerTest.java:102)

testGetInterruptedException(org.apache.commons.lang3.concurrent.BackgroundInitializerTest)  Time elapsed: 0 sec  <<< ERROR!
java.lang.IllegalStateException: Cannot set ExecutorService after start()!
	at org.apache.commons.lang3.concurrent.BackgroundInitializer.setExternalExecutor(BackgroundInitializer.java:21)
	at org.apache.commons.lang3.concurrent.BackgroundInitializer.<init>(BackgroundInitializer.java:18)
	at org.apache.commons.lang3.concurrent.BackgroundInitializerTest$BackgroundInitializerTestImpl.<init>(BackgroundInitializerTest.java:299)
	at org.apache.commons.lang3.concurrent.BackgroundInitializerTest.testGetInterruptedException(BackgroundInitializerTest.java:220)

testSetExternalExecutor(org.apache.commons.lang3.concurrent.BackgroundInitializerTest)  Time elapsed: 0.001 sec  <<< ERROR!
java.lang.IllegalStateException: Cannot set ExecutorService after start()!
	at org.apache.commons.lang3.concurrent.BackgroundInitializer.setExternalExecutor(BackgroundInitializer.java:21)
	at org.apache.commons.lang3.concurrent.BackgroundInitializer.<init>(BackgroundInitializer.java:18)
	at org.apache.commons.lang3.concurrent.BackgroundInitializer.<init>(BackgroundInitializer.java:17)
	at org.apache.commons.lang3.concurrent.BackgroundInitializerTest$BackgroundInitializerTestImpl.<init>(BackgroundInitializerTest.java:295)
	at org.apache.commons.lang3.concurrent.BackgroundInitializerTest.testSetExternalExecutor(BackgroundInitializerTest.java:117)

Running org.apache.commons.lang3.concurrent.LazyInitializerTest
Tests run: 3, Failures: 0, Errors: 0, Skipped: 0, Time elapsed: 0.008 sec - in org.apache.commons.lang3.concurrent.LazyInitializerTest
Running org.apache.commons.lang3.concurrent.BasicThreadFactoryTest
Tests run: 15, Failures: 0, Errors: 0, Skipped: 0, Time elapsed: 0.032 sec - in org.apache.commons.lang3.concurrent.BasicThreadFactoryTest
Running org.apache.commons.lang3.concurrent.ConstantInitializerTest
Tests run: 7, Failures: 0, Errors: 0, Skipped: 0, Time elapsed: 0.001 sec - in org.apache.commons.lang3.concurrent.ConstantInitializerTest
Running org.apache.commons.lang3.concurrent.MultiBackgroundInitializerTest
Tests run: 17, Failures: 0, Errors: 17, Skipped: 0, Time elapsed: 0.008 sec <<< FAILURE! - in org.apache.commons.lang3.concurrent.MultiBackgroundInitializerTest
testResultInitializerNamesModify(org.apache.commons.lang3.concurrent.MultiBackgroundInitializerTest)  Time elapsed: 0.001 sec  <<< ERROR!
java.lang.IllegalStateException: Cannot set ExecutorService after start()!
	at org.apache.commons.lang3.concurrent.BackgroundInitializer.setExternalExecutor(BackgroundInitializer.java:21)
	at org.apache.commons.lang3.concurrent.BackgroundInitializer.<init>(BackgroundInitializer.java:18)
	at org.apache.commons.lang3.concurrent.BackgroundInitializer.<init>(BackgroundInitializer.java:17)
	at org.apache.commons.lang3.concurrent.MultiBackgroundInitializer.<init>(MultiBackgroundInitializer.java:108)
	at org.apache.commons.lang3.concurrent.MultiBackgroundInitializerTest.setUp(MultiBackgroundInitializerTest.java:48)

testInitializeRuntimeEx(org.apache.commons.lang3.concurrent.MultiBackgroundInitializerTest)  Time elapsed: 0 sec  <<< ERROR!
java.lang.IllegalStateException: Cannot set ExecutorService after start()!
	at org.apache.commons.lang3.concurrent.BackgroundInitializer.setExternalExecutor(BackgroundInitializer.java:21)
	at org.apache.commons.lang3.concurrent.BackgroundInitializer.<init>(BackgroundInitializer.java:18)
	at org.apache.commons.lang3.concurrent.BackgroundInitializer.<init>(BackgroundInitializer.java:17)
	at org.apache.commons.lang3.concurrent.MultiBackgroundInitializer.<init>(MultiBackgroundInitializer.java:108)
	at org.apache.commons.lang3.concurrent.MultiBackgroundInitializerTest.setUp(MultiBackgroundInitializerTest.java:48)

testAddInitializerNullInit(org.apache.commons.lang3.concurrent.MultiBackgroundInitializerTest)  Time elapsed: 0.001 sec  <<< ERROR!
java.lang.IllegalStateException: Cannot set ExecutorService after start()!
	at org.apache.commons.lang3.concurrent.BackgroundInitializer.setExternalExecutor(BackgroundInitializer.java:21)
	at org.apache.commons.lang3.concurrent.BackgroundInitializer.<init>(BackgroundInitializer.java:18)
	at org.apache.commons.lang3.concurrent.BackgroundInitializer.<init>(BackgroundInitializer.java:17)
	at org.apache.commons.lang3.concurrent.MultiBackgroundInitializer.<init>(MultiBackgroundInitializer.java:108)
	at org.apache.commons.lang3.concurrent.MultiBackgroundInitializerTest.setUp(MultiBackgroundInitializerTest.java:48)

testAddInitializerNullName(org.apache.commons.lang3.concurrent.MultiBackgroundInitializerTest)  Time elapsed: 0 sec  <<< ERROR!
java.lang.IllegalStateException: Cannot set ExecutorService after start()!
	at org.apache.commons.lang3.concurrent.BackgroundInitializer.setExternalExecutor(BackgroundInitializer.java:21)
	at org.apache.commons.lang3.concurrent.BackgroundInitializer.<init>(BackgroundInitializer.java:18)
	at org.apache.commons.lang3.concurrent.BackgroundInitializer.<init>(BackgroundInitializer.java:17)
	at org.apache.commons.lang3.concurrent.MultiBackgroundInitializer.<init>(MultiBackgroundInitializer.java:108)
	at org.apache.commons.lang3.concurrent.MultiBackgroundInitializerTest.setUp(MultiBackgroundInitializerTest.java:48)

testInitializeResultsIsSuccessfulTrue(org.apache.commons.lang3.concurrent.MultiBackgroundInitializerTest)  Time elapsed: 0.001 sec  <<< ERROR!
java.lang.IllegalStateException: Cannot set ExecutorService after start()!
	at org.apache.commons.lang3.concurrent.BackgroundInitializer.setExternalExecutor(BackgroundInitializer.java:21)
	at org.apache.commons.lang3.concurrent.BackgroundInitializer.<init>(BackgroundInitializer.java:18)
	at org.apache.commons.lang3.concurrent.BackgroundInitializer.<init>(BackgroundInitializer.java:17)
	at org.apache.commons.lang3.concurrent.MultiBackgroundInitializer.<init>(MultiBackgroundInitializer.java:108)
	at org.apache.commons.lang3.concurrent.MultiBackgroundInitializerTest.setUp(MultiBackgroundInitializerTest.java:48)

testResultGetExceptionUnknown(org.apache.commons.lang3.concurrent.MultiBackgroundInitializerTest)  Time elapsed: 0 sec  <<< ERROR!
java.lang.IllegalStateException: Cannot set ExecutorService after start()!
	at org.apache.commons.lang3.concurrent.BackgroundInitializer.setExternalExecutor(BackgroundInitializer.java:21)
	at org.apache.commons.lang3.concurrent.BackgroundInitializer.<init>(BackgroundInitializer.java:18)
	at org.apache.commons.lang3.concurrent.BackgroundInitializer.<init>(BackgroundInitializer.java:17)
	at org.apache.commons.lang3.concurrent.MultiBackgroundInitializer.<init>(MultiBackgroundInitializer.java:108)
	at org.apache.commons.lang3.concurrent.MultiBackgroundInitializerTest.setUp(MultiBackgroundInitializerTest.java:48)

testInitializeNested(org.apache.commons.lang3.concurrent.MultiBackgroundInitializerTest)  Time elapsed: 0 sec  <<< ERROR!
java.lang.IllegalStateException: Cannot set ExecutorService after start()!
	at org.apache.commons.lang3.concurrent.BackgroundInitializer.setExternalExecutor(BackgroundInitializer.java:21)
	at org.apache.commons.lang3.concurrent.BackgroundInitializer.<init>(BackgroundInitializer.java:18)
	at org.apache.commons.lang3.concurrent.BackgroundInitializer.<init>(BackgroundInitializer.java:17)
	at org.apache.commons.lang3.concurrent.MultiBackgroundInitializer.<init>(MultiBackgroundInitializer.java:108)
	at org.apache.commons.lang3.concurrent.MultiBackgroundInitializerTest.setUp(MultiBackgroundInitializerTest.java:48)

testInitializeTempExec(org.apache.commons.lang3.concurrent.MultiBackgroundInitializerTest)  Time elapsed: 0.001 sec  <<< ERROR!
java.lang.IllegalStateException: Cannot set ExecutorService after start()!
	at org.apache.commons.lang3.concurrent.BackgroundInitializer.setExternalExecutor(BackgroundInitializer.java:21)
	at org.apache.commons.lang3.concurrent.BackgroundInitializer.<init>(BackgroundInitializer.java:18)
	at org.apache.commons.lang3.concurrent.BackgroundInitializer.<init>(BackgroundInitializer.java:17)
	at org.apache.commons.lang3.concurrent.MultiBackgroundInitializer.<init>(MultiBackgroundInitializer.java:108)
	at org.apache.commons.lang3.concurrent.MultiBackgroundInitializerTest.setUp(MultiBackgroundInitializerTest.java:48)

testInitializeEx(org.apache.commons.lang3.concurrent.MultiBackgroundInitializerTest)  Time elapsed: 0 sec  <<< ERROR!
java.lang.IllegalStateException: Cannot set ExecutorService after start()!
	at org.apache.commons.lang3.concurrent.BackgroundInitializer.setExternalExecutor(BackgroundInitializer.java:21)
	at org.apache.commons.lang3.concurrent.BackgroundInitializer.<init>(BackgroundInitializer.java:18)
	at org.apache.commons.lang3.concurrent.BackgroundInitializer.<init>(BackgroundInitializer.java:17)
	at org.apache.commons.lang3.concurrent.MultiBackgroundInitializer.<init>(MultiBackgroundInitializer.java:108)
	at org.apache.commons.lang3.concurrent.MultiBackgroundInitializerTest.setUp(MultiBackgroundInitializerTest.java:48)

testResultGetInitializerUnknown(org.apache.commons.lang3.concurrent.MultiBackgroundInitializerTest)  Time elapsed: 0.001 sec  <<< ERROR!
java.lang.IllegalStateException: Cannot set ExecutorService after start()!
	at org.apache.commons.lang3.concurrent.BackgroundInitializer.setExternalExecutor(BackgroundInitializer.java:21)
	at org.apache.commons.lang3.concurrent.BackgroundInitializer.<init>(BackgroundInitializer.java:18)
	at org.apache.commons.lang3.concurrent.BackgroundInitializer.<init>(BackgroundInitializer.java:17)
	at org.apache.commons.lang3.concurrent.MultiBackgroundInitializer.<init>(MultiBackgroundInitializer.java:108)
	at org.apache.commons.lang3.concurrent.MultiBackgroundInitializerTest.setUp(MultiBackgroundInitializerTest.java:48)

testInitializeResultsIsSuccessfulFalse(org.apache.commons.lang3.concurrent.MultiBackgroundInitializerTest)  Time elapsed: 0 sec  <<< ERROR!
java.lang.IllegalStateException: Cannot set ExecutorService after start()!
	at org.apache.commons.lang3.concurrent.BackgroundInitializer.setExternalExecutor(BackgroundInitializer.java:21)
	at org.apache.commons.lang3.concurrent.BackgroundInitializer.<init>(BackgroundInitializer.java:18)
	at org.apache.commons.lang3.concurrent.BackgroundInitializer.<init>(BackgroundInitializer.java:17)
	at org.apache.commons.lang3.concurrent.MultiBackgroundInitializer.<init>(MultiBackgroundInitializer.java:108)
	at org.apache.commons.lang3.concurrent.MultiBackgroundInitializerTest.setUp(MultiBackgroundInitializerTest.java:48)

testInitializeNoChildren(org.apache.commons.lang3.concurrent.MultiBackgroundInitializerTest)  Time elapsed: 0 sec  <<< ERROR!
java.lang.IllegalStateException: Cannot set ExecutorService after start()!
	at org.apache.commons.lang3.concurrent.BackgroundInitializer.setExternalExecutor(BackgroundInitializer.java:21)
	at org.apache.commons.lang3.concurrent.BackgroundInitializer.<init>(BackgroundInitializer.java:18)
	at org.apache.commons.lang3.concurrent.BackgroundInitializer.<init>(BackgroundInitializer.java:17)
	at org.apache.commons.lang3.concurrent.MultiBackgroundInitializer.<init>(MultiBackgroundInitializer.java:108)
	at org.apache.commons.lang3.concurrent.MultiBackgroundInitializerTest.setUp(MultiBackgroundInitializerTest.java:48)

testInitializeChildWithExecutor(org.apache.commons.lang3.concurrent.MultiBackgroundInitializerTest)  Time elapsed: 0.001 sec  <<< ERROR!
java.lang.IllegalStateException: Cannot set ExecutorService after start()!
	at org.apache.commons.lang3.concurrent.BackgroundInitializer.setExternalExecutor(BackgroundInitializer.java:21)
	at org.apache.commons.lang3.concurrent.BackgroundInitializer.<init>(BackgroundInitializer.java:18)
	at org.apache.commons.lang3.concurrent.BackgroundInitializer.<init>(BackgroundInitializer.java:17)
	at org.apache.commons.lang3.concurrent.MultiBackgroundInitializer.<init>(MultiBackgroundInitializer.java:108)
	at org.apache.commons.lang3.concurrent.MultiBackgroundInitializerTest.setUp(MultiBackgroundInitializerTest.java:48)

testInitializeExternalExec(org.apache.commons.lang3.concurrent.MultiBackgroundInitializerTest)  Time elapsed: 0 sec  <<< ERROR!
java.lang.IllegalStateException: Cannot set ExecutorService after start()!
	at org.apache.commons.lang3.concurrent.BackgroundInitializer.setExternalExecutor(BackgroundInitializer.java:21)
	at org.apache.commons.lang3.concurrent.BackgroundInitializer.<init>(BackgroundInitializer.java:18)
	at org.apache.commons.lang3.concurrent.BackgroundInitializer.<init>(BackgroundInitializer.java:17)
	at org.apache.commons.lang3.concurrent.MultiBackgroundInitializer.<init>(MultiBackgroundInitializer.java:108)
	at org.apache.commons.lang3.concurrent.MultiBackgroundInitializerTest.setUp(MultiBackgroundInitializerTest.java:48)

testAddInitializerAfterStart(org.apache.commons.lang3.concurrent.MultiBackgroundInitializerTest)  Time elapsed: 0.001 sec  <<< ERROR!
java.lang.IllegalStateException: Cannot set ExecutorService after start()!
	at org.apache.commons.lang3.concurrent.BackgroundInitializer.setExternalExecutor(BackgroundInitializer.java:21)
	at org.apache.commons.lang3.concurrent.BackgroundInitializer.<init>(BackgroundInitializer.java:18)
	at org.apache.commons.lang3.concurrent.BackgroundInitializer.<init>(BackgroundInitializer.java:17)
	at org.apache.commons.lang3.concurrent.MultiBackgroundInitializer.<init>(MultiBackgroundInitializer.java:108)
	at org.apache.commons.lang3.concurrent.MultiBackgroundInitializerTest.setUp(MultiBackgroundInitializerTest.java:48)

testResultGetResultObjectUnknown(org.apache.commons.lang3.concurrent.MultiBackgroundInitializerTest)  Time elapsed: 0.001 sec  <<< ERROR!
java.lang.IllegalStateException: Cannot set ExecutorService after start()!
	at org.apache.commons.lang3.concurrent.BackgroundInitializer.setExternalExecutor(BackgroundInitializer.java:21)
	at org.apache.commons.lang3.concurrent.BackgroundInitializer.<init>(BackgroundInitializer.java:18)
	at org.apache.commons.lang3.concurrent.BackgroundInitializer.<init>(BackgroundInitializer.java:17)
	at org.apache.commons.lang3.concurrent.MultiBackgroundInitializer.<init>(MultiBackgroundInitializer.java:108)
	at org.apache.commons.lang3.concurrent.MultiBackgroundInitializerTest.setUp(MultiBackgroundInitializerTest.java:48)

testResultIsExceptionUnknown(org.apache.commons.lang3.concurrent.MultiBackgroundInitializerTest)  Time elapsed: 0 sec  <<< ERROR!
java.lang.IllegalStateException: Cannot set ExecutorService after start()!
	at org.apache.commons.lang3.concurrent.BackgroundInitializer.setExternalExecutor(BackgroundInitializer.java:21)
	at org.apache.commons.lang3.concurrent.BackgroundInitializer.<init>(BackgroundInitializer.java:18)
	at org.apache.commons.lang3.concurrent.BackgroundInitializer.<init>(BackgroundInitializer.java:17)
	at org.apache.commons.lang3.concurrent.MultiBackgroundInitializer.<init>(MultiBackgroundInitializer.java:108)
	at org.apache.commons.lang3.concurrent.MultiBackgroundInitializerTest.setUp(MultiBackgroundInitializerTest.java:48)

Running org.apache.commons.lang3.concurrent.AtomicSafeInitializerTest
Tests run: 4, Failures: 0, Errors: 0, Skipped: 0, Time elapsed: 0.009 sec - in org.apache.commons.lang3.concurrent.AtomicSafeInitializerTest
Running org.apache.commons.lang3.concurrent.ConcurrentUtilsTest
Tests run: 40, Failures: 0, Errors: 0, Skipped: 0, Time elapsed: 0.011 sec - in org.apache.commons.lang3.concurrent.ConcurrentUtilsTest
Running org.apache.commons.lang3.concurrent.TimedSemaphoreTest
Tests run: 15, Failures: 0, Errors: 0, Skipped: 0, Time elapsed: 1.191 sec - in org.apache.commons.lang3.concurrent.TimedSemaphoreTest
Running org.apache.commons.lang3.StringUtilsSubstringTest
Tests run: 14, Failures: 0, Errors: 0, Skipped: 0, Time elapsed: 0.006 sec - in org.apache.commons.lang3.StringUtilsSubstringTest
Running org.apache.commons.lang3.SystemUtilsTest
Tests run: 12, Failures: 0, Errors: 0, Skipped: 0, Time elapsed: 0.002 sec - in org.apache.commons.lang3.SystemUtilsTest
Running org.apache.commons.lang3.CharRangeTest
Tests run: 16, Failures: 0, Errors: 0, Skipped: 0, Time elapsed: 0.033 sec - in org.apache.commons.lang3.CharRangeTest
Running org.apache.commons.lang3.CharSetTest
Tests run: 14, Failures: 0, Errors: 0, Skipped: 0, Time elapsed: 0.008 sec - in org.apache.commons.lang3.CharSetTest
Running org.apache.commons.lang3.StringUtilsStartsEndsWithTest
Tests run: 6, Failures: 0, Errors: 0, Skipped: 0, Time elapsed: 0.003 sec - in org.apache.commons.lang3.StringUtilsStartsEndsWithTest
Running org.apache.commons.lang3.RandomStringUtilsTest
Tests run: 11, Failures: 0, Errors: 0, Skipped: 0, Time elapsed: 0.034 sec - in org.apache.commons.lang3.RandomStringUtilsTest
Running org.apache.commons.lang3.SerializationUtilsTest
Tests run: 26, Failures: 0, Errors: 0, Skipped: 0, Time elapsed: 0.049 sec - in org.apache.commons.lang3.SerializationUtilsTest
Running org.apache.commons.lang3.time.StopWatchTest
Tests run: 8, Failures: 0, Errors: 0, Skipped: 0, Time elapsed: 4.763 sec - in org.apache.commons.lang3.time.StopWatchTest
Running org.apache.commons.lang3.time.DateUtilsRoundingTest
Tests run: 22, Failures: 0, Errors: 0, Skipped: 0, Time elapsed: 0.156 sec - in org.apache.commons.lang3.time.DateUtilsRoundingTest
Running org.apache.commons.lang3.time.FastDateParserTest
Tests run: 33, Failures: 0, Errors: 0, Skipped: 0, Time elapsed: 2.063 sec - in org.apache.commons.lang3.time.FastDateParserTest
Running org.apache.commons.lang3.time.FastDateFormat_ParserTest
Tests run: 33, Failures: 0, Errors: 0, Skipped: 0, Time elapsed: 0.728 sec - in org.apache.commons.lang3.time.FastDateFormat_ParserTest
Running org.apache.commons.lang3.time.DurationFormatUtilsTest
Tests run: 25, Failures: 0, Errors: 0, Skipped: 0, Time elapsed: 0.473 sec - in org.apache.commons.lang3.time.DurationFormatUtilsTest
Running org.apache.commons.lang3.time.DateFormatUtilsTest
Tests run: 10, Failures: 0, Errors: 0, Skipped: 0, Time elapsed: 0 sec - in org.apache.commons.lang3.time.DateFormatUtilsTest
Running org.apache.commons.lang3.time.DateUtilsFragmentTest
Tests run: 57, Failures: 0, Errors: 0, Skipped: 0, Time elapsed: 0.01 sec - in org.apache.commons.lang3.time.DateUtilsFragmentTest
Running org.apache.commons.lang3.time.FastDatePrinterTimeZonesTest
Tests run: 617, Failures: 0, Errors: 0, Skipped: 0, Time elapsed: 0.209 sec - in org.apache.commons.lang3.time.FastDatePrinterTimeZonesTest
Running org.apache.commons.lang3.time.FastDateFormatTest
>>FastDateFormatTest: FastDateParser:38388  SimpleDateFormat:3541
Tests run: 14, Failures: 0, Errors: 0, Skipped: 0, Time elapsed: 4.511 sec - in org.apache.commons.lang3.time.FastDateFormatTest
Running org.apache.commons.lang3.time.FastDateFormat_PrinterTest
Tests run: 17, Failures: 0, Errors: 0, Skipped: 0, Time elapsed: 0.01 sec - in org.apache.commons.lang3.time.FastDateFormat_PrinterTest
Running org.apache.commons.lang3.time.FastDatePrinterTest
Tests run: 17, Failures: 0, Errors: 0, Skipped: 0, Time elapsed: 0.003 sec - in org.apache.commons.lang3.time.FastDatePrinterTest
Running org.apache.commons.lang3.time.FastDateParserSDFTest
Tests run: 276, Failures: 0, Errors: 0, Skipped: 92, Time elapsed: 0.062 sec - in org.apache.commons.lang3.time.FastDateParserSDFTest
Running org.apache.commons.lang3.time.DateUtilsTest
DateUtilsTest: Default Locale=en_US
Tests run: 38, Failures: 0, Errors: 0, Skipped: 0, Time elapsed: 0.025 sec - in org.apache.commons.lang3.time.DateUtilsTest
Running org.apache.commons.lang3.reflect.InheritanceUtilsTest
Tests run: 9, Failures: 0, Errors: 0, Skipped: 0, Time elapsed: 0.001 sec - in org.apache.commons.lang3.reflect.InheritanceUtilsTest
Running org.apache.commons.lang3.reflect.MethodUtilsTest
Tests run: 23, Failures: 0, Errors: 0, Skipped: 0, Time elapsed: 0.026 sec - in org.apache.commons.lang3.reflect.MethodUtilsTest
Running org.apache.commons.lang3.reflect.ConstructorUtilsTest
Tests run: 7, Failures: 0, Errors: 0, Skipped: 0, Time elapsed: 0.002 sec - in org.apache.commons.lang3.reflect.ConstructorUtilsTest
Running org.apache.commons.lang3.reflect.FieldUtilsTest
Tests run: 64, Failures: 0, Errors: 0, Skipped: 0, Time elapsed: 0.02 sec - in org.apache.commons.lang3.reflect.FieldUtilsTest
Running org.apache.commons.lang3.reflect.TypeLiteralTest
Tests run: 4, Failures: 0, Errors: 0, Skipped: 0, Time elapsed: 0.005 sec - in org.apache.commons.lang3.reflect.TypeLiteralTest
Running org.apache.commons.lang3.reflect.TypeUtilsTest
Tests run: 19, Failures: 0, Errors: 0, Skipped: 0, Time elapsed: 0.045 sec - in org.apache.commons.lang3.reflect.TypeUtilsTest
Running org.apache.commons.lang3.mutable.MutableByteTest
Tests run: 17, Failures: 0, Errors: 0, Skipped: 0, Time elapsed: 0.003 sec - in org.apache.commons.lang3.mutable.MutableByteTest
Running org.apache.commons.lang3.mutable.MutableShortTest
Tests run: 14, Failures: 0, Errors: 0, Skipped: 0, Time elapsed: 0.002 sec - in org.apache.commons.lang3.mutable.MutableShortTest
Running org.apache.commons.lang3.mutable.MutableIntTest
Tests run: 17, Failures: 0, Errors: 0, Skipped: 0, Time elapsed: 0.003 sec - in org.apache.commons.lang3.mutable.MutableIntTest
Running org.apache.commons.lang3.mutable.MutableDoubleTest
Tests run: 18, Failures: 0, Errors: 0, Skipped: 0, Time elapsed: 0.003 sec - in org.apache.commons.lang3.mutable.MutableDoubleTest
Running org.apache.commons.lang3.mutable.MutableFloatTest
Tests run: 18, Failures: 0, Errors: 0, Skipped: 0, Time elapsed: 0.003 sec - in org.apache.commons.lang3.mutable.MutableFloatTest
Running org.apache.commons.lang3.mutable.MutableLongTest
Tests run: 17, Failures: 0, Errors: 0, Skipped: 0, Time elapsed: 0.003 sec - in org.apache.commons.lang3.mutable.MutableLongTest
Running org.apache.commons.lang3.mutable.MutableBooleanTest
Tests run: 9, Failures: 0, Errors: 0, Skipped: 0, Time elapsed: 0.001 sec - in org.apache.commons.lang3.mutable.MutableBooleanTest
Running org.apache.commons.lang3.mutable.MutableObjectTest
Tests run: 5, Failures: 0, Errors: 0, Skipped: 0, Time elapsed: 0.001 sec - in org.apache.commons.lang3.mutable.MutableObjectTest
Running org.apache.commons.lang3.text.translate.UnicodeEscaperTest
Tests run: 3, Failures: 0, Errors: 0, Skipped: 0, Time elapsed: 0 sec - in org.apache.commons.lang3.text.translate.UnicodeEscaperTest
Running org.apache.commons.lang3.text.translate.EntityArraysTest
Tests run: 3, Failures: 0, Errors: 0, Skipped: 0, Time elapsed: 0 sec - in org.apache.commons.lang3.text.translate.EntityArraysTest
Running org.apache.commons.lang3.text.translate.UnicodeUnpairedSurrogateRemoverTest
Tests run: 2, Failures: 0, Errors: 0, Skipped: 0, Time elapsed: 0 sec - in org.apache.commons.lang3.text.translate.UnicodeUnpairedSurrogateRemoverTest
Running org.apache.commons.lang3.text.translate.NumericEntityUnescaperTest
Tests run: 3, Failures: 0, Errors: 0, Skipped: 0, Time elapsed: 0.001 sec - in org.apache.commons.lang3.text.translate.NumericEntityUnescaperTest
Running org.apache.commons.lang3.text.translate.NumericEntityEscaperTest
Tests run: 4, Failures: 0, Errors: 0, Skipped: 0, Time elapsed: 0.001 sec - in org.apache.commons.lang3.text.translate.NumericEntityEscaperTest
Running org.apache.commons.lang3.text.translate.LookupTranslatorTest
Tests run: 2, Failures: 0, Errors: 0, Skipped: 0, Time elapsed: 0 sec - in org.apache.commons.lang3.text.translate.LookupTranslatorTest
Running org.apache.commons.lang3.text.translate.UnicodeUnescaperTest
Tests run: 3, Failures: 0, Errors: 0, Skipped: 0, Time elapsed: 0 sec - in org.apache.commons.lang3.text.translate.UnicodeUnescaperTest
Running org.apache.commons.lang3.text.translate.OctalUnescaperTest
Tests run: 1, Failures: 0, Errors: 0, Skipped: 0, Time elapsed: 0 sec - in org.apache.commons.lang3.text.translate.OctalUnescaperTest
Running org.apache.commons.lang3.text.StrMatcherTest
Tests run: 14, Failures: 0, Errors: 0, Skipped: 0, Time elapsed: 0.002 sec - in org.apache.commons.lang3.text.StrMatcherTest
Running org.apache.commons.lang3.text.StrTokenizerTest
Tests run: 55, Failures: 0, Errors: 0, Skipped: 0, Time elapsed: 0.01 sec - in org.apache.commons.lang3.text.StrTokenizerTest
Running org.apache.commons.lang3.text.FormattableUtilsTest
Tests run: 5, Failures: 0, Errors: 0, Skipped: 0, Time elapsed: 0 sec - in org.apache.commons.lang3.text.FormattableUtilsTest
Running org.apache.commons.lang3.text.CompositeFormatTest
Tests run: 2, Failures: 0, Errors: 0, Skipped: 0, Time elapsed: 0.001 sec - in org.apache.commons.lang3.text.CompositeFormatTest
Running org.apache.commons.lang3.text.WordUtilsTest
Tests run: 12, Failures: 0, Errors: 0, Skipped: 0, Time elapsed: 0.002 sec - in org.apache.commons.lang3.text.WordUtilsTest
Running org.apache.commons.lang3.text.StrLookupTest
Tests run: 5, Failures: 0, Errors: 0, Skipped: 0, Time elapsed: 0.003 sec - in org.apache.commons.lang3.text.StrLookupTest
Running org.apache.commons.lang3.text.StrBuilderAppendInsertTest
Tests run: 51, Failures: 0, Errors: 0, Skipped: 0, Time elapsed: 0.008 sec - in org.apache.commons.lang3.text.StrBuilderAppendInsertTest
Running org.apache.commons.lang3.text.ExtendedMessageFormatTest
Tests run: 10, Failures: 0, Errors: 0, Skipped: 0, Time elapsed: 0.788 sec - in org.apache.commons.lang3.text.ExtendedMessageFormatTest
Running org.apache.commons.lang3.text.StrSubstitutorTest
Tests run: 40, Failures: 0, Errors: 0, Skipped: 0, Time elapsed: 0.036 sec - in org.apache.commons.lang3.text.StrSubstitutorTest
Running org.apache.commons.lang3.text.StrBuilderTest
Tests run: 90, Failures: 0, Errors: 0, Skipped: 0, Time elapsed: 0.048 sec - in org.apache.commons.lang3.text.StrBuilderTest
Running org.apache.commons.lang3.StringEscapeUtilsTest
Tests run: 28, Failures: 0, Errors: 0, Skipped: 0, Time elapsed: 0.356 sec - in org.apache.commons.lang3.StringEscapeUtilsTest
Running org.apache.commons.lang3.AnnotationUtilsTest
Tests run: 10, Failures: 0, Errors: 0, Skipped: 0, Time elapsed: 0.026 sec - in org.apache.commons.lang3.AnnotationUtilsTest
Running org.apache.commons.lang3.ConversionTest
Tests run: 42, Failures: 0, Errors: 0, Skipped: 0, Time elapsed: 0.009 sec - in org.apache.commons.lang3.ConversionTest
Running org.apache.commons.lang3.StringUtilsTrimEmptyTest
Tests run: 15, Failures: 0, Errors: 0, Skipped: 0, Time elapsed: 0.006 sec - in org.apache.commons.lang3.StringUtilsTrimEmptyTest
Running org.apache.commons.lang3.EnumUtilsTest
Tests run: 34, Failures: 0, Errors: 0, Skipped: 0, Time elapsed: 0.01 sec - in org.apache.commons.lang3.EnumUtilsTest
Running org.apache.commons.lang3.exception.ExceptionUtilsTest
Tests run: 28, Failures: 0, Errors: 0, Skipped: 0, Time elapsed: 0.019 sec - in org.apache.commons.lang3.exception.ExceptionUtilsTest
Running org.apache.commons.lang3.exception.DefaultExceptionContextTest
Tests run: 8, Failures: 0, Errors: 0, Skipped: 0, Time elapsed: 0.003 sec - in org.apache.commons.lang3.exception.DefaultExceptionContextTest
Running org.apache.commons.lang3.exception.ContextedExceptionTest
Tests run: 14, Failures: 0, Errors: 0, Skipped: 0, Time elapsed: 0.01 sec - in org.apache.commons.lang3.exception.ContextedExceptionTest
Running org.apache.commons.lang3.exception.ContextedRuntimeExceptionTest
Tests run: 14, Failures: 0, Errors: 0, Skipped: 0, Time elapsed: 0.01 sec - in org.apache.commons.lang3.exception.ContextedRuntimeExceptionTest
Running org.apache.commons.lang3.BitFieldTest
Tests run: 15, Failures: 0, Errors: 0, Skipped: 0, Time elapsed: 0.002 sec - in org.apache.commons.lang3.BitFieldTest
Running org.apache.commons.lang3.ArrayUtilsRemoveMultipleTest
Tests run: 55, Failures: 0, Errors: 0, Skipped: 0, Time elapsed: 0.01 sec - in org.apache.commons.lang3.ArrayUtilsRemoveMultipleTest
Running org.apache.commons.lang3.HashSetvBitSetTest
Ratio=10% array=100 count=1 extract=12568596 bitset=1263921
Ratio=7% array=100 count=10 extract=16750412 bitset=1226558
Ratio=4% array=100 count=50 extract=24251152 bitset=1113188
Ratio=4% array=100 count=100 extract=9836900 bitset=464674
Ratio=83% array=1000 count=10 extract=5509950 bitset=4590563
Ratio=56% array=1000 count=100 extract=21123246 bitset=11912128
Ratio=6% array=1000 count=500 extract=41719857 bitset=2896588
Ratio=1% array=1000 count=1000 extract=69230560 bitset=730218
Ratio=89% count=0 hash=2878088 bits=2562704
Ratio=5% count=5 hash=4094320 bits=213757
Ratio=10% count=10 hash=2767180 bits=302325
Ratio=22% count=200 hash=18502575 bits=4203049
Ratio=12% count=50 hash=9117249 bits=1133046
Ratio=27% count=100 hash=8241649 bits=2282621
Ratio=22% count=1000 hash=72619984 bits=16565513
Ratio=21% count=2000 hash=143339935 bits=30657011
Tests run: 2, Failures: 0, Errors: 0, Skipped: 0, Time elapsed: 0.642 sec - in org.apache.commons.lang3.HashSetvBitSetTest
Running org.apache.commons.lang3.StringUtilsTest
Tests run: 124, Failures: 0, Errors: 0, Skipped: 0, Time elapsed: 0.178 sec - in org.apache.commons.lang3.StringUtilsTest
Running org.apache.commons.lang3.ArrayUtilsRemoveTest
Tests run: 19, Failures: 0, Errors: 0, Skipped: 0, Time elapsed: 0.001 sec - in org.apache.commons.lang3.ArrayUtilsRemoveTest
Running org.apache.commons.lang3.ObjectUtilsTest
Tests run: 36, Failures: 0, Errors: 0, Skipped: 0, Time elapsed: 0.023 sec - in org.apache.commons.lang3.ObjectUtilsTest
Running org.apache.commons.lang3.ClassPathUtilsTest
Tests run: 13, Failures: 0, Errors: 0, Skipped: 0, Time elapsed: 0.001 sec - in org.apache.commons.lang3.ClassPathUtilsTest
Running org.apache.commons.lang3.math.NumberUtilsTest
Tests run: 91, Failures: 0, Errors: 0, Skipped: 0, Time elapsed: 0.034 sec - in org.apache.commons.lang3.math.NumberUtilsTest
Running org.apache.commons.lang3.math.IEEE754rUtilsTest
Tests run: 3, Failures: 0, Errors: 0, Skipped: 0, Time elapsed: 0 sec - in org.apache.commons.lang3.math.IEEE754rUtilsTest
Running org.apache.commons.lang3.math.FractionTest
Tests run: 25, Failures: 0, Errors: 0, Skipped: 0, Time elapsed: 0.094 sec - in org.apache.commons.lang3.math.FractionTest
Running org.apache.commons.lang3.BooleanUtilsTest
Tests run: 72, Failures: 0, Errors: 0, Skipped: 0, Time elapsed: 0.015 sec - in org.apache.commons.lang3.BooleanUtilsTest
Running org.apache.commons.lang3.CharSequenceUtilsTest
Tests run: 2, Failures: 0, Errors: 0, Skipped: 0, Time elapsed: 0 sec - in org.apache.commons.lang3.CharSequenceUtilsTest
Running org.apache.commons.lang3.CharSetUtilsTest
Tests run: 11, Failures: 0, Errors: 0, Skipped: 0, Time elapsed: 0.002 sec - in org.apache.commons.lang3.CharSetUtilsTest
Running org.apache.commons.lang3.ArrayUtilsAddTest
Tests run: 13, Failures: 0, Errors: 0, Skipped: 0, Time elapsed: 0.003 sec - in org.apache.commons.lang3.ArrayUtilsAddTest
Running org.apache.commons.lang3.CharEncodingTest
Tests run: 6, Failures: 0, Errors: 0, Skipped: 0, Time elapsed: 0.034 sec - in org.apache.commons.lang3.CharEncodingTest
Running org.apache.commons.lang3.ClassUtilsTest
Tests run: 57, Failures: 0, Errors: 0, Skipped: 0, Time elapsed: 0.03 sec - in org.apache.commons.lang3.ClassUtilsTest
Running org.apache.commons.lang3.RangeTest
Tests run: 24, Failures: 0, Errors: 0, Skipped: 0, Time elapsed: 0.008 sec - in org.apache.commons.lang3.RangeTest
Running org.apache.commons.lang3.event.EventUtilsTest
Tests run: 8, Failures: 0, Errors: 0, Skipped: 0, Time elapsed: 0.016 sec - in org.apache.commons.lang3.event.EventUtilsTest
Running org.apache.commons.lang3.event.EventListenerSupportTest
Tests run: 9, Failures: 0, Errors: 0, Skipped: 0, Time elapsed: 0.02 sec - in org.apache.commons.lang3.event.EventListenerSupportTest
Running org.apache.commons.lang3.ArrayUtilsTest
Tests run: 205, Failures: 0, Errors: 0, Skipped: 0, Time elapsed: 0.036 sec - in org.apache.commons.lang3.ArrayUtilsTest
Running org.apache.commons.lang3.CharUtilsTest
Tests run: 24, Failures: 0, Errors: 0, Skipped: 0, Time elapsed: 0.001 sec - in org.apache.commons.lang3.CharUtilsTest
Running org.apache.commons.lang3.NotImplementedExceptionTest
Tests run: 1, Failures: 0, Errors: 0, Skipped: 0, Time elapsed: 0 sec - in org.apache.commons.lang3.NotImplementedExceptionTest
Running org.apache.commons.lang3.StringUtilsEqualsIndexOfTest
Tests run: 50, Failures: 0, Errors: 0, Skipped: 0, Time elapsed: 0.002 sec - in org.apache.commons.lang3.StringUtilsEqualsIndexOfTest
Running org.apache.commons.lang3.RandomUtilsTest
Tests run: 23, Failures: 0, Errors: 0, Skipped: 0, Time elapsed: 0 sec - in org.apache.commons.lang3.RandomUtilsTest

Results :


Tests in error: 
  BackgroundInitializerTest.testGetActiveExecutorBeforeStart:63 » IllegalState C...
  BackgroundInitializerTest.testGetActiveExecutorExternal:74 » IllegalState Cann...
  BackgroundInitializerTest.testGetActiveExecutorTemp:90 » IllegalState Cannot s...
  BackgroundInitializerTest.testGetCheckedException:200 » IllegalState Cannot se...
  BackgroundInitializerTest.testGetInterruptedException:220 » IllegalState Canno...
  BackgroundInitializerTest.testGetRuntimeException:182 » IllegalState Cannot se...
  BackgroundInitializerTest.testInitialize:52 » IllegalState Cannot set Executor...
  BackgroundInitializerTest.testInitializeTempExecutor:102 » IllegalState Cannot...
  BackgroundInitializerTest.testIsStartedAfterGet:273 » IllegalState Cannot set ...
  BackgroundInitializerTest.testIsStartedFalse:254 » IllegalState Cannot set Exe...
  BackgroundInitializerTest.testIsStartedTrue:263 » IllegalState Cannot set Exec...
  BackgroundInitializerTest.testSetExternalExecutor:117 » IllegalState Cannot se...
  BackgroundInitializerTest.testSetExternalExecutorAfterStart:137 » IllegalState
  BackgroundInitializerTest.testStartMultipleTimes:157 » IllegalState Cannot set...
  CallableBackgroundInitializerTest.testInitExecutor:53 » IllegalState Cannot se...
  CallableBackgroundInitializerTest.testInitExecutorNullCallable »  Unexpected e...
  CallableBackgroundInitializerTest.testInitNullCallable »  Unexpected exception...
  CallableBackgroundInitializerTest.testInitialize:84 » IllegalState Cannot set ...
  MultiBackgroundInitializerTest.setUp:48 » IllegalState Cannot set ExecutorServ...
  MultiBackgroundInitializerTest.setUp:48 » IllegalState Cannot set ExecutorServ...
  MultiBackgroundInitializerTest.setUp:48 » IllegalState Cannot set ExecutorServ...
  MultiBackgroundInitializerTest.setUp:48 » IllegalState Cannot set ExecutorServ...
  MultiBackgroundInitializerTest.setUp:48 » IllegalState Cannot set ExecutorServ...
  MultiBackgroundInitializerTest.setUp:48 » IllegalState Cannot set ExecutorServ...
  MultiBackgroundInitializerTest.setUp:48 » IllegalState Cannot set ExecutorServ...
  MultiBackgroundInitializerTest.setUp:48 » IllegalState Cannot set ExecutorServ...
  MultiBackgroundInitializerTest.setUp:48 » IllegalState Cannot set ExecutorServ...
  MultiBackgroundInitializerTest.setUp:48 » IllegalState Cannot set ExecutorServ...
  MultiBackgroundInitializerTest.setUp:48 » IllegalState Cannot set ExecutorServ...
  MultiBackgroundInitializerTest.setUp:48 » IllegalState Cannot set ExecutorServ...
  MultiBackgroundInitializerTest.setUp:48 » IllegalState Cannot set ExecutorServ...
  MultiBackgroundInitializerTest.setUp:48 » IllegalState Cannot set ExecutorServ...
  MultiBackgroundInitializerTest.setUp:48 » IllegalState Cannot set ExecutorServ...
  MultiBackgroundInitializerTest.setUp:48 » IllegalState Cannot set ExecutorServ...
  MultiBackgroundInitializerTest.setUp:48 » IllegalState Cannot set ExecutorServ...


Tests run: 3526, Failures: 0, Errors: 35, Skipped: 97

[INFO] ------------------------------------------------------------------------
[INFO] BUILD FAILURE
[INFO] ------------------------------------------------------------------------
[INFO] Total time: 35.020s
[INFO] Finished at: Tue Aug 04 09:32:05 BST 2015
[INFO] Final Memory: 27M/571M
[INFO] ------------------------------------------------------------------------
[ERROR] Failed to execute goal org.apache.maven.plugins:maven-surefire-plugin:2.18:test (default-test) on project commons-lang3: There are test failures.
[ERROR] 
[ERROR] Please refer to /home/perham/Study/LittleDarwin/Cases/commons-lang3-3.4-src/target/surefire-reports for the individual test results.
[ERROR] -> [Help 1]
[ERROR] 
[ERROR] To see the full stack trace of the errors, re-run Maven with the -e switch.
[ERROR] Re-run Maven using the -X switch to enable full debug logging.
[ERROR] 
[ERROR] For more information about the errors and possible solutions, please read the following articles:
[ERROR] [Help 1] http://cwiki.apache.org/confluence/display/MAVEN/MojoFailureException
