[INFO] Scanning for projects...
[INFO]                                                                         
[INFO] ------------------------------------------------------------------------
[INFO] Building Apache Commons Lang 3.4
[INFO] ------------------------------------------------------------------------
[INFO] 
[INFO] --- maven-enforcer-plugin:1.3.1:enforce (enforce-maven-3) @ commons-lang3 ---
[INFO] 
[INFO] --- build-helper-maven-plugin:1.8:parse-version (parse-version) @ commons-lang3 ---
[INFO] 
[INFO] --- maven-antrun-plugin:1.8:run (javadoc.resources) @ commons-lang3 ---
[INFO] Executing tasks

main:
[INFO] Executed tasks
[INFO] 
[INFO] --- maven-remote-resources-plugin:1.5:process (default) @ commons-lang3 ---
[INFO] 
[INFO] --- buildnumber-maven-plugin:1.3:create (default) @ commons-lang3 ---
[INFO] Executing: /bin/sh -c cd /home/perham/Study/LittleDarwin/Cases/commons-lang3-3.4-src && svn --non-interactive info
[INFO] Working directory: /home/perham/Study/LittleDarwin/Cases/commons-lang3-3.4-src
[INFO] Storing buildNumber: ?????? at timestamp: 1438677020601
[INFO] Executing: /bin/sh -c cd /home/perham/Study/LittleDarwin/Cases/commons-lang3-3.4-src && svn --non-interactive info
[INFO] Working directory: /home/perham/Study/LittleDarwin/Cases/commons-lang3-3.4-src
[INFO] Storing buildScmBranch: UNKNOWN_BRANCH
[INFO] 
[INFO] --- maven-resources-plugin:2.7:resources (default-resources) @ commons-lang3 ---
[INFO] Using 'ISO-8859-1' encoding to copy filtered resources.
[INFO] Copying 0 resource
[INFO] Copying 2 resources to META-INF
[INFO] 
[INFO] --- maven-compiler-plugin:3.2:compile (default-compile) @ commons-lang3 ---
[INFO] Changes detected - recompiling the module!
[INFO] Compiling 133 source files to /home/perham/Study/LittleDarwin/Cases/commons-lang3-3.4-src/target/classes
[INFO] /home/perham/Study/LittleDarwin/Cases/commons-lang3-3.4-src/src/main/java/org/apache/commons/lang3/SerializationUtils.java: /home/perham/Study/LittleDarwin/Cases/commons-lang3-3.4-src/src/main/java/org/apache/commons/lang3/SerializationUtils.java uses unchecked or unsafe operations.
[INFO] /home/perham/Study/LittleDarwin/Cases/commons-lang3-3.4-src/src/main/java/org/apache/commons/lang3/SerializationUtils.java: Recompile with -Xlint:unchecked for details.
[INFO] 
[INFO] --- maven-bundle-plugin:2.5.3:manifest (bundle-manifest) @ commons-lang3 ---
[INFO] 
[INFO] --- animal-sniffer-maven-plugin:1.13:check (checkAPIcompatibility) @ commons-lang3 ---
[INFO] Checking unresolved references to org.codehaus.mojo.signature:java16:1.0
[INFO] 
[INFO] --- maven-resources-plugin:2.7:testResources (default-testResources) @ commons-lang3 ---
[INFO] Using 'ISO-8859-1' encoding to copy filtered resources.
[INFO] Copying 2 resources
[INFO] Copying 2 resources to META-INF
[INFO] 
[INFO] --- maven-compiler-plugin:3.2:testCompile (default-testCompile) @ commons-lang3 ---
[INFO] Nothing to compile - all classes are up to date
[INFO] 
[INFO] --- maven-surefire-plugin:2.18:test (default-test) @ commons-lang3 ---
[INFO] Surefire report directory: /home/perham/Study/LittleDarwin/Cases/commons-lang3-3.4-src/target/surefire-reports

-------------------------------------------------------
 T E S T S
-------------------------------------------------------
Running org.apache.commons.lang3.ValidateTest
Tests run: 63, Failures: 0, Errors: 0, Skipped: 0, Time elapsed: 0.034 sec - in org.apache.commons.lang3.ValidateTest
Running org.apache.commons.lang3.LocaleUtilsTest
Tests run: 15, Failures: 0, Errors: 0, Skipped: 0, Time elapsed: 0.019 sec - in org.apache.commons.lang3.LocaleUtilsTest
Running org.apache.commons.lang3.tuple.MutableTripleTest
Tests run: 8, Failures: 0, Errors: 0, Skipped: 0, Time elapsed: 0.008 sec - in org.apache.commons.lang3.tuple.MutableTripleTest
Running org.apache.commons.lang3.tuple.TripleTest
Tests run: 10, Failures: 0, Errors: 0, Skipped: 0, Time elapsed: 0.005 sec - in org.apache.commons.lang3.tuple.TripleTest
Running org.apache.commons.lang3.tuple.ImmutablePairTest
Tests run: 6, Failures: 0, Errors: 0, Skipped: 0, Time elapsed: 0.001 sec - in org.apache.commons.lang3.tuple.ImmutablePairTest
Running org.apache.commons.lang3.tuple.MutablePairTest
Tests run: 8, Failures: 0, Errors: 0, Skipped: 0, Time elapsed: 0.001 sec - in org.apache.commons.lang3.tuple.MutablePairTest
Running org.apache.commons.lang3.tuple.ImmutableTripleTest
Tests run: 6, Failures: 0, Errors: 0, Skipped: 0, Time elapsed: 0 sec - in org.apache.commons.lang3.tuple.ImmutableTripleTest
Running org.apache.commons.lang3.tuple.PairTest
Tests run: 9, Failures: 0, Errors: 0, Skipped: 0, Time elapsed: 0 sec - in org.apache.commons.lang3.tuple.PairTest
Running org.apache.commons.lang3.StringUtilsIsTest
Tests run: 8, Failures: 0, Errors: 0, Skipped: 0, Time elapsed: 0.004 sec - in org.apache.commons.lang3.StringUtilsIsTest
Running org.apache.commons.lang3.JavaVersionTest
Tests run: 3, Failures: 0, Errors: 0, Skipped: 0, Time elapsed: 0 sec - in org.apache.commons.lang3.JavaVersionTest
Running org.apache.commons.lang3.builder.NoFieldNamesToStringStyleTest
Tests run: 8, Failures: 0, Errors: 0, Skipped: 0, Time elapsed: 0.001 sec - in org.apache.commons.lang3.builder.NoFieldNamesToStringStyleTest
Running org.apache.commons.lang3.builder.ShortPrefixToStringStyleTest
Tests run: 8, Failures: 0, Errors: 0, Skipped: 0, Time elapsed: 0.001 sec - in org.apache.commons.lang3.builder.ShortPrefixToStringStyleTest
Running org.apache.commons.lang3.builder.DiffResultTest
Tests run: 9, Failures: 0, Errors: 0, Skipped: 0, Time elapsed: 0.007 sec - in org.apache.commons.lang3.builder.DiffResultTest
Running org.apache.commons.lang3.builder.CompareToBuilderTest
Tests run: 48, Failures: 0, Errors: 0, Skipped: 0, Time elapsed: 0.017 sec - in org.apache.commons.lang3.builder.CompareToBuilderTest
Running org.apache.commons.lang3.builder.MultilineRecursiveToStringStyleTest
Tests run: 10, Failures: 0, Errors: 0, Skipped: 0, Time elapsed: 0.004 sec - in org.apache.commons.lang3.builder.MultilineRecursiveToStringStyleTest
Running org.apache.commons.lang3.builder.RecursiveToStringStyleTest
Tests run: 8, Failures: 0, Errors: 0, Skipped: 0, Time elapsed: 0.004 sec - in org.apache.commons.lang3.builder.RecursiveToStringStyleTest
Running org.apache.commons.lang3.builder.DefaultToStringStyleTest
Tests run: 8, Failures: 0, Errors: 0, Skipped: 0, Time elapsed: 0.002 sec - in org.apache.commons.lang3.builder.DefaultToStringStyleTest
Running org.apache.commons.lang3.builder.ReflectionToStringBuilderExcludeTest
Tests run: 11, Failures: 0, Errors: 0, Skipped: 0, Time elapsed: 0.006 sec - in org.apache.commons.lang3.builder.ReflectionToStringBuilderExcludeTest
Running org.apache.commons.lang3.builder.StandardToStringStyleTest
Tests run: 8, Failures: 0, Errors: 0, Skipped: 0, Time elapsed: 0.002 sec - in org.apache.commons.lang3.builder.StandardToStringStyleTest
Running org.apache.commons.lang3.builder.ToStringStyleTest
Tests run: 12, Failures: 0, Errors: 0, Skipped: 0, Time elapsed: 0.001 sec - in org.apache.commons.lang3.builder.ToStringStyleTest
Running org.apache.commons.lang3.builder.DiffTest
Tests run: 4, Failures: 0, Errors: 0, Skipped: 0, Time elapsed: 0.001 sec - in org.apache.commons.lang3.builder.DiffTest
Running org.apache.commons.lang3.builder.SimpleToStringStyleTest
Tests run: 8, Failures: 0, Errors: 0, Skipped: 0, Time elapsed: 0.002 sec - in org.apache.commons.lang3.builder.SimpleToStringStyleTest
Running org.apache.commons.lang3.builder.MultiLineToStringStyleTest
Tests run: 8, Failures: 0, Errors: 0, Skipped: 0, Time elapsed: 0.003 sec - in org.apache.commons.lang3.builder.MultiLineToStringStyleTest
Running org.apache.commons.lang3.builder.ToStringStyleConcurrencyTest
Tests run: 3, Failures: 0, Errors: 0, Skipped: 0, Time elapsed: 3.845 sec - in org.apache.commons.lang3.builder.ToStringStyleConcurrencyTest
Running org.apache.commons.lang3.builder.ReflectionToStringBuilderMutateInspectConcurrencyTest
Tests run: 1, Failures: 0, Errors: 0, Skipped: 1, Time elapsed: 0 sec - in org.apache.commons.lang3.builder.ReflectionToStringBuilderMutateInspectConcurrencyTest
Running org.apache.commons.lang3.builder.ToStringBuilderTest
Tests run: 74, Failures: 0, Errors: 0, Skipped: 1, Time elapsed: 0.05 sec - in org.apache.commons.lang3.builder.ToStringBuilderTest
Running org.apache.commons.lang3.builder.EqualsBuilderTest
Tests run: 48, Failures: 0, Errors: 0, Skipped: 0, Time elapsed: 0.036 sec - in org.apache.commons.lang3.builder.EqualsBuilderTest
Running org.apache.commons.lang3.builder.HashCodeBuilderAndEqualsBuilderTest
Tests run: 4, Failures: 0, Errors: 0, Skipped: 0, Time elapsed: 0.009 sec - in org.apache.commons.lang3.builder.HashCodeBuilderAndEqualsBuilderTest
Running org.apache.commons.lang3.builder.ReflectionToStringBuilderConcurrencyTest
Tests run: 3, Failures: 0, Errors: 0, Skipped: 3, Time elapsed: 0 sec - in org.apache.commons.lang3.builder.ReflectionToStringBuilderConcurrencyTest
Running org.apache.commons.lang3.builder.JsonToStringStyleTest
Tests run: 9, Failures: 0, Errors: 0, Skipped: 0, Time elapsed: 0.003 sec - in org.apache.commons.lang3.builder.JsonToStringStyleTest
Running org.apache.commons.lang3.builder.NoClassNameToStringStyleTest
Tests run: 8, Failures: 0, Errors: 0, Skipped: 0, Time elapsed: 0.001 sec - in org.apache.commons.lang3.builder.NoClassNameToStringStyleTest
Running org.apache.commons.lang3.builder.DiffBuilderTest
Tests run: 30, Failures: 0, Errors: 0, Skipped: 0, Time elapsed: 0.02 sec - in org.apache.commons.lang3.builder.DiffBuilderTest
Running org.apache.commons.lang3.builder.HashCodeBuilderTest
Tests run: 44, Failures: 0, Errors: 0, Skipped: 0, Time elapsed: 0.016 sec - in org.apache.commons.lang3.builder.HashCodeBuilderTest
Running org.apache.commons.lang3.concurrent.AtomicInitializerTest
Tests run: 3, Failures: 0, Errors: 0, Skipped: 0, Time elapsed: 0.012 sec - in org.apache.commons.lang3.concurrent.AtomicInitializerTest
Running org.apache.commons.lang3.concurrent.CallableBackgroundInitializerTest
Tests run: 4, Failures: 0, Errors: 0, Skipped: 0, Time elapsed: 0.001 sec - in org.apache.commons.lang3.concurrent.CallableBackgroundInitializerTest
Running org.apache.commons.lang3.concurrent.BackgroundInitializerTest
Exception in thread "Thread-20" Tests run: 15, Failures: 2, Errors: 10, Skipped: 0, Time elapsed: 0.021 sec <<< FAILURE! - in org.apache.commons.lang3.concurrent.BackgroundInitializerTest
testGetCheckedException(org.apache.commons.lang3.concurrent.BackgroundInitializerTest)  Time elapsed: 0.009 sec  <<< ERROR!
java.lang.IllegalStateException: start() must be called first!
	at org.apache.commons.lang3.concurrent.BackgroundInitializer.getFuture(BackgroundInitializer.java:35)
	at org.apache.commons.lang3.concurrent.BackgroundInitializer.get(BackgroundInitializer.java:30)
	at org.apache.commons.lang3.concurrent.BackgroundInitializerTest.testGetCheckedException(BackgroundInitializerTest.java:205)

testGetActiveExecutorExternal(org.apache.commons.lang3.concurrent.BackgroundInitializerTest)  Time elapsed: 0 sec  <<< ERROR!
java.lang.IllegalStateException: start() must be called first!
	at org.apache.commons.lang3.concurrent.BackgroundInitializer.getFuture(BackgroundInitializer.java:35)
	at org.apache.commons.lang3.concurrent.BackgroundInitializer.get(BackgroundInitializer.java:30)
	at org.apache.commons.lang3.concurrent.BackgroundInitializerTest.checkInitialize(BackgroundInitializerTest.java:38)
	at org.apache.commons.lang3.concurrent.BackgroundInitializerTest.testGetActiveExecutorExternal(BackgroundInitializerTest.java:78)

testGetRuntimeException(org.apache.commons.lang3.concurrent.BackgroundInitializerTest)  Time elapsed: 0.004 sec  <<< FAILURE!
java.lang.AssertionError: Runtime exception not thrown expected:<java.lang.RuntimeException> but was:<java.lang.IllegalStateException: start() must be called first!>
	at org.junit.Assert.fail(Assert.java:88)
	at org.junit.Assert.failNotEquals(Assert.java:834)
	at org.junit.Assert.assertEquals(Assert.java:118)
	at org.apache.commons.lang3.concurrent.BackgroundInitializerTest.testGetRuntimeException(BackgroundInitializerTest.java:190)

testGetActiveExecutorTemp(org.apache.commons.lang3.concurrent.BackgroundInitializerTest)  Time elapsed: 0.001 sec  <<< ERROR!
java.lang.IllegalStateException: start() must be called first!
	at org.apache.commons.lang3.concurrent.BackgroundInitializer.getFuture(BackgroundInitializer.java:35)
	at org.apache.commons.lang3.concurrent.BackgroundInitializer.get(BackgroundInitializer.java:30)
	at org.apache.commons.lang3.concurrent.BackgroundInitializerTest.checkInitialize(BackgroundInitializerTest.java:38)
	at org.apache.commons.lang3.concurrent.BackgroundInitializerTest.testGetActiveExecutorTemp(BackgroundInitializerTest.java:93)

testSetExternalExecutorAfterStart(org.apache.commons.lang3.concurrent.BackgroundInitializerTest)  Time elapsed: 0 sec  <<< ERROR!
java.lang.IllegalStateException: start() must be called first!
	at org.apache.commons.lang3.concurrent.BackgroundInitializer.getFuture(BackgroundInitializer.java:35)
	at org.apache.commons.lang3.concurrent.BackgroundInitializer.get(BackgroundInitializer.java:30)
	at org.apache.commons.lang3.concurrent.BackgroundInitializerTest.testSetExternalExecutorAfterStart(BackgroundInitializerTest.java:144)

testInitialize(org.apache.commons.lang3.concurrent.BackgroundInitializerTest)  Time elapsed: 0.001 sec  <<< ERROR!
java.lang.IllegalStateException: start() must be called first!
	at org.apache.commons.lang3.concurrent.BackgroundInitializer.getFuture(BackgroundInitializer.java:35)
	at org.apache.commons.lang3.concurrent.BackgroundInitializer.get(BackgroundInitializer.java:30)
	at org.apache.commons.lang3.concurrent.BackgroundInitializerTest.checkInitialize(BackgroundInitializerTest.java:38)
	at org.apache.commons.lang3.concurrent.BackgroundInitializerTest.testInitialize(BackgroundInitializerTest.java:54)

testIsStartedAfterGet(org.apache.commons.lang3.concurrent.BackgroundInitializerTest)  Time elapsed: 0 sec  <<< ERROR!
java.lang.IllegalStateException: start() must be called first!
	at org.apache.commons.lang3.concurrent.BackgroundInitializer.getFuture(BackgroundInitializer.java:35)
	at org.apache.commons.lang3.concurrent.BackgroundInitializer.get(BackgroundInitializer.java:30)
	at org.apache.commons.lang3.concurrent.BackgroundInitializerTest.checkInitialize(BackgroundInitializerTest.java:38)
	at org.apache.commons.lang3.concurrent.BackgroundInitializerTest.testIsStartedAfterGet(BackgroundInitializerTest.java:275)

testGetBeforeStart(org.apache.commons.lang3.concurrent.BackgroundInitializerTest)  Time elapsed: 0 sec  <<< ERROR!
java.lang.Exception: Unexpected exception, expected<java.lang.IllegalStateException> but was<java.lang.NullPointerException>
	at org.apache.commons.lang3.concurrent.BackgroundInitializer.get(BackgroundInitializer.java:30)
	at org.apache.commons.lang3.concurrent.BackgroundInitializerTest.testGetBeforeStart(BackgroundInitializerTest.java:173)

testStartMultipleTimes(org.apache.commons.lang3.concurrent.BackgroundInitializerTest)  Time elapsed: 0.001 sec  <<< ERROR!
java.lang.IllegalStateException: start() must be called first!
	at org.apache.commons.lang3.concurrent.BackgroundInitializer.getFuture(BackgroundInitializer.java:35)
	at org.apache.commons.lang3.concurrent.BackgroundInitializer.get(BackgroundInitializer.java:30)
	at org.apache.commons.lang3.concurrent.BackgroundInitializerTest.checkInitialize(BackgroundInitializerTest.java:38)
	at org.apache.commons.lang3.concurrent.BackgroundInitializerTest.testStartMultipleTimes(BackgroundInitializerTest.java:162)

testInitializeTempExecutor(org.apache.commons.lang3.concurrent.BackgroundInitializerTest)  Time elapsed: 0 sec  <<< ERROR!
java.lang.IllegalStateException: start() must be called first!
	at org.apache.commons.lang3.concurrent.BackgroundInitializer.getFuture(BackgroundInitializer.java:35)
	at org.apache.commons.lang3.concurrent.BackgroundInitializer.get(BackgroundInitializer.java:30)
	at org.apache.commons.lang3.concurrent.BackgroundInitializerTest.checkInitialize(BackgroundInitializerTest.java:38)
	at org.apache.commons.lang3.concurrent.BackgroundInitializerTest.testInitializeTempExecutor(BackgroundInitializerTest.java:104)

testGetInterruptedException(org.apache.commons.lang3.concurrent.BackgroundInitializerTest)  Time elapsed: 0.001 sec  <<< FAILURE!
java.lang.AssertionError: No interrupted exception
	at org.junit.Assert.fail(Assert.java:88)
	at org.junit.Assert.assertTrue(Assert.java:41)
	at org.junit.Assert.assertNotNull(Assert.java:712)
	at org.apache.commons.lang3.concurrent.BackgroundInitializerTest.testGetInterruptedException(BackgroundInitializerTest.java:246)

testSetExternalExecutor(org.apache.commons.lang3.concurrent.BackgroundInitializerTest)  Time elapsed: 0.001 sec  <<< ERROR!
java.lang.IllegalStateException: start() must be called first!
	at org.apache.commons.lang3.concurrent.BackgroundInitializer.getFuture(BackgroundInitializer.java:35)
	at org.apache.commons.lang3.concurrent.BackgroundInitializer.get(BackgroundInitializer.java:30)
	at org.apache.commons.lang3.concurrent.BackgroundInitializerTest.checkInitialize(BackgroundInitializerTest.java:38)
	at org.apache.commons.lang3.concurrent.BackgroundInitializerTest.testSetExternalExecutor(BackgroundInitializerTest.java:123)

java.lang.IllegalStateException: start() must be called first!Running org.apache.commons.lang3.concurrent.LazyInitializerTest

	at org.apache.commons.lang3.concurrent.BackgroundInitializer.getFuture(BackgroundInitializer.java:35)
	at org.apache.commons.lang3.concurrent.BackgroundInitializer.get(BackgroundInitializer.java:30)
	at org.apache.commons.lang3.concurrent.BackgroundInitializerTest$1.run(BackgroundInitializerTest.java:230)
Tests run: 3, Failures: 0, Errors: 0, Skipped: 0, Time elapsed: 0.008 sec - in org.apache.commons.lang3.concurrent.LazyInitializerTest
Running org.apache.commons.lang3.concurrent.BasicThreadFactoryTest
Tests run: 15, Failures: 0, Errors: 0, Skipped: 0, Time elapsed: 0.041 sec - in org.apache.commons.lang3.concurrent.BasicThreadFactoryTest
Running org.apache.commons.lang3.concurrent.ConstantInitializerTest
Tests run: 7, Failures: 0, Errors: 0, Skipped: 0, Time elapsed: 0.002 sec - in org.apache.commons.lang3.concurrent.ConstantInitializerTest
Running org.apache.commons.lang3.concurrent.MultiBackgroundInitializerTest
Tests run: 17, Failures: 1, Errors: 14, Skipped: 0, Time elapsed: 0.066 sec <<< FAILURE! - in org.apache.commons.lang3.concurrent.MultiBackgroundInitializerTest
testResultInitializerNamesModify(org.apache.commons.lang3.concurrent.MultiBackgroundInitializerTest)  Time elapsed: 0.007 sec  <<< ERROR!
java.lang.Exception: Unexpected exception, expected<java.lang.UnsupportedOperationException> but was<java.lang.IllegalStateException>
	at org.apache.commons.lang3.concurrent.BackgroundInitializer.getFuture(BackgroundInitializer.java:35)
	at org.apache.commons.lang3.concurrent.BackgroundInitializer.get(BackgroundInitializer.java:30)
	at org.apache.commons.lang3.concurrent.MultiBackgroundInitializerTest.checkInitialize(MultiBackgroundInitializerTest.java:121)
	at org.apache.commons.lang3.concurrent.MultiBackgroundInitializerTest.testResultInitializerNamesModify(MultiBackgroundInitializerTest.java:269)

testInitializeRuntimeEx(org.apache.commons.lang3.concurrent.MultiBackgroundInitializerTest)  Time elapsed: 0.001 sec  <<< FAILURE!
java.lang.AssertionError: Wrong exception expected:<java.lang.RuntimeException> but was:<java.lang.IllegalStateException: start() must be called first!>
	at org.junit.Assert.fail(Assert.java:88)
	at org.junit.Assert.failNotEquals(Assert.java:834)
	at org.junit.Assert.assertEquals(Assert.java:118)
	at org.apache.commons.lang3.concurrent.MultiBackgroundInitializerTest.testInitializeRuntimeEx(MultiBackgroundInitializerTest.java:291)

testInitializeResultsIsSuccessfulTrue(org.apache.commons.lang3.concurrent.MultiBackgroundInitializerTest)  Time elapsed: 0.001 sec  <<< ERROR!
java.lang.IllegalStateException: start() must be called first!
	at org.apache.commons.lang3.concurrent.BackgroundInitializer.getFuture(BackgroundInitializer.java:35)
	at org.apache.commons.lang3.concurrent.BackgroundInitializer.get(BackgroundInitializer.java:30)
	at org.apache.commons.lang3.concurrent.MultiBackgroundInitializerTest.testInitializeResultsIsSuccessfulTrue(MultiBackgroundInitializerTest.java:327)

testResultGetExceptionUnknown(org.apache.commons.lang3.concurrent.MultiBackgroundInitializerTest)  Time elapsed: 0 sec  <<< ERROR!
java.lang.Exception: Unexpected exception, expected<java.util.NoSuchElementException> but was<java.lang.IllegalStateException>
	at org.apache.commons.lang3.concurrent.BackgroundInitializer.getFuture(BackgroundInitializer.java:35)
	at org.apache.commons.lang3.concurrent.BackgroundInitializer.get(BackgroundInitializer.java:30)
	at org.apache.commons.lang3.concurrent.MultiBackgroundInitializerTest.checkInitialize(MultiBackgroundInitializerTest.java:121)
	at org.apache.commons.lang3.concurrent.MultiBackgroundInitializerTest.testResultGetExceptionUnknown(MultiBackgroundInitializerTest.java:246)

testInitializeNested(org.apache.commons.lang3.concurrent.MultiBackgroundInitializerTest)  Time elapsed: 0.001 sec  <<< ERROR!
java.lang.IllegalStateException: start() must be called first!
	at org.apache.commons.lang3.concurrent.BackgroundInitializer.getFuture(BackgroundInitializer.java:35)
	at org.apache.commons.lang3.concurrent.BackgroundInitializer.get(BackgroundInitializer.java:30)
	at org.apache.commons.lang3.concurrent.MultiBackgroundInitializerTest.testInitializeNested(MultiBackgroundInitializerTest.java:370)

testInitializeTempExec(org.apache.commons.lang3.concurrent.MultiBackgroundInitializerTest)  Time elapsed: 0.013 sec  <<< ERROR!
java.lang.IllegalStateException: start() must be called first!
	at org.apache.commons.lang3.concurrent.BackgroundInitializer.getFuture(BackgroundInitializer.java:35)
	at org.apache.commons.lang3.concurrent.BackgroundInitializer.get(BackgroundInitializer.java:30)
	at org.apache.commons.lang3.concurrent.MultiBackgroundInitializerTest.checkInitialize(MultiBackgroundInitializerTest.java:121)
	at org.apache.commons.lang3.concurrent.MultiBackgroundInitializerTest.testInitializeTempExec(MultiBackgroundInitializerTest.java:145)

testInitializeEx(org.apache.commons.lang3.concurrent.MultiBackgroundInitializerTest)  Time elapsed: 0.009 sec  <<< ERROR!
java.lang.IllegalStateException: start() must be called first!
	at org.apache.commons.lang3.concurrent.BackgroundInitializer.getFuture(BackgroundInitializer.java:35)
	at org.apache.commons.lang3.concurrent.BackgroundInitializer.get(BackgroundInitializer.java:30)
	at org.apache.commons.lang3.concurrent.MultiBackgroundInitializerTest.testInitializeEx(MultiBackgroundInitializerTest.java:307)

testResultGetInitializerUnknown(org.apache.commons.lang3.concurrent.MultiBackgroundInitializerTest)  Time elapsed: 0 sec  <<< ERROR!
java.lang.Exception: Unexpected exception, expected<java.util.NoSuchElementException> but was<java.lang.IllegalStateException>
	at org.apache.commons.lang3.concurrent.BackgroundInitializer.getFuture(BackgroundInitializer.java:35)
	at org.apache.commons.lang3.concurrent.BackgroundInitializer.get(BackgroundInitializer.java:30)
	at org.apache.commons.lang3.concurrent.MultiBackgroundInitializerTest.checkInitialize(MultiBackgroundInitializerTest.java:121)
	at org.apache.commons.lang3.concurrent.MultiBackgroundInitializerTest.testResultGetInitializerUnknown(MultiBackgroundInitializerTest.java:222)

testInitializeResultsIsSuccessfulFalse(org.apache.commons.lang3.concurrent.MultiBackgroundInitializerTest)  Time elapsed: 0.001 sec  <<< ERROR!
java.lang.IllegalStateException: start() must be called first!
	at org.apache.commons.lang3.concurrent.BackgroundInitializer.getFuture(BackgroundInitializer.java:35)
	at org.apache.commons.lang3.concurrent.BackgroundInitializer.get(BackgroundInitializer.java:30)
	at org.apache.commons.lang3.concurrent.MultiBackgroundInitializerTest.testInitializeResultsIsSuccessfulFalse(MultiBackgroundInitializerTest.java:345)

testInitializeNoChildren(org.apache.commons.lang3.concurrent.MultiBackgroundInitializerTest)  Time elapsed: 0.001 sec  <<< ERROR!
java.lang.IllegalStateException: start() must be called first!
	at org.apache.commons.lang3.concurrent.BackgroundInitializer.getFuture(BackgroundInitializer.java:35)
	at org.apache.commons.lang3.concurrent.BackgroundInitializer.get(BackgroundInitializer.java:30)
	at org.apache.commons.lang3.concurrent.MultiBackgroundInitializerTest.testInitializeNoChildren(MultiBackgroundInitializerTest.java:98)

testInitializeChildWithExecutor(org.apache.commons.lang3.concurrent.MultiBackgroundInitializerTest)  Time elapsed: 0.001 sec  <<< ERROR!
java.lang.IllegalStateException: start() must be called first!
	at org.apache.commons.lang3.concurrent.BackgroundInitializer.getFuture(BackgroundInitializer.java:35)
	at org.apache.commons.lang3.concurrent.BackgroundInitializer.get(BackgroundInitializer.java:30)
	at org.apache.commons.lang3.concurrent.MultiBackgroundInitializerTest.testInitializeChildWithExecutor(MultiBackgroundInitializerTest.java:187)

testInitializeExternalExec(org.apache.commons.lang3.concurrent.MultiBackgroundInitializerTest)  Time elapsed: 0.021 sec  <<< ERROR!
java.lang.IllegalStateException: start() must be called first!
	at org.apache.commons.lang3.concurrent.BackgroundInitializer.getFuture(BackgroundInitializer.java:35)
	at org.apache.commons.lang3.concurrent.BackgroundInitializer.get(BackgroundInitializer.java:30)
	at org.apache.commons.lang3.concurrent.MultiBackgroundInitializerTest.checkInitialize(MultiBackgroundInitializerTest.java:121)
	at org.apache.commons.lang3.concurrent.MultiBackgroundInitializerTest.testInitializeExternalExec(MultiBackgroundInitializerTest.java:160)

testAddInitializerAfterStart(org.apache.commons.lang3.concurrent.MultiBackgroundInitializerTest)  Time elapsed: 0 sec  <<< ERROR!
java.lang.IllegalStateException: start() must be called first!
	at org.apache.commons.lang3.concurrent.BackgroundInitializer.getFuture(BackgroundInitializer.java:35)
	at org.apache.commons.lang3.concurrent.BackgroundInitializer.get(BackgroundInitializer.java:30)
	at org.apache.commons.lang3.concurrent.MultiBackgroundInitializerTest.testAddInitializerAfterStart(MultiBackgroundInitializerTest.java:210)

testResultGetResultObjectUnknown(org.apache.commons.lang3.concurrent.MultiBackgroundInitializerTest)  Time elapsed: 0.002 sec  <<< ERROR!
java.lang.Exception: Unexpected exception, expected<java.util.NoSuchElementException> but was<java.lang.IllegalStateException>
	at org.apache.commons.lang3.concurrent.BackgroundInitializer.getFuture(BackgroundInitializer.java:35)
	at org.apache.commons.lang3.concurrent.BackgroundInitializer.get(BackgroundInitializer.java:30)
	at org.apache.commons.lang3.concurrent.MultiBackgroundInitializerTest.checkInitialize(MultiBackgroundInitializerTest.java:121)
	at org.apache.commons.lang3.concurrent.MultiBackgroundInitializerTest.testResultGetResultObjectUnknown(MultiBackgroundInitializerTest.java:234)

testResultIsExceptionUnknown(org.apache.commons.lang3.concurrent.MultiBackgroundInitializerTest)  Time elapsed: 0.004 sec  <<< ERROR!
java.lang.Exception: Unexpected exception, expected<java.util.NoSuchElementException> but was<java.lang.IllegalStateException>
	at org.apache.commons.lang3.concurrent.BackgroundInitializer.getFuture(BackgroundInitializer.java:35)
	at org.apache.commons.lang3.concurrent.BackgroundInitializer.get(BackgroundInitializer.java:30)
	at org.apache.commons.lang3.concurrent.MultiBackgroundInitializerTest.checkInitialize(MultiBackgroundInitializerTest.java:121)
	at org.apache.commons.lang3.concurrent.MultiBackgroundInitializerTest.testResultIsExceptionUnknown(MultiBackgroundInitializerTest.java:258)

Running org.apache.commons.lang3.concurrent.AtomicSafeInitializerTest
Tests run: 4, Failures: 0, Errors: 0, Skipped: 0, Time elapsed: 0.028 sec - in org.apache.commons.lang3.concurrent.AtomicSafeInitializerTest
Running org.apache.commons.lang3.concurrent.ConcurrentUtilsTest
Tests run: 40, Failures: 0, Errors: 0, Skipped: 0, Time elapsed: 0.015 sec - in org.apache.commons.lang3.concurrent.ConcurrentUtilsTest
Running org.apache.commons.lang3.concurrent.TimedSemaphoreTest
Tests run: 15, Failures: 0, Errors: 0, Skipped: 0, Time elapsed: 1.184 sec - in org.apache.commons.lang3.concurrent.TimedSemaphoreTest
Running org.apache.commons.lang3.StringUtilsSubstringTest
Tests run: 14, Failures: 0, Errors: 0, Skipped: 0, Time elapsed: 0.003 sec - in org.apache.commons.lang3.StringUtilsSubstringTest
Running org.apache.commons.lang3.SystemUtilsTest
Tests run: 12, Failures: 0, Errors: 0, Skipped: 0, Time elapsed: 0.002 sec - in org.apache.commons.lang3.SystemUtilsTest
Running org.apache.commons.lang3.CharRangeTest
Tests run: 16, Failures: 0, Errors: 0, Skipped: 0, Time elapsed: 0.032 sec - in org.apache.commons.lang3.CharRangeTest
Running org.apache.commons.lang3.CharSetTest
Tests run: 14, Failures: 0, Errors: 0, Skipped: 0, Time elapsed: 0.007 sec - in org.apache.commons.lang3.CharSetTest
Running org.apache.commons.lang3.StringUtilsStartsEndsWithTest
Tests run: 6, Failures: 0, Errors: 0, Skipped: 0, Time elapsed: 0.003 sec - in org.apache.commons.lang3.StringUtilsStartsEndsWithTest
Running org.apache.commons.lang3.RandomStringUtilsTest
Tests run: 11, Failures: 0, Errors: 0, Skipped: 0, Time elapsed: 0.032 sec - in org.apache.commons.lang3.RandomStringUtilsTest
Running org.apache.commons.lang3.SerializationUtilsTest
Tests run: 26, Failures: 0, Errors: 0, Skipped: 0, Time elapsed: 0.046 sec - in org.apache.commons.lang3.SerializationUtilsTest
Running org.apache.commons.lang3.time.StopWatchTest
Tests run: 8, Failures: 0, Errors: 0, Skipped: 0, Time elapsed: 4.765 sec - in org.apache.commons.lang3.time.StopWatchTest
Running org.apache.commons.lang3.time.DateUtilsRoundingTest
Tests run: 22, Failures: 0, Errors: 0, Skipped: 0, Time elapsed: 0.15 sec - in org.apache.commons.lang3.time.DateUtilsRoundingTest
Running org.apache.commons.lang3.time.FastDateParserTest
Tests run: 33, Failures: 0, Errors: 0, Skipped: 0, Time elapsed: 2.067 sec - in org.apache.commons.lang3.time.FastDateParserTest
Running org.apache.commons.lang3.time.FastDateFormat_ParserTest
Tests run: 33, Failures: 0, Errors: 0, Skipped: 0, Time elapsed: 0.688 sec - in org.apache.commons.lang3.time.FastDateFormat_ParserTest
Running org.apache.commons.lang3.time.DurationFormatUtilsTest
Tests run: 25, Failures: 0, Errors: 0, Skipped: 0, Time elapsed: 0.709 sec - in org.apache.commons.lang3.time.DurationFormatUtilsTest
Running org.apache.commons.lang3.time.DateFormatUtilsTest
Tests run: 10, Failures: 0, Errors: 0, Skipped: 0, Time elapsed: 0.002 sec - in org.apache.commons.lang3.time.DateFormatUtilsTest
Running org.apache.commons.lang3.time.DateUtilsFragmentTest
Tests run: 57, Failures: 0, Errors: 0, Skipped: 0, Time elapsed: 0.078 sec - in org.apache.commons.lang3.time.DateUtilsFragmentTest
Running org.apache.commons.lang3.time.FastDatePrinterTimeZonesTest
Tests run: 617, Failures: 0, Errors: 0, Skipped: 0, Time elapsed: 0.175 sec - in org.apache.commons.lang3.time.FastDatePrinterTimeZonesTest
Running org.apache.commons.lang3.time.FastDateFormatTest
>>FastDateFormatTest: FastDateParser:32273  SimpleDateFormat:3880
Tests run: 14, Failures: 0, Errors: 0, Skipped: 0, Time elapsed: 3.962 sec - in org.apache.commons.lang3.time.FastDateFormatTest
Running org.apache.commons.lang3.time.FastDateFormat_PrinterTest
Tests run: 17, Failures: 0, Errors: 0, Skipped: 0, Time elapsed: 0.011 sec - in org.apache.commons.lang3.time.FastDateFormat_PrinterTest
Running org.apache.commons.lang3.time.FastDatePrinterTest
Tests run: 17, Failures: 0, Errors: 0, Skipped: 0, Time elapsed: 0.004 sec - in org.apache.commons.lang3.time.FastDatePrinterTest
Running org.apache.commons.lang3.time.FastDateParserSDFTest
Tests run: 276, Failures: 0, Errors: 0, Skipped: 92, Time elapsed: 0.058 sec - in org.apache.commons.lang3.time.FastDateParserSDFTest
Running org.apache.commons.lang3.time.DateUtilsTest
DateUtilsTest: Default Locale=en_US
Tests run: 38, Failures: 0, Errors: 0, Skipped: 0, Time elapsed: 0.018 sec - in org.apache.commons.lang3.time.DateUtilsTest
Running org.apache.commons.lang3.reflect.InheritanceUtilsTest
Tests run: 9, Failures: 0, Errors: 0, Skipped: 0, Time elapsed: 0.003 sec - in org.apache.commons.lang3.reflect.InheritanceUtilsTest
Running org.apache.commons.lang3.reflect.MethodUtilsTest
Tests run: 23, Failures: 0, Errors: 0, Skipped: 0, Time elapsed: 0.032 sec - in org.apache.commons.lang3.reflect.MethodUtilsTest
Running org.apache.commons.lang3.reflect.ConstructorUtilsTest
Tests run: 7, Failures: 0, Errors: 0, Skipped: 0, Time elapsed: 0.004 sec - in org.apache.commons.lang3.reflect.ConstructorUtilsTest
Running org.apache.commons.lang3.reflect.FieldUtilsTest
Tests run: 64, Failures: 0, Errors: 0, Skipped: 0, Time elapsed: 0.024 sec - in org.apache.commons.lang3.reflect.FieldUtilsTest
Running org.apache.commons.lang3.reflect.TypeLiteralTest
Tests run: 4, Failures: 0, Errors: 0, Skipped: 0, Time elapsed: 0.005 sec - in org.apache.commons.lang3.reflect.TypeLiteralTest
Running org.apache.commons.lang3.reflect.TypeUtilsTest
Tests run: 19, Failures: 0, Errors: 0, Skipped: 0, Time elapsed: 0.045 sec - in org.apache.commons.lang3.reflect.TypeUtilsTest
Running org.apache.commons.lang3.mutable.MutableByteTest
Tests run: 17, Failures: 0, Errors: 0, Skipped: 0, Time elapsed: 0.002 sec - in org.apache.commons.lang3.mutable.MutableByteTest
Running org.apache.commons.lang3.mutable.MutableShortTest
Tests run: 14, Failures: 0, Errors: 0, Skipped: 0, Time elapsed: 0.002 sec - in org.apache.commons.lang3.mutable.MutableShortTest
Running org.apache.commons.lang3.mutable.MutableIntTest
Tests run: 17, Failures: 0, Errors: 0, Skipped: 0, Time elapsed: 0.003 sec - in org.apache.commons.lang3.mutable.MutableIntTest
Running org.apache.commons.lang3.mutable.MutableDoubleTest
Tests run: 18, Failures: 0, Errors: 0, Skipped: 0, Time elapsed: 0.003 sec - in org.apache.commons.lang3.mutable.MutableDoubleTest
Running org.apache.commons.lang3.mutable.MutableFloatTest
Tests run: 18, Failures: 0, Errors: 0, Skipped: 0, Time elapsed: 0.004 sec - in org.apache.commons.lang3.mutable.MutableFloatTest
Running org.apache.commons.lang3.mutable.MutableLongTest
Tests run: 17, Failures: 0, Errors: 0, Skipped: 0, Time elapsed: 0.003 sec - in org.apache.commons.lang3.mutable.MutableLongTest
Running org.apache.commons.lang3.mutable.MutableBooleanTest
Tests run: 9, Failures: 0, Errors: 0, Skipped: 0, Time elapsed: 0 sec - in org.apache.commons.lang3.mutable.MutableBooleanTest
Running org.apache.commons.lang3.mutable.MutableObjectTest
Tests run: 5, Failures: 0, Errors: 0, Skipped: 0, Time elapsed: 0.001 sec - in org.apache.commons.lang3.mutable.MutableObjectTest
Running org.apache.commons.lang3.text.translate.UnicodeEscaperTest
Tests run: 3, Failures: 0, Errors: 0, Skipped: 0, Time elapsed: 0.001 sec - in org.apache.commons.lang3.text.translate.UnicodeEscaperTest
Running org.apache.commons.lang3.text.translate.EntityArraysTest
Tests run: 3, Failures: 0, Errors: 0, Skipped: 0, Time elapsed: 0.001 sec - in org.apache.commons.lang3.text.translate.EntityArraysTest
Running org.apache.commons.lang3.text.translate.UnicodeUnpairedSurrogateRemoverTest
Tests run: 2, Failures: 0, Errors: 0, Skipped: 0, Time elapsed: 0 sec - in org.apache.commons.lang3.text.translate.UnicodeUnpairedSurrogateRemoverTest
Running org.apache.commons.lang3.text.translate.NumericEntityUnescaperTest
Tests run: 3, Failures: 0, Errors: 0, Skipped: 0, Time elapsed: 0 sec - in org.apache.commons.lang3.text.translate.NumericEntityUnescaperTest
Running org.apache.commons.lang3.text.translate.NumericEntityEscaperTest
Tests run: 4, Failures: 0, Errors: 0, Skipped: 0, Time elapsed: 0 sec - in org.apache.commons.lang3.text.translate.NumericEntityEscaperTest
Running org.apache.commons.lang3.text.translate.LookupTranslatorTest
Tests run: 2, Failures: 0, Errors: 0, Skipped: 0, Time elapsed: 0 sec - in org.apache.commons.lang3.text.translate.LookupTranslatorTest
Running org.apache.commons.lang3.text.translate.UnicodeUnescaperTest
Tests run: 3, Failures: 0, Errors: 0, Skipped: 0, Time elapsed: 0 sec - in org.apache.commons.lang3.text.translate.UnicodeUnescaperTest
Running org.apache.commons.lang3.text.translate.OctalUnescaperTest
Tests run: 1, Failures: 0, Errors: 0, Skipped: 0, Time elapsed: 0 sec - in org.apache.commons.lang3.text.translate.OctalUnescaperTest
Running org.apache.commons.lang3.text.StrMatcherTest
Tests run: 14, Failures: 0, Errors: 0, Skipped: 0, Time elapsed: 0 sec - in org.apache.commons.lang3.text.StrMatcherTest
Running org.apache.commons.lang3.text.StrTokenizerTest
Tests run: 55, Failures: 0, Errors: 0, Skipped: 0, Time elapsed: 0.014 sec - in org.apache.commons.lang3.text.StrTokenizerTest
Running org.apache.commons.lang3.text.FormattableUtilsTest
Tests run: 5, Failures: 0, Errors: 0, Skipped: 0, Time elapsed: 0.001 sec - in org.apache.commons.lang3.text.FormattableUtilsTest
Running org.apache.commons.lang3.text.CompositeFormatTest
Tests run: 2, Failures: 0, Errors: 0, Skipped: 0, Time elapsed: 0 sec - in org.apache.commons.lang3.text.CompositeFormatTest
Running org.apache.commons.lang3.text.WordUtilsTest
Tests run: 12, Failures: 0, Errors: 0, Skipped: 0, Time elapsed: 0.004 sec - in org.apache.commons.lang3.text.WordUtilsTest
Running org.apache.commons.lang3.text.StrLookupTest
Tests run: 5, Failures: 0, Errors: 0, Skipped: 0, Time elapsed: 0.002 sec - in org.apache.commons.lang3.text.StrLookupTest
Running org.apache.commons.lang3.text.StrBuilderAppendInsertTest
Tests run: 51, Failures: 0, Errors: 0, Skipped: 0, Time elapsed: 0.013 sec - in org.apache.commons.lang3.text.StrBuilderAppendInsertTest
Running org.apache.commons.lang3.text.ExtendedMessageFormatTest
Tests run: 10, Failures: 0, Errors: 0, Skipped: 0, Time elapsed: 0.782 sec - in org.apache.commons.lang3.text.ExtendedMessageFormatTest
Running org.apache.commons.lang3.text.StrSubstitutorTest
Tests run: 40, Failures: 0, Errors: 0, Skipped: 0, Time elapsed: 0.031 sec - in org.apache.commons.lang3.text.StrSubstitutorTest
Running org.apache.commons.lang3.text.StrBuilderTest
Tests run: 90, Failures: 0, Errors: 0, Skipped: 0, Time elapsed: 0.045 sec - in org.apache.commons.lang3.text.StrBuilderTest
Running org.apache.commons.lang3.StringEscapeUtilsTest
Tests run: 28, Failures: 0, Errors: 0, Skipped: 0, Time elapsed: 0.339 sec - in org.apache.commons.lang3.StringEscapeUtilsTest
Running org.apache.commons.lang3.AnnotationUtilsTest
Tests run: 10, Failures: 0, Errors: 0, Skipped: 0, Time elapsed: 0.023 sec - in org.apache.commons.lang3.AnnotationUtilsTest
Running org.apache.commons.lang3.ConversionTest
Tests run: 42, Failures: 0, Errors: 0, Skipped: 0, Time elapsed: 0.018 sec - in org.apache.commons.lang3.ConversionTest
Running org.apache.commons.lang3.StringUtilsTrimEmptyTest
Tests run: 15, Failures: 0, Errors: 0, Skipped: 0, Time elapsed: 0.005 sec - in org.apache.commons.lang3.StringUtilsTrimEmptyTest
Running org.apache.commons.lang3.EnumUtilsTest
Tests run: 34, Failures: 0, Errors: 0, Skipped: 0, Time elapsed: 0.008 sec - in org.apache.commons.lang3.EnumUtilsTest
Running org.apache.commons.lang3.exception.ExceptionUtilsTest
Tests run: 28, Failures: 0, Errors: 0, Skipped: 0, Time elapsed: 0.025 sec - in org.apache.commons.lang3.exception.ExceptionUtilsTest
Running org.apache.commons.lang3.exception.DefaultExceptionContextTest
Tests run: 8, Failures: 0, Errors: 0, Skipped: 0, Time elapsed: 0.003 sec - in org.apache.commons.lang3.exception.DefaultExceptionContextTest
Running org.apache.commons.lang3.exception.ContextedExceptionTest
Tests run: 14, Failures: 0, Errors: 0, Skipped: 0, Time elapsed: 0.009 sec - in org.apache.commons.lang3.exception.ContextedExceptionTest
Running org.apache.commons.lang3.exception.ContextedRuntimeExceptionTest
Tests run: 14, Failures: 0, Errors: 0, Skipped: 0, Time elapsed: 0.014 sec - in org.apache.commons.lang3.exception.ContextedRuntimeExceptionTest
Running org.apache.commons.lang3.BitFieldTest
Tests run: 15, Failures: 0, Errors: 0, Skipped: 0, Time elapsed: 0.003 sec - in org.apache.commons.lang3.BitFieldTest
Running org.apache.commons.lang3.ArrayUtilsRemoveMultipleTest
Tests run: 55, Failures: 0, Errors: 0, Skipped: 0, Time elapsed: 0.013 sec - in org.apache.commons.lang3.ArrayUtilsRemoveMultipleTest
Running org.apache.commons.lang3.HashSetvBitSetTest
Ratio=9% array=100 count=1 extract=22432167 bitset=2103428
Ratio=11% array=100 count=10 extract=16816456 bitset=1951305
Ratio=9% array=100 count=50 extract=6085780 bitset=587938
Ratio=4% array=100 count=100 extract=9559218 bitset=431530
Ratio=84% array=1000 count=10 extract=5678972 bitset=4816512
Ratio=32% array=1000 count=100 extract=14520830 bitset=4771781
Ratio=7% array=1000 count=500 extract=42126443 bitset=3110180
Ratio=0% array=1000 count=1000 extract=74149939 bitset=709656
Ratio=4% count=0 hash=4677166 bits=194050
Ratio=9% count=5 hash=2118675 bits=204960
Ratio=32% count=10 hash=900667 bits=289090
Ratio=22% count=200 hash=18421989 bits=4151852
Ratio=16% count=50 hash=8168328 bits=1383593
Ratio=26% count=100 hash=8523424 bits=2289568
Ratio=21% count=1000 hash=73724698 bits=15579027
Ratio=21% count=2000 hash=143048723 bits=31085425
Tests run: 2, Failures: 0, Errors: 0, Skipped: 0, Time elapsed: 0.631 sec - in org.apache.commons.lang3.HashSetvBitSetTest
Running org.apache.commons.lang3.StringUtilsTest
Tests run: 124, Failures: 0, Errors: 0, Skipped: 0, Time elapsed: 0.177 sec - in org.apache.commons.lang3.StringUtilsTest
Running org.apache.commons.lang3.ArrayUtilsRemoveTest
Tests run: 19, Failures: 0, Errors: 0, Skipped: 0, Time elapsed: 0.001 sec - in org.apache.commons.lang3.ArrayUtilsRemoveTest
Running org.apache.commons.lang3.ObjectUtilsTest
Tests run: 36, Failures: 0, Errors: 0, Skipped: 0, Time elapsed: 0.01 sec - in org.apache.commons.lang3.ObjectUtilsTest
Running org.apache.commons.lang3.ClassPathUtilsTest
Tests run: 13, Failures: 0, Errors: 0, Skipped: 0, Time elapsed: 0.004 sec - in org.apache.commons.lang3.ClassPathUtilsTest
Running org.apache.commons.lang3.math.NumberUtilsTest
Tests run: 91, Failures: 0, Errors: 0, Skipped: 0, Time elapsed: 0.04 sec - in org.apache.commons.lang3.math.NumberUtilsTest
Running org.apache.commons.lang3.math.IEEE754rUtilsTest
Tests run: 3, Failures: 0, Errors: 0, Skipped: 0, Time elapsed: 0 sec - in org.apache.commons.lang3.math.IEEE754rUtilsTest
Running org.apache.commons.lang3.math.FractionTest
Tests run: 25, Failures: 0, Errors: 0, Skipped: 0, Time elapsed: 0.227 sec - in org.apache.commons.lang3.math.FractionTest
Running org.apache.commons.lang3.BooleanUtilsTest
Tests run: 72, Failures: 0, Errors: 0, Skipped: 0, Time elapsed: 0.014 sec - in org.apache.commons.lang3.BooleanUtilsTest
Running org.apache.commons.lang3.CharSequenceUtilsTest
Tests run: 2, Failures: 0, Errors: 0, Skipped: 0, Time elapsed: 0 sec - in org.apache.commons.lang3.CharSequenceUtilsTest
Running org.apache.commons.lang3.CharSetUtilsTest
Tests run: 11, Failures: 0, Errors: 0, Skipped: 0, Time elapsed: 0.002 sec - in org.apache.commons.lang3.CharSetUtilsTest
Running org.apache.commons.lang3.ArrayUtilsAddTest
Tests run: 13, Failures: 0, Errors: 0, Skipped: 0, Time elapsed: 0.002 sec - in org.apache.commons.lang3.ArrayUtilsAddTest
Running org.apache.commons.lang3.CharEncodingTest
Tests run: 6, Failures: 0, Errors: 0, Skipped: 0, Time elapsed: 0.022 sec - in org.apache.commons.lang3.CharEncodingTest
Running org.apache.commons.lang3.ClassUtilsTest
Tests run: 57, Failures: 0, Errors: 0, Skipped: 0, Time elapsed: 0.017 sec - in org.apache.commons.lang3.ClassUtilsTest
Running org.apache.commons.lang3.RangeTest
Tests run: 24, Failures: 0, Errors: 0, Skipped: 0, Time elapsed: 0.008 sec - in org.apache.commons.lang3.RangeTest
Running org.apache.commons.lang3.event.EventUtilsTest
Tests run: 8, Failures: 0, Errors: 0, Skipped: 0, Time elapsed: 0.014 sec - in org.apache.commons.lang3.event.EventUtilsTest
Running org.apache.commons.lang3.event.EventListenerSupportTest
Tests run: 9, Failures: 0, Errors: 0, Skipped: 0, Time elapsed: 0.019 sec - in org.apache.commons.lang3.event.EventListenerSupportTest
Running org.apache.commons.lang3.ArrayUtilsTest
Tests run: 205, Failures: 0, Errors: 0, Skipped: 0, Time elapsed: 0.041 sec - in org.apache.commons.lang3.ArrayUtilsTest
Running org.apache.commons.lang3.CharUtilsTest
Tests run: 24, Failures: 0, Errors: 0, Skipped: 0, Time elapsed: 0 sec - in org.apache.commons.lang3.CharUtilsTest
Running org.apache.commons.lang3.NotImplementedExceptionTest
Tests run: 1, Failures: 0, Errors: 0, Skipped: 0, Time elapsed: 0 sec - in org.apache.commons.lang3.NotImplementedExceptionTest
Running org.apache.commons.lang3.StringUtilsEqualsIndexOfTest
Tests run: 50, Failures: 0, Errors: 0, Skipped: 0, Time elapsed: 0.001 sec - in org.apache.commons.lang3.StringUtilsEqualsIndexOfTest
Running org.apache.commons.lang3.RandomUtilsTest
Tests run: 23, Failures: 0, Errors: 0, Skipped: 0, Time elapsed: 0 sec - in org.apache.commons.lang3.RandomUtilsTest

Results :

Failed tests: 
  BackgroundInitializerTest.testGetInterruptedException:246 No interrupted exception
  BackgroundInitializerTest.testGetRuntimeException:190 Runtime exception not thrown expected:<java.lang.RuntimeException> but was:<java.lang.IllegalStateException: start() must be called first!>
  MultiBackgroundInitializerTest.testInitializeRuntimeEx:291 Wrong exception expected:<java.lang.RuntimeException> but was:<java.lang.IllegalStateException: start() must be called first!>

Tests in error: 
  BackgroundInitializerTest.testGetActiveExecutorExternal:78->checkInitialize:38 » IllegalState
  BackgroundInitializerTest.testGetActiveExecutorTemp:93->checkInitialize:38 » IllegalState
  BackgroundInitializerTest.testGetBeforeStart »  Unexpected exception, expected...
  BackgroundInitializerTest.testGetCheckedException:205 » IllegalState start() m...
  BackgroundInitializerTest.testInitialize:54->checkInitialize:38 » IllegalState
  BackgroundInitializerTest.testInitializeTempExecutor:104->checkInitialize:38 » IllegalState
  BackgroundInitializerTest.testIsStartedAfterGet:275->checkInitialize:38 » IllegalState
  BackgroundInitializerTest.testSetExternalExecutor:123->checkInitialize:38 » IllegalState
  BackgroundInitializerTest.testSetExternalExecutorAfterStart:144 » IllegalState
  BackgroundInitializerTest.testStartMultipleTimes:162->checkInitialize:38 » IllegalState
  MultiBackgroundInitializerTest.testAddInitializerAfterStart:210 » IllegalState
  MultiBackgroundInitializerTest.testInitializeChildWithExecutor:187 » IllegalState
  MultiBackgroundInitializerTest.testInitializeEx:307 » IllegalState start() mus...
  MultiBackgroundInitializerTest.testInitializeExternalExec:160->checkInitialize:121 » IllegalState
  MultiBackgroundInitializerTest.testInitializeNested:370 » IllegalState start()...
  MultiBackgroundInitializerTest.testInitializeNoChildren:98 » IllegalState star...
  MultiBackgroundInitializerTest.testInitializeResultsIsSuccessfulFalse:345 » IllegalState
  MultiBackgroundInitializerTest.testInitializeResultsIsSuccessfulTrue:327 » IllegalState
  MultiBackgroundInitializerTest.testInitializeTempExec:145->checkInitialize:121 » IllegalState
  MultiBackgroundInitializerTest.testResultGetExceptionUnknown »  Unexpected exc...
  MultiBackgroundInitializerTest.testResultGetInitializerUnknown »  Unexpected e...
  MultiBackgroundInitializerTest.testResultGetResultObjectUnknown »  Unexpected ...
  MultiBackgroundInitializerTest.testResultInitializerNamesModify »  Unexpected ...
  MultiBackgroundInitializerTest.testResultIsExceptionUnknown »  Unexpected exce...


Tests run: 3526, Failures: 3, Errors: 24, Skipped: 97

[INFO] ------------------------------------------------------------------------
[INFO] BUILD FAILURE
[INFO] ------------------------------------------------------------------------
[INFO] Total time: 34.419s
[INFO] Finished at: Tue Aug 04 09:30:52 BST 2015
[INFO] Final Memory: 23M/413M
[INFO] ------------------------------------------------------------------------
[ERROR] Failed to execute goal org.apache.maven.plugins:maven-surefire-plugin:2.18:test (default-test) on project commons-lang3: There are test failures.
[ERROR] 
[ERROR] Please refer to /home/perham/Study/LittleDarwin/Cases/commons-lang3-3.4-src/target/surefire-reports for the individual test results.
[ERROR] -> [Help 1]
[ERROR] 
[ERROR] To see the full stack trace of the errors, re-run Maven with the -e switch.
[ERROR] Re-run Maven using the -X switch to enable full debug logging.
[ERROR] 
[ERROR] For more information about the errors and possible solutions, please read the following articles:
[ERROR] [Help 1] http://cwiki.apache.org/confluence/display/MAVEN/MojoFailureException
