[INFO] Scanning for projects...
[INFO]                                                                         
[INFO] ------------------------------------------------------------------------
[INFO] Building Apache Commons Lang 3.4
[INFO] ------------------------------------------------------------------------
[INFO] 
[INFO] --- maven-enforcer-plugin:1.3.1:enforce (enforce-maven-3) @ commons-lang3 ---
[INFO] 
[INFO] --- build-helper-maven-plugin:1.8:parse-version (parse-version) @ commons-lang3 ---
[INFO] 
[INFO] --- maven-antrun-plugin:1.8:run (javadoc.resources) @ commons-lang3 ---
[INFO] Executing tasks

main:
[INFO] Executed tasks
[INFO] 
[INFO] --- maven-remote-resources-plugin:1.5:process (default) @ commons-lang3 ---
[INFO] 
[INFO] --- buildnumber-maven-plugin:1.3:create (default) @ commons-lang3 ---
[INFO] Executing: /bin/sh -c cd /home/perham/Study/LittleDarwin/Cases/commons-lang3-3.4-src && svn --non-interactive info
[INFO] Working directory: /home/perham/Study/LittleDarwin/Cases/commons-lang3-3.4-src
[INFO] Storing buildNumber: ?????? at timestamp: 1438676079156
[INFO] Executing: /bin/sh -c cd /home/perham/Study/LittleDarwin/Cases/commons-lang3-3.4-src && svn --non-interactive info
[INFO] Working directory: /home/perham/Study/LittleDarwin/Cases/commons-lang3-3.4-src
[INFO] Storing buildScmBranch: UNKNOWN_BRANCH
[INFO] 
[INFO] --- maven-resources-plugin:2.7:resources (default-resources) @ commons-lang3 ---
[INFO] Using 'ISO-8859-1' encoding to copy filtered resources.
[INFO] Copying 0 resource
[INFO] Copying 2 resources to META-INF
[INFO] 
[INFO] --- maven-compiler-plugin:3.2:compile (default-compile) @ commons-lang3 ---
[INFO] Changes detected - recompiling the module!
[INFO] Compiling 133 source files to /home/perham/Study/LittleDarwin/Cases/commons-lang3-3.4-src/target/classes
[INFO] /home/perham/Study/LittleDarwin/Cases/commons-lang3-3.4-src/src/main/java/org/apache/commons/lang3/SerializationUtils.java: /home/perham/Study/LittleDarwin/Cases/commons-lang3-3.4-src/src/main/java/org/apache/commons/lang3/SerializationUtils.java uses unchecked or unsafe operations.
[INFO] /home/perham/Study/LittleDarwin/Cases/commons-lang3-3.4-src/src/main/java/org/apache/commons/lang3/SerializationUtils.java: Recompile with -Xlint:unchecked for details.
[INFO] 
[INFO] --- maven-bundle-plugin:2.5.3:manifest (bundle-manifest) @ commons-lang3 ---
[INFO] 
[INFO] --- animal-sniffer-maven-plugin:1.13:check (checkAPIcompatibility) @ commons-lang3 ---
[INFO] Checking unresolved references to org.codehaus.mojo.signature:java16:1.0
[INFO] 
[INFO] --- maven-resources-plugin:2.7:testResources (default-testResources) @ commons-lang3 ---
[INFO] Using 'ISO-8859-1' encoding to copy filtered resources.
[INFO] Copying 2 resources
[INFO] Copying 2 resources to META-INF
[INFO] 
[INFO] --- maven-compiler-plugin:3.2:testCompile (default-testCompile) @ commons-lang3 ---
[INFO] Nothing to compile - all classes are up to date
[INFO] 
[INFO] --- maven-surefire-plugin:2.18:test (default-test) @ commons-lang3 ---
[INFO] Surefire report directory: /home/perham/Study/LittleDarwin/Cases/commons-lang3-3.4-src/target/surefire-reports

-------------------------------------------------------
 T E S T S
-------------------------------------------------------
Running org.apache.commons.lang3.ValidateTest
Tests run: 63, Failures: 0, Errors: 0, Skipped: 0, Time elapsed: 0.037 sec - in org.apache.commons.lang3.ValidateTest
Running org.apache.commons.lang3.LocaleUtilsTest
Tests run: 15, Failures: 0, Errors: 0, Skipped: 0, Time elapsed: 0.022 sec - in org.apache.commons.lang3.LocaleUtilsTest
Running org.apache.commons.lang3.tuple.MutableTripleTest
Tests run: 8, Failures: 0, Errors: 0, Skipped: 0, Time elapsed: 0.014 sec - in org.apache.commons.lang3.tuple.MutableTripleTest
Running org.apache.commons.lang3.tuple.TripleTest
Tests run: 10, Failures: 0, Errors: 0, Skipped: 0, Time elapsed: 0.001 sec - in org.apache.commons.lang3.tuple.TripleTest
Running org.apache.commons.lang3.tuple.ImmutablePairTest
Tests run: 6, Failures: 0, Errors: 0, Skipped: 0, Time elapsed: 0.001 sec - in org.apache.commons.lang3.tuple.ImmutablePairTest
Running org.apache.commons.lang3.tuple.MutablePairTest
Tests run: 8, Failures: 0, Errors: 0, Skipped: 0, Time elapsed: 0.001 sec - in org.apache.commons.lang3.tuple.MutablePairTest
Running org.apache.commons.lang3.tuple.ImmutableTripleTest
Tests run: 6, Failures: 0, Errors: 0, Skipped: 0, Time elapsed: 0 sec - in org.apache.commons.lang3.tuple.ImmutableTripleTest
Running org.apache.commons.lang3.tuple.PairTest
Tests run: 9, Failures: 0, Errors: 0, Skipped: 0, Time elapsed: 0.001 sec - in org.apache.commons.lang3.tuple.PairTest
Running org.apache.commons.lang3.StringUtilsIsTest
Tests run: 8, Failures: 0, Errors: 0, Skipped: 0, Time elapsed: 0.004 sec - in org.apache.commons.lang3.StringUtilsIsTest
Running org.apache.commons.lang3.JavaVersionTest
Tests run: 3, Failures: 0, Errors: 0, Skipped: 0, Time elapsed: 0 sec - in org.apache.commons.lang3.JavaVersionTest
Running org.apache.commons.lang3.builder.NoFieldNamesToStringStyleTest
Tests run: 8, Failures: 4, Errors: 0, Skipped: 0, Time elapsed: 0.017 sec <<< FAILURE! - in org.apache.commons.lang3.builder.NoFieldNamesToStringStyleTest
testLong(org.apache.commons.lang3.builder.NoFieldNamesToStringStyleTest)  Time elapsed: 0.009 sec  <<< FAILURE!
org.junit.ComparisonFailure: expected:<...ng.Integer@3edcbc7b[[]3]> but was:<...ng.Integer@3edcbc7b[[a=]3]>
	at org.junit.Assert.assertEquals(Assert.java:115)
	at org.junit.Assert.assertEquals(Assert.java:144)
	at org.apache.commons.lang3.builder.NoFieldNamesToStringStyleTest.testLong(NoFieldNamesToStringStyleTest.java:97)

testObject(org.apache.commons.lang3.builder.NoFieldNamesToStringStyleTest)  Time elapsed: 0 sec  <<< FAILURE!
org.junit.ComparisonFailure: expected:<...ng.Integer@3edcbc7b[[]<null>]> but was:<...ng.Integer@3edcbc7b[[a=]<null>]>
	at org.junit.Assert.assertEquals(Assert.java:115)
	at org.junit.Assert.assertEquals(Assert.java:144)
	at org.apache.commons.lang3.builder.NoFieldNamesToStringStyleTest.testObject(NoFieldNamesToStringStyleTest.java:72)

testPerson(org.apache.commons.lang3.builder.NoFieldNamesToStringStyleTest)  Time elapsed: 0.001 sec  <<< FAILURE!
org.junit.ComparisonFailure: expected:<...est$Person@3a20b88e[[Ron Paul,72,]false]> but was:<...est$Person@3a20b88e[[name=Ron Paul,age=72,smoker=]false]>
	at org.junit.Assert.assertEquals(Assert.java:115)
	at org.junit.Assert.assertEquals(Assert.java:144)
	at org.apache.commons.lang3.builder.NoFieldNamesToStringStyleTest.testPerson(NoFieldNamesToStringStyleTest.java:91)

testAppendSuper(org.apache.commons.lang3.builder.NoFieldNamesToStringStyleTest)  Time elapsed: 0.001 sec  <<< FAILURE!
org.junit.ComparisonFailure: expected:<...ng.Integer@3edcbc7b[[]hello]> but was:<...ng.Integer@3edcbc7b[[a=]hello]>
	at org.junit.Assert.assertEquals(Assert.java:115)
	at org.junit.Assert.assertEquals(Assert.java:144)
	at org.apache.commons.lang3.builder.NoFieldNamesToStringStyleTest.testAppendSuper(NoFieldNamesToStringStyleTest.java:61)

Running org.apache.commons.lang3.builder.ShortPrefixToStringStyleTest
Tests run: 8, Failures: 5, Errors: 0, Skipped: 0, Time elapsed: 0.005 sec <<< FAILURE! - in org.apache.commons.lang3.builder.ShortPrefixToStringStyleTest
testObjectArray(org.apache.commons.lang3.builder.ShortPrefixToStringStyleTest)  Time elapsed: 0.002 sec  <<< FAILURE!
org.junit.ComparisonFailure: expected:<Integer[[]{<null>,5,{3,6}}]> but was:<Integer[[null=]{<null>,5,{3,6}}]>
	at org.junit.Assert.assertEquals(Assert.java:115)
	at org.junit.Assert.assertEquals(Assert.java:144)
	at org.apache.commons.lang3.builder.ShortPrefixToStringStyleTest.testObjectArray(ShortPrefixToStringStyleTest.java:104)

testLong(org.apache.commons.lang3.builder.ShortPrefixToStringStyleTest)  Time elapsed: 0 sec  <<< FAILURE!
org.junit.ComparisonFailure: expected:<Integer[[]3]> but was:<Integer[[null=]3]>
	at org.junit.Assert.assertEquals(Assert.java:115)
	at org.junit.Assert.assertEquals(Assert.java:144)
	at org.apache.commons.lang3.builder.ShortPrefixToStringStyleTest.testLong(ShortPrefixToStringStyleTest.java:96)

testLongArrayArray(org.apache.commons.lang3.builder.ShortPrefixToStringStyleTest)  Time elapsed: 0 sec  <<< FAILURE!
org.junit.ComparisonFailure: expected:<Integer[[]{{1,2},<null>,{5}}]> but was:<Integer[[null=]{{1,2},<null>,{5}}]>
	at org.junit.Assert.assertEquals(Assert.java:115)
	at org.junit.Assert.assertEquals(Assert.java:144)
	at org.apache.commons.lang3.builder.ShortPrefixToStringStyleTest.testLongArrayArray(ShortPrefixToStringStyleTest.java:124)

testLongArray(org.apache.commons.lang3.builder.ShortPrefixToStringStyleTest)  Time elapsed: 0.001 sec  <<< FAILURE!
org.junit.ComparisonFailure: expected:<Integer[[]{1,2,-3,4}]> but was:<Integer[[null=]{1,2,-3,4}]>
	at org.junit.Assert.assertEquals(Assert.java:115)
	at org.junit.Assert.assertEquals(Assert.java:144)
	at org.apache.commons.lang3.builder.ShortPrefixToStringStyleTest.testLongArray(ShortPrefixToStringStyleTest.java:114)

testObject(org.apache.commons.lang3.builder.ShortPrefixToStringStyleTest)  Time elapsed: 0 sec  <<< FAILURE!
org.junit.ComparisonFailure: expected:<Integer[[]<null>]> but was:<Integer[[null=]<null>]>
	at org.junit.Assert.assertEquals(Assert.java:115)
	at org.junit.Assert.assertEquals(Assert.java:144)
	at org.apache.commons.lang3.builder.ShortPrefixToStringStyleTest.testObject(ShortPrefixToStringStyleTest.java:70)

Running org.apache.commons.lang3.builder.DiffResultTest
Tests run: 9, Failures: 0, Errors: 0, Skipped: 0, Time elapsed: 0.006 sec - in org.apache.commons.lang3.builder.DiffResultTest
Running org.apache.commons.lang3.builder.CompareToBuilderTest
Tests run: 48, Failures: 0, Errors: 0, Skipped: 0, Time elapsed: 0.023 sec - in org.apache.commons.lang3.builder.CompareToBuilderTest
Running org.apache.commons.lang3.builder.MultilineRecursiveToStringStyleTest
Tests run: 10, Failures: 0, Errors: 0, Skipped: 0, Time elapsed: 0.004 sec - in org.apache.commons.lang3.builder.MultilineRecursiveToStringStyleTest
Running org.apache.commons.lang3.builder.RecursiveToStringStyleTest
Tests run: 8, Failures: 5, Errors: 0, Skipped: 0, Time elapsed: 0.007 sec <<< FAILURE! - in org.apache.commons.lang3.builder.RecursiveToStringStyleTest
testObjectArray(org.apache.commons.lang3.builder.RecursiveToStringStyleTest)  Time elapsed: 0 sec  <<< FAILURE!
org.junit.ComparisonFailure: expected:<...ng.Integer@3edcbc7b[[]{<null>,5,{3,6}}]> but was:<...ng.Integer@3edcbc7b[[null=]{<null>,5,{3,6}}]>
	at org.junit.Assert.assertEquals(Assert.java:115)
	at org.junit.Assert.assertEquals(Assert.java:144)
	at org.apache.commons.lang3.builder.RecursiveToStringStyleTest.testObjectArray(RecursiveToStringStyleTest.java:107)

testLong(org.apache.commons.lang3.builder.RecursiveToStringStyleTest)  Time elapsed: 0.001 sec  <<< FAILURE!
org.junit.ComparisonFailure: expected:<...ng.Integer@3edcbc7b[[]3]> but was:<...ng.Integer@3edcbc7b[[null=]3]>
	at org.junit.Assert.assertEquals(Assert.java:115)
	at org.junit.Assert.assertEquals(Assert.java:144)
	at org.apache.commons.lang3.builder.RecursiveToStringStyleTest.testLong(RecursiveToStringStyleTest.java:99)

testLongArrayArray(org.apache.commons.lang3.builder.RecursiveToStringStyleTest)  Time elapsed: 0 sec  <<< FAILURE!
org.junit.ComparisonFailure: expected:<...ng.Integer@3edcbc7b[[]{{1,2},<null>,{5}}]> but was:<...ng.Integer@3edcbc7b[[null=]{{1,2},<null>,{5}}]>
	at org.junit.Assert.assertEquals(Assert.java:115)
	at org.junit.Assert.assertEquals(Assert.java:144)
	at org.apache.commons.lang3.builder.RecursiveToStringStyleTest.testLongArrayArray(RecursiveToStringStyleTest.java:127)

testLongArray(org.apache.commons.lang3.builder.RecursiveToStringStyleTest)  Time elapsed: 0 sec  <<< FAILURE!
org.junit.ComparisonFailure: expected:<...ng.Integer@3edcbc7b[[]{1,2,-3,4}]> but was:<...ng.Integer@3edcbc7b[[null=]{1,2,-3,4}]>
	at org.junit.Assert.assertEquals(Assert.java:115)
	at org.junit.Assert.assertEquals(Assert.java:144)
	at org.apache.commons.lang3.builder.RecursiveToStringStyleTest.testLongArray(RecursiveToStringStyleTest.java:117)

testObject(org.apache.commons.lang3.builder.RecursiveToStringStyleTest)  Time elapsed: 0.001 sec  <<< FAILURE!
org.junit.ComparisonFailure: expected:<...ng.Integer@3edcbc7b[[]<null>]> but was:<...ng.Integer@3edcbc7b[[null=]<null>]>
	at org.junit.Assert.assertEquals(Assert.java:115)
	at org.junit.Assert.assertEquals(Assert.java:144)
	at org.apache.commons.lang3.builder.RecursiveToStringStyleTest.testObject(RecursiveToStringStyleTest.java:69)

Running org.apache.commons.lang3.builder.DefaultToStringStyleTest
Tests run: 8, Failures: 5, Errors: 0, Skipped: 0, Time elapsed: 0.003 sec <<< FAILURE! - in org.apache.commons.lang3.builder.DefaultToStringStyleTest
testObjectArray(org.apache.commons.lang3.builder.DefaultToStringStyleTest)  Time elapsed: 0 sec  <<< FAILURE!
org.junit.ComparisonFailure: expected:<...ng.Integer@3edcbc7b[[]{<null>,5,{3,6}}]> but was:<...ng.Integer@3edcbc7b[[null=]{<null>,5,{3,6}}]>
	at org.junit.Assert.assertEquals(Assert.java:115)
	at org.junit.Assert.assertEquals(Assert.java:144)
	at org.apache.commons.lang3.builder.DefaultToStringStyleTest.testObjectArray(DefaultToStringStyleTest.java:104)

testLong(org.apache.commons.lang3.builder.DefaultToStringStyleTest)  Time elapsed: 0 sec  <<< FAILURE!
org.junit.ComparisonFailure: expected:<...ng.Integer@3edcbc7b[[]3]> but was:<...ng.Integer@3edcbc7b[[null=]3]>
	at org.junit.Assert.assertEquals(Assert.java:115)
	at org.junit.Assert.assertEquals(Assert.java:144)
	at org.apache.commons.lang3.builder.DefaultToStringStyleTest.testLong(DefaultToStringStyleTest.java:96)

testLongArrayArray(org.apache.commons.lang3.builder.DefaultToStringStyleTest)  Time elapsed: 0.001 sec  <<< FAILURE!
org.junit.ComparisonFailure: expected:<...ng.Integer@3edcbc7b[[]{{1,2},<null>,{5}}]> but was:<...ng.Integer@3edcbc7b[[null=]{{1,2},<null>,{5}}]>
	at org.junit.Assert.assertEquals(Assert.java:115)
	at org.junit.Assert.assertEquals(Assert.java:144)
	at org.apache.commons.lang3.builder.DefaultToStringStyleTest.testLongArrayArray(DefaultToStringStyleTest.java:124)

testLongArray(org.apache.commons.lang3.builder.DefaultToStringStyleTest)  Time elapsed: 0.001 sec  <<< FAILURE!
org.junit.ComparisonFailure: expected:<...ng.Integer@3edcbc7b[[]{1,2,-3,4}]> but was:<...ng.Integer@3edcbc7b[[null=]{1,2,-3,4}]>
	at org.junit.Assert.assertEquals(Assert.java:115)
	at org.junit.Assert.assertEquals(Assert.java:144)
	at org.apache.commons.lang3.builder.DefaultToStringStyleTest.testLongArray(DefaultToStringStyleTest.java:114)

testObject(org.apache.commons.lang3.builder.DefaultToStringStyleTest)  Time elapsed: 0 sec  <<< FAILURE!
org.junit.ComparisonFailure: expected:<...ng.Integer@3edcbc7b[[]<null>]> but was:<...ng.Integer@3edcbc7b[[null=]<null>]>
	at org.junit.Assert.assertEquals(Assert.java:115)
	at org.junit.Assert.assertEquals(Assert.java:144)
	at org.apache.commons.lang3.builder.DefaultToStringStyleTest.testObject(DefaultToStringStyleTest.java:70)

Running org.apache.commons.lang3.builder.ReflectionToStringBuilderExcludeTest
Tests run: 11, Failures: 0, Errors: 0, Skipped: 0, Time elapsed: 0.003 sec - in org.apache.commons.lang3.builder.ReflectionToStringBuilderExcludeTest
Running org.apache.commons.lang3.builder.StandardToStringStyleTest
Tests run: 8, Failures: 5, Errors: 0, Skipped: 0, Time elapsed: 0.003 sec <<< FAILURE! - in org.apache.commons.lang3.builder.StandardToStringStyleTest
testObjectArray(org.apache.commons.lang3.builder.StandardToStringStyleTest)  Time elapsed: 0 sec  <<< FAILURE!
org.junit.ComparisonFailure: expected:<Integer[[][%NULL%, 5, [3, 6]]]> but was:<Integer[[null=][%NULL%, 5, [3, 6]]]>
	at org.junit.Assert.assertEquals(Assert.java:115)
	at org.junit.Assert.assertEquals(Assert.java:144)
	at org.apache.commons.lang3.builder.StandardToStringStyleTest.testObjectArray(StandardToStringStyleTest.java:119)

testLong(org.apache.commons.lang3.builder.StandardToStringStyleTest)  Time elapsed: 0 sec  <<< FAILURE!
org.junit.ComparisonFailure: expected:<Integer[[]3]> but was:<Integer[[null=]3]>
	at org.junit.Assert.assertEquals(Assert.java:115)
	at org.junit.Assert.assertEquals(Assert.java:144)
	at org.apache.commons.lang3.builder.StandardToStringStyleTest.testLong(StandardToStringStyleTest.java:111)

testLongArrayArray(org.apache.commons.lang3.builder.StandardToStringStyleTest)  Time elapsed: 0 sec  <<< FAILURE!
org.junit.ComparisonFailure: expected:<Integer[[][[1, 2], %NULL%, [5]...> but was:<Integer[[null=][[1, 2], %NULL%, [5]...>
	at org.junit.Assert.assertEquals(Assert.java:115)
	at org.junit.Assert.assertEquals(Assert.java:144)
	at org.apache.commons.lang3.builder.StandardToStringStyleTest.testLongArrayArray(StandardToStringStyleTest.java:139)

testLongArray(org.apache.commons.lang3.builder.StandardToStringStyleTest)  Time elapsed: 0.001 sec  <<< FAILURE!
org.junit.ComparisonFailure: expected:<Integer[[][1, 2, -3, 4]]> but was:<Integer[[null=][1, 2, -3, 4]]>
	at org.junit.Assert.assertEquals(Assert.java:115)
	at org.junit.Assert.assertEquals(Assert.java:144)
	at org.apache.commons.lang3.builder.StandardToStringStyleTest.testLongArray(StandardToStringStyleTest.java:129)

testObject(org.apache.commons.lang3.builder.StandardToStringStyleTest)  Time elapsed: 0 sec  <<< FAILURE!
org.junit.ComparisonFailure: expected:<Integer[[]%NULL%]> but was:<Integer[[null=]%NULL%]>
	at org.junit.Assert.assertEquals(Assert.java:115)
	at org.junit.Assert.assertEquals(Assert.java:144)
	at org.apache.commons.lang3.builder.StandardToStringStyleTest.testObject(StandardToStringStyleTest.java:85)

Running org.apache.commons.lang3.builder.ToStringStyleTest
Tests run: 12, Failures: 0, Errors: 0, Skipped: 0, Time elapsed: 0.002 sec - in org.apache.commons.lang3.builder.ToStringStyleTest
Running org.apache.commons.lang3.builder.DiffTest
Tests run: 4, Failures: 0, Errors: 0, Skipped: 0, Time elapsed: 0.001 sec - in org.apache.commons.lang3.builder.DiffTest
Running org.apache.commons.lang3.builder.SimpleToStringStyleTest
Tests run: 8, Failures: 4, Errors: 0, Skipped: 0, Time elapsed: 0.002 sec <<< FAILURE! - in org.apache.commons.lang3.builder.SimpleToStringStyleTest
testLong(org.apache.commons.lang3.builder.SimpleToStringStyleTest)  Time elapsed: 0 sec  <<< FAILURE!
org.junit.ComparisonFailure: expected:<[]3> but was:<[a=]3>
	at org.junit.Assert.assertEquals(Assert.java:115)
	at org.junit.Assert.assertEquals(Assert.java:144)
	at org.apache.commons.lang3.builder.SimpleToStringStyleTest.testLong(SimpleToStringStyleTest.java:95)

testObject(org.apache.commons.lang3.builder.SimpleToStringStyleTest)  Time elapsed: 0 sec  <<< FAILURE!
org.junit.ComparisonFailure: expected:<[]<null>> but was:<[a=]<null>>
	at org.junit.Assert.assertEquals(Assert.java:115)
	at org.junit.Assert.assertEquals(Assert.java:144)
	at org.apache.commons.lang3.builder.SimpleToStringStyleTest.testObject(SimpleToStringStyleTest.java:71)

testPerson(org.apache.commons.lang3.builder.SimpleToStringStyleTest)  Time elapsed: 0.001 sec  <<< FAILURE!
org.junit.ComparisonFailure: expected:<[Jane Q. Public,47,]false> but was:<[name=Jane Q. Public,age=47,smoker=]false>
	at org.junit.Assert.assertEquals(Assert.java:115)
	at org.junit.Assert.assertEquals(Assert.java:144)
	at org.apache.commons.lang3.builder.SimpleToStringStyleTest.testPerson(SimpleToStringStyleTest.java:89)

testAppendSuper(org.apache.commons.lang3.builder.SimpleToStringStyleTest)  Time elapsed: 0 sec  <<< FAILURE!
org.junit.ComparisonFailure: expected:<[]hello> but was:<[a=]hello>
	at org.junit.Assert.assertEquals(Assert.java:115)
	at org.junit.Assert.assertEquals(Assert.java:144)
	at org.apache.commons.lang3.builder.SimpleToStringStyleTest.testAppendSuper(SimpleToStringStyleTest.java:60)

Running org.apache.commons.lang3.builder.MultiLineToStringStyleTest
Tests run: 8, Failures: 5, Errors: 0, Skipped: 0, Time elapsed: 0.005 sec <<< FAILURE! - in org.apache.commons.lang3.builder.MultiLineToStringStyleTest
testObjectArray(org.apache.commons.lang3.builder.MultiLineToStringStyleTest)  Time elapsed: 0.001 sec  <<< FAILURE!
org.junit.ComparisonFailure: expected:<...Integer@3edcbc7b[
  []{<null>,5,{3,6}}
]> but was:<...Integer@3edcbc7b[
  [null=]{<null>,5,{3,6}}
]>
	at org.junit.Assert.assertEquals(Assert.java:115)
	at org.junit.Assert.assertEquals(Assert.java:144)
	at org.apache.commons.lang3.builder.MultiLineToStringStyleTest.testObjectArray(MultiLineToStringStyleTest.java:105)

testLong(org.apache.commons.lang3.builder.MultiLineToStringStyleTest)  Time elapsed: 0.001 sec  <<< FAILURE!
org.junit.ComparisonFailure: expected:<...Integer@3edcbc7b[
  []3
]> but was:<...Integer@3edcbc7b[
  [null=]3
]>
	at org.junit.Assert.assertEquals(Assert.java:115)
	at org.junit.Assert.assertEquals(Assert.java:144)
	at org.apache.commons.lang3.builder.MultiLineToStringStyleTest.testLong(MultiLineToStringStyleTest.java:97)

testLongArrayArray(org.apache.commons.lang3.builder.MultiLineToStringStyleTest)  Time elapsed: 0 sec  <<< FAILURE!
org.junit.ComparisonFailure: expected:<...Integer@3edcbc7b[
  []{{1,2},<null>,{5}}
]> but was:<...Integer@3edcbc7b[
  [null=]{{1,2},<null>,{5}}
]>
	at org.junit.Assert.assertEquals(Assert.java:115)
	at org.junit.Assert.assertEquals(Assert.java:144)
	at org.apache.commons.lang3.builder.MultiLineToStringStyleTest.testLongArrayArray(MultiLineToStringStyleTest.java:125)

testLongArray(org.apache.commons.lang3.builder.MultiLineToStringStyleTest)  Time elapsed: 0.001 sec  <<< FAILURE!
org.junit.ComparisonFailure: expected:<...Integer@3edcbc7b[
  []{1,2,-3,4}
]> but was:<...Integer@3edcbc7b[
  [null=]{1,2,-3,4}
]>
	at org.junit.Assert.assertEquals(Assert.java:115)
	at org.junit.Assert.assertEquals(Assert.java:144)
	at org.apache.commons.lang3.builder.MultiLineToStringStyleTest.testLongArray(MultiLineToStringStyleTest.java:115)

testObject(org.apache.commons.lang3.builder.MultiLineToStringStyleTest)  Time elapsed: 0.001 sec  <<< FAILURE!
org.junit.ComparisonFailure: expected:<...Integer@3edcbc7b[
  []<null>
]> but was:<...Integer@3edcbc7b[
  [null=]<null>
]>
	at org.junit.Assert.assertEquals(Assert.java:115)
	at org.junit.Assert.assertEquals(Assert.java:144)
	at org.apache.commons.lang3.builder.MultiLineToStringStyleTest.testObject(MultiLineToStringStyleTest.java:71)

Running org.apache.commons.lang3.builder.ToStringStyleConcurrencyTest
Tests run: 3, Failures: 0, Errors: 0, Skipped: 0, Time elapsed: 3.87 sec - in org.apache.commons.lang3.builder.ToStringStyleConcurrencyTest
Running org.apache.commons.lang3.builder.ReflectionToStringBuilderMutateInspectConcurrencyTest
Tests run: 1, Failures: 0, Errors: 0, Skipped: 1, Time elapsed: 0 sec - in org.apache.commons.lang3.builder.ReflectionToStringBuilderMutateInspectConcurrencyTest
Running org.apache.commons.lang3.builder.ToStringBuilderTest
Tests run: 74, Failures: 28, Errors: 0, Skipped: 1, Time elapsed: 0.059 sec <<< FAILURE! - in org.apache.commons.lang3.builder.ToStringBuilderTest
testCharArray(org.apache.commons.lang3.builder.ToStringBuilderTest)  Time elapsed: 0.001 sec  <<< FAILURE!
org.junit.ComparisonFailure: expected:<...ng.Integer@3edcbc7b[[]{A,2,_,D}]> but was:<...ng.Integer@3edcbc7b[[null=]{A,2,_,D}]>
	at org.junit.Assert.assertEquals(Assert.java:115)
	at org.junit.Assert.assertEquals(Assert.java:144)
	at org.apache.commons.lang3.builder.ToStringBuilderTest.testCharArray(ToStringBuilderTest.java:767)

testDoubleArrayArray(org.apache.commons.lang3.builder.ToStringBuilderTest)  Time elapsed: 0.001 sec  <<< FAILURE!
org.junit.ComparisonFailure: expected:<...ng.Integer@3edcbc7b[[]{{1.0,2.29686},<null...> but was:<...ng.Integer@3edcbc7b[[null=]{{1.0,2.29686},<null...>
	at org.junit.Assert.assertEquals(Assert.java:115)
	at org.junit.Assert.assertEquals(Assert.java:144)
	at org.apache.commons.lang3.builder.ToStringBuilderTest.testDoubleArrayArray(ToStringBuilderTest.java:857)

testObjectArray(org.apache.commons.lang3.builder.ToStringBuilderTest)  Time elapsed: 0.001 sec  <<< FAILURE!
org.junit.ComparisonFailure: expected:<...ng.Integer@3edcbc7b[[]{<null>,5,{3,6}}]> but was:<...ng.Integer@3edcbc7b[[null=]{<null>,5,{3,6}}]>
	at org.junit.Assert.assertEquals(Assert.java:115)
	at org.junit.Assert.assertEquals(Assert.java:144)
	at org.apache.commons.lang3.builder.ToStringBuilderTest.testObjectArray(ToStringBuilderTest.java:717)

testObjectBuild(org.apache.commons.lang3.builder.ToStringBuilderTest)  Time elapsed: 0 sec  <<< FAILURE!
org.junit.ComparisonFailure: expected:<...ng.Integer@3edcbc7b[[]<null>]> but was:<...ng.Integer@3edcbc7b[[null=]<null>]>
	at org.junit.Assert.assertEquals(Assert.java:115)
	at org.junit.Assert.assertEquals(Assert.java:144)
	at org.apache.commons.lang3.builder.ToStringBuilderTest.testObjectBuild(ToStringBuilderTest.java:641)

testObjectCycle(org.apache.commons.lang3.builder.ToStringBuilderTest)  Time elapsed: 0.001 sec  <<< FAILURE!
org.junit.ComparisonFailure: expected:<...bjectCycle@75b3adec[[org.apache.commons.lang3.builder.ToStringBuilderTest$ObjectCycle@675f9d52[]org.apache.commons.l...> but was:<...bjectCycle@75b3adec[[null=org.apache.commons.lang3.builder.ToStringBuilderTest$ObjectCycle@675f9d52[null=]org.apache.commons.l...>
	at org.junit.Assert.assertEquals(Assert.java:115)
	at org.junit.Assert.assertEquals(Assert.java:144)
	at org.apache.commons.lang3.builder.ToStringBuilderTest.testObjectCycle(ToStringBuilderTest.java:892)

testShortArrayArray(org.apache.commons.lang3.builder.ToStringBuilderTest)  Time elapsed: 0 sec  <<< FAILURE!
org.junit.ComparisonFailure: expected:<...ng.Integer@3edcbc7b[[]{{1,2},<null>,{5}}]> but was:<...ng.Integer@3edcbc7b[[null=]{{1,2},<null>,{5}}]>
	at org.junit.Assert.assertEquals(Assert.java:115)
	at org.junit.Assert.assertEquals(Assert.java:144)
	at org.apache.commons.lang3.builder.ToStringBuilderTest.testShortArrayArray(ToStringBuilderTest.java:827)

testBooleanArrayArray(org.apache.commons.lang3.builder.ToStringBuilderTest)  Time elapsed: 0.001 sec  <<< FAILURE!
org.junit.ComparisonFailure: expected:<...ng.Integer@3edcbc7b[[]{{true,false},<null>...> but was:<...ng.Integer@3edcbc7b[[null=]{{true,false},<null>...>
	at org.junit.Assert.assertEquals(Assert.java:115)
	at org.junit.Assert.assertEquals(Assert.java:144)
	at org.apache.commons.lang3.builder.ToStringBuilderTest.testBooleanArrayArray(ToStringBuilderTest.java:877)

testFloatArray(org.apache.commons.lang3.builder.ToStringBuilderTest)  Time elapsed: 0 sec  <<< FAILURE!
org.junit.ComparisonFailure: expected:<...ng.Integer@3edcbc7b[[]{1.0,2.9876,-3.00001...> but was:<...ng.Integer@3edcbc7b[[null=]{1.0,2.9876,-3.00001...>
	at org.junit.Assert.assertEquals(Assert.java:115)
	at org.junit.Assert.assertEquals(Assert.java:144)
	at org.apache.commons.lang3.builder.ToStringBuilderTest.testFloatArray(ToStringBuilderTest.java:787)

testInt(org.apache.commons.lang3.builder.ToStringBuilderTest)  Time elapsed: 0 sec  <<< FAILURE!
org.junit.ComparisonFailure: expected:<...ng.Integer@3edcbc7b[[]3]> but was:<...ng.Integer@3edcbc7b[[null=]3]>
	at org.junit.Assert.assertEquals(Assert.java:115)
	at org.junit.Assert.assertEquals(Assert.java:144)
	at org.apache.commons.lang3.builder.ToStringBuilderTest.testInt(ToStringBuilderTest.java:665)

testByteArray(org.apache.commons.lang3.builder.ToStringBuilderTest)  Time elapsed: 0.001 sec  <<< FAILURE!
org.junit.ComparisonFailure: expected:<...ng.Integer@3edcbc7b[[]{1,2,-3,4}]> but was:<...ng.Integer@3edcbc7b[[null=]{1,2,-3,4}]>
	at org.junit.Assert.assertEquals(Assert.java:115)
	at org.junit.Assert.assertEquals(Assert.java:144)
	at org.apache.commons.lang3.builder.ToStringBuilderTest.testByteArray(ToStringBuilderTest.java:757)

testFloat(org.apache.commons.lang3.builder.ToStringBuilderTest)  Time elapsed: 0.001 sec  <<< FAILURE!
org.junit.ComparisonFailure: expected:<...ng.Integer@3edcbc7b[[]3.2]> but was:<...ng.Integer@3edcbc7b[[null=]3.2]>
	at org.junit.Assert.assertEquals(Assert.java:115)
	at org.junit.Assert.assertEquals(Assert.java:144)
	at org.apache.commons.lang3.builder.ToStringBuilderTest.testFloat(ToStringBuilderTest.java:701)

testShort(org.apache.commons.lang3.builder.ToStringBuilderTest)  Time elapsed: 0.002 sec  <<< FAILURE!
org.junit.ComparisonFailure: expected:<...ng.Integer@3edcbc7b[[]3]> but was:<...ng.Integer@3edcbc7b[[null=]3]>
	at org.junit.Assert.assertEquals(Assert.java:115)
	at org.junit.Assert.assertEquals(Assert.java:144)
	at org.apache.commons.lang3.builder.ToStringBuilderTest.testShort(ToStringBuilderTest.java:672)

testByte(org.apache.commons.lang3.builder.ToStringBuilderTest)  Time elapsed: 0 sec  <<< FAILURE!
org.junit.ComparisonFailure: expected:<...ng.Integer@3edcbc7b[[]3]> but was:<...ng.Integer@3edcbc7b[[null=]3]>
	at org.junit.Assert.assertEquals(Assert.java:115)
	at org.junit.Assert.assertEquals(Assert.java:144)
	at org.apache.commons.lang3.builder.ToStringBuilderTest.testByte(ToStringBuilderTest.java:686)

testChar(org.apache.commons.lang3.builder.ToStringBuilderTest)  Time elapsed: 0 sec  <<< FAILURE!
org.junit.ComparisonFailure: expected:<...ng.Integer@3edcbc7b[[]A]> but was:<...ng.Integer@3edcbc7b[[null=]A]>
	at org.junit.Assert.assertEquals(Assert.java:115)
	at org.junit.Assert.assertEquals(Assert.java:144)
	at org.apache.commons.lang3.builder.ToStringBuilderTest.testChar(ToStringBuilderTest.java:679)

testLong(org.apache.commons.lang3.builder.ToStringBuilderTest)  Time elapsed: 0.001 sec  <<< FAILURE!
org.junit.ComparisonFailure: expected:<...ng.Integer@3edcbc7b[[]3]> but was:<...ng.Integer@3edcbc7b[[null=]3]>
	at org.junit.Assert.assertEquals(Assert.java:115)
	at org.junit.Assert.assertEquals(Assert.java:144)
	at org.apache.commons.lang3.builder.ToStringBuilderTest.testLong(ToStringBuilderTest.java:657)

testLongArrayArray(org.apache.commons.lang3.builder.ToStringBuilderTest)  Time elapsed: 0 sec  <<< FAILURE!
org.junit.ComparisonFailure: expected:<...ng.Integer@3edcbc7b[[]{{1,2},<null>,{5}}]> but was:<...ng.Integer@3edcbc7b[[null=]{{1,2},<null>,{5}}]>
	at org.junit.Assert.assertEquals(Assert.java:115)
	at org.junit.Assert.assertEquals(Assert.java:144)
	at org.apache.commons.lang3.builder.ToStringBuilderTest.testLongArrayArray(ToStringBuilderTest.java:807)

testBoolean(org.apache.commons.lang3.builder.ToStringBuilderTest)  Time elapsed: 0 sec  <<< FAILURE!
org.junit.ComparisonFailure: expected:<...ng.Integer@3edcbc7b[[]true]> but was:<...ng.Integer@3edcbc7b[[null=]true]>
	at org.junit.Assert.assertEquals(Assert.java:115)
	at org.junit.Assert.assertEquals(Assert.java:144)
	at org.apache.commons.lang3.builder.ToStringBuilderTest.testBoolean(ToStringBuilderTest.java:708)

testBooleanArray(org.apache.commons.lang3.builder.ToStringBuilderTest)  Time elapsed: 0.001 sec  <<< FAILURE!
org.junit.ComparisonFailure: expected:<...ng.Integer@3edcbc7b[[]{true,false,false}]> but was:<...ng.Integer@3edcbc7b[[null=]{true,false,false}]>
	at org.junit.Assert.assertEquals(Assert.java:115)
	at org.junit.Assert.assertEquals(Assert.java:144)
	at org.apache.commons.lang3.builder.ToStringBuilderTest.testBooleanArray(ToStringBuilderTest.java:797)

testFloatArrayArray(org.apache.commons.lang3.builder.ToStringBuilderTest)  Time elapsed: 0 sec  <<< FAILURE!
org.junit.ComparisonFailure: expected:<...ng.Integer@3edcbc7b[[]{{1.0,2.29686},<null...> but was:<...ng.Integer@3edcbc7b[[null=]{{1.0,2.29686},<null...>
	at org.junit.Assert.assertEquals(Assert.java:115)
	at org.junit.Assert.assertEquals(Assert.java:144)
	at org.apache.commons.lang3.builder.ToStringBuilderTest.testFloatArrayArray(ToStringBuilderTest.java:867)

testLongArray(org.apache.commons.lang3.builder.ToStringBuilderTest)  Time elapsed: 0.001 sec  <<< FAILURE!
org.junit.ComparisonFailure: expected:<...ng.Integer@3edcbc7b[[]{1,2,-3,4}]> but was:<...ng.Integer@3edcbc7b[[null=]{1,2,-3,4}]>
	at org.junit.Assert.assertEquals(Assert.java:115)
	at org.junit.Assert.assertEquals(Assert.java:144)
	at org.apache.commons.lang3.builder.ToStringBuilderTest.testLongArray(ToStringBuilderTest.java:727)

testShortArray(org.apache.commons.lang3.builder.ToStringBuilderTest)  Time elapsed: 0 sec  <<< FAILURE!
org.junit.ComparisonFailure: expected:<...ng.Integer@3edcbc7b[[]{1,2,-3,4}]> but was:<...ng.Integer@3edcbc7b[[null=]{1,2,-3,4}]>
	at org.junit.Assert.assertEquals(Assert.java:115)
	at org.junit.Assert.assertEquals(Assert.java:144)
	at org.apache.commons.lang3.builder.ToStringBuilderTest.testShortArray(ToStringBuilderTest.java:747)

testIntArrayArray(org.apache.commons.lang3.builder.ToStringBuilderTest)  Time elapsed: 0.001 sec  <<< FAILURE!
org.junit.ComparisonFailure: expected:<...ng.Integer@3edcbc7b[[]{{1,2},<null>,{5}}]> but was:<...ng.Integer@3edcbc7b[[null=]{{1,2},<null>,{5}}]>
	at org.junit.Assert.assertEquals(Assert.java:115)
	at org.junit.Assert.assertEquals(Assert.java:144)
	at org.apache.commons.lang3.builder.ToStringBuilderTest.testIntArrayArray(ToStringBuilderTest.java:817)

testIntArray(org.apache.commons.lang3.builder.ToStringBuilderTest)  Time elapsed: 0 sec  <<< FAILURE!
org.junit.ComparisonFailure: expected:<...ng.Integer@3edcbc7b[[]{1,2,-3,4}]> but was:<...ng.Integer@3edcbc7b[[null=]{1,2,-3,4}]>
	at org.junit.Assert.assertEquals(Assert.java:115)
	at org.junit.Assert.assertEquals(Assert.java:144)
	at org.apache.commons.lang3.builder.ToStringBuilderTest.testIntArray(ToStringBuilderTest.java:737)

testDouble(org.apache.commons.lang3.builder.ToStringBuilderTest)  Time elapsed: 0.001 sec  <<< FAILURE!
org.junit.ComparisonFailure: expected:<...ng.Integer@3edcbc7b[[]3.2]> but was:<...ng.Integer@3edcbc7b[[null=]3.2]>
	at org.junit.Assert.assertEquals(Assert.java:115)
	at org.junit.Assert.assertEquals(Assert.java:144)
	at org.apache.commons.lang3.builder.ToStringBuilderTest.testDouble(ToStringBuilderTest.java:694)

testByteArrayArray(org.apache.commons.lang3.builder.ToStringBuilderTest)  Time elapsed: 0 sec  <<< FAILURE!
org.junit.ComparisonFailure: expected:<...ng.Integer@3edcbc7b[[]{{1,2},<null>,{5}}]> but was:<...ng.Integer@3edcbc7b[[null=]{{1,2},<null>,{5}}]>
	at org.junit.Assert.assertEquals(Assert.java:115)
	at org.junit.Assert.assertEquals(Assert.java:144)
	at org.apache.commons.lang3.builder.ToStringBuilderTest.testByteArrayArray(ToStringBuilderTest.java:837)

testCharArrayArray(org.apache.commons.lang3.builder.ToStringBuilderTest)  Time elapsed: 0 sec  <<< FAILURE!
org.junit.ComparisonFailure: expected:<...ng.Integer@3edcbc7b[[]{{A,B},<null>,{p}}]> but was:<...ng.Integer@3edcbc7b[[null=]{{A,B},<null>,{p}}]>
	at org.junit.Assert.assertEquals(Assert.java:115)
	at org.junit.Assert.assertEquals(Assert.java:144)
	at org.apache.commons.lang3.builder.ToStringBuilderTest.testCharArrayArray(ToStringBuilderTest.java:847)

testObject(org.apache.commons.lang3.builder.ToStringBuilderTest)  Time elapsed: 0 sec  <<< FAILURE!
org.junit.ComparisonFailure: expected:<...ng.Integer@3edcbc7b[[]<null>]> but was:<...ng.Integer@3edcbc7b[[null=]<null>]>
	at org.junit.Assert.assertEquals(Assert.java:115)
	at org.junit.Assert.assertEquals(Assert.java:144)
	at org.apache.commons.lang3.builder.ToStringBuilderTest.testObject(ToStringBuilderTest.java:623)

testDoubleArray(org.apache.commons.lang3.builder.ToStringBuilderTest)  Time elapsed: 0.001 sec  <<< FAILURE!
org.junit.ComparisonFailure: expected:<...ng.Integer@3edcbc7b[[]{1.0,2.9876,-3.00001...> but was:<...ng.Integer@3edcbc7b[[null=]{1.0,2.9876,-3.00001...>
	at org.junit.Assert.assertEquals(Assert.java:115)
	at org.junit.Assert.assertEquals(Assert.java:144)
	at org.apache.commons.lang3.builder.ToStringBuilderTest.testDoubleArray(ToStringBuilderTest.java:777)

Running org.apache.commons.lang3.builder.EqualsBuilderTest
Tests run: 48, Failures: 0, Errors: 0, Skipped: 0, Time elapsed: 0.024 sec - in org.apache.commons.lang3.builder.EqualsBuilderTest
Running org.apache.commons.lang3.builder.HashCodeBuilderAndEqualsBuilderTest
Tests run: 4, Failures: 0, Errors: 0, Skipped: 0, Time elapsed: 0.007 sec - in org.apache.commons.lang3.builder.HashCodeBuilderAndEqualsBuilderTest
Running org.apache.commons.lang3.builder.ReflectionToStringBuilderConcurrencyTest
Tests run: 3, Failures: 0, Errors: 0, Skipped: 3, Time elapsed: 0 sec - in org.apache.commons.lang3.builder.ReflectionToStringBuilderConcurrencyTest
Running org.apache.commons.lang3.builder.JsonToStringStyleTest
Tests run: 9, Failures: 0, Errors: 0, Skipped: 0, Time elapsed: 0.003 sec - in org.apache.commons.lang3.builder.JsonToStringStyleTest
Running org.apache.commons.lang3.builder.NoClassNameToStringStyleTest
Tests run: 8, Failures: 5, Errors: 0, Skipped: 0, Time elapsed: 0.007 sec <<< FAILURE! - in org.apache.commons.lang3.builder.NoClassNameToStringStyleTest
testObjectArray(org.apache.commons.lang3.builder.NoClassNameToStringStyleTest)  Time elapsed: 0.001 sec  <<< FAILURE!
org.junit.ComparisonFailure: expected:<[[]{<null>,5,{3,6}}]> but was:<[[null=]{<null>,5,{3,6}}]>
	at org.junit.Assert.assertEquals(Assert.java:115)
	at org.junit.Assert.assertEquals(Assert.java:144)
	at org.apache.commons.lang3.builder.NoClassNameToStringStyleTest.testObjectArray(NoClassNameToStringStyleTest.java:102)

testLong(org.apache.commons.lang3.builder.NoClassNameToStringStyleTest)  Time elapsed: 0.001 sec  <<< FAILURE!
org.junit.ComparisonFailure: expected:<[[]3]> but was:<[[null=]3]>
	at org.junit.Assert.assertEquals(Assert.java:115)
	at org.junit.Assert.assertEquals(Assert.java:144)
	at org.apache.commons.lang3.builder.NoClassNameToStringStyleTest.testLong(NoClassNameToStringStyleTest.java:94)

testLongArrayArray(org.apache.commons.lang3.builder.NoClassNameToStringStyleTest)  Time elapsed: 0.001 sec  <<< FAILURE!
org.junit.ComparisonFailure: expected:<[[]{{1,2},<null>,{5}}]> but was:<[[null=]{{1,2},<null>,{5}}]>
	at org.junit.Assert.assertEquals(Assert.java:115)
	at org.junit.Assert.assertEquals(Assert.java:144)
	at org.apache.commons.lang3.builder.NoClassNameToStringStyleTest.testLongArrayArray(NoClassNameToStringStyleTest.java:122)

testLongArray(org.apache.commons.lang3.builder.NoClassNameToStringStyleTest)  Time elapsed: 0 sec  <<< FAILURE!
org.junit.ComparisonFailure: expected:<[[]{1,2,-3,4}]> but was:<[[null=]{1,2,-3,4}]>
	at org.junit.Assert.assertEquals(Assert.java:115)
	at org.junit.Assert.assertEquals(Assert.java:144)
	at org.apache.commons.lang3.builder.NoClassNameToStringStyleTest.testLongArray(NoClassNameToStringStyleTest.java:112)

testObject(org.apache.commons.lang3.builder.NoClassNameToStringStyleTest)  Time elapsed: 0 sec  <<< FAILURE!
org.junit.ComparisonFailure: expected:<[[]<null>]> but was:<[[null=]<null>]>
	at org.junit.Assert.assertEquals(Assert.java:115)
	at org.junit.Assert.assertEquals(Assert.java:144)
	at org.apache.commons.lang3.builder.NoClassNameToStringStyleTest.testObject(NoClassNameToStringStyleTest.java:69)

Running org.apache.commons.lang3.builder.DiffBuilderTest
Tests run: 30, Failures: 0, Errors: 0, Skipped: 0, Time elapsed: 0.026 sec - in org.apache.commons.lang3.builder.DiffBuilderTest
Running org.apache.commons.lang3.builder.HashCodeBuilderTest
Tests run: 44, Failures: 0, Errors: 0, Skipped: 0, Time elapsed: 0.015 sec - in org.apache.commons.lang3.builder.HashCodeBuilderTest
Running org.apache.commons.lang3.concurrent.AtomicInitializerTest
Tests run: 3, Failures: 0, Errors: 0, Skipped: 0, Time elapsed: 0.008 sec - in org.apache.commons.lang3.concurrent.AtomicInitializerTest
Running org.apache.commons.lang3.concurrent.CallableBackgroundInitializerTest
Tests run: 4, Failures: 0, Errors: 0, Skipped: 0, Time elapsed: 0.001 sec - in org.apache.commons.lang3.concurrent.CallableBackgroundInitializerTest
Running org.apache.commons.lang3.concurrent.BackgroundInitializerTest
Tests run: 15, Failures: 0, Errors: 0, Skipped: 0, Time elapsed: 0.012 sec - in org.apache.commons.lang3.concurrent.BackgroundInitializerTest
Running org.apache.commons.lang3.concurrent.LazyInitializerTest
Tests run: 3, Failures: 0, Errors: 0, Skipped: 0, Time elapsed: 0.01 sec - in org.apache.commons.lang3.concurrent.LazyInitializerTest
Running org.apache.commons.lang3.concurrent.BasicThreadFactoryTest
Tests run: 15, Failures: 0, Errors: 0, Skipped: 0, Time elapsed: 0.042 sec - in org.apache.commons.lang3.concurrent.BasicThreadFactoryTest
Running org.apache.commons.lang3.concurrent.ConstantInitializerTest
Tests run: 7, Failures: 0, Errors: 0, Skipped: 0, Time elapsed: 0.001 sec - in org.apache.commons.lang3.concurrent.ConstantInitializerTest
Running org.apache.commons.lang3.concurrent.MultiBackgroundInitializerTest
Tests run: 17, Failures: 0, Errors: 0, Skipped: 0, Time elapsed: 0.065 sec - in org.apache.commons.lang3.concurrent.MultiBackgroundInitializerTest
Running org.apache.commons.lang3.concurrent.AtomicSafeInitializerTest
Tests run: 4, Failures: 0, Errors: 0, Skipped: 0, Time elapsed: 0.009 sec - in org.apache.commons.lang3.concurrent.AtomicSafeInitializerTest
Running org.apache.commons.lang3.concurrent.ConcurrentUtilsTest
Tests run: 40, Failures: 0, Errors: 0, Skipped: 0, Time elapsed: 0.016 sec - in org.apache.commons.lang3.concurrent.ConcurrentUtilsTest
Running org.apache.commons.lang3.concurrent.TimedSemaphoreTest
Tests run: 15, Failures: 0, Errors: 0, Skipped: 0, Time elapsed: 1.199 sec - in org.apache.commons.lang3.concurrent.TimedSemaphoreTest
Running org.apache.commons.lang3.StringUtilsSubstringTest
Tests run: 14, Failures: 0, Errors: 0, Skipped: 0, Time elapsed: 0.006 sec - in org.apache.commons.lang3.StringUtilsSubstringTest
Running org.apache.commons.lang3.SystemUtilsTest
Tests run: 12, Failures: 0, Errors: 0, Skipped: 0, Time elapsed: 0.03 sec - in org.apache.commons.lang3.SystemUtilsTest
Running org.apache.commons.lang3.CharRangeTest
Tests run: 16, Failures: 0, Errors: 0, Skipped: 0, Time elapsed: 0.022 sec - in org.apache.commons.lang3.CharRangeTest
Running org.apache.commons.lang3.CharSetTest
Tests run: 14, Failures: 0, Errors: 0, Skipped: 0, Time elapsed: 0.01 sec - in org.apache.commons.lang3.CharSetTest
Running org.apache.commons.lang3.StringUtilsStartsEndsWithTest
Tests run: 6, Failures: 0, Errors: 0, Skipped: 0, Time elapsed: 0.003 sec - in org.apache.commons.lang3.StringUtilsStartsEndsWithTest
Running org.apache.commons.lang3.RandomStringUtilsTest
Tests run: 11, Failures: 0, Errors: 0, Skipped: 0, Time elapsed: 0.034 sec - in org.apache.commons.lang3.RandomStringUtilsTest
Running org.apache.commons.lang3.SerializationUtilsTest
Tests run: 26, Failures: 0, Errors: 0, Skipped: 0, Time elapsed: 0.045 sec - in org.apache.commons.lang3.SerializationUtilsTest
Running org.apache.commons.lang3.time.StopWatchTest
Tests run: 8, Failures: 0, Errors: 0, Skipped: 0, Time elapsed: 4.766 sec - in org.apache.commons.lang3.time.StopWatchTest
Running org.apache.commons.lang3.time.DateUtilsRoundingTest
Tests run: 22, Failures: 0, Errors: 0, Skipped: 0, Time elapsed: 0.158 sec - in org.apache.commons.lang3.time.DateUtilsRoundingTest
Running org.apache.commons.lang3.time.FastDateParserTest
Tests run: 33, Failures: 0, Errors: 0, Skipped: 0, Time elapsed: 2.124 sec - in org.apache.commons.lang3.time.FastDateParserTest
Running org.apache.commons.lang3.time.FastDateFormat_ParserTest
Tests run: 33, Failures: 0, Errors: 0, Skipped: 0, Time elapsed: 0.722 sec - in org.apache.commons.lang3.time.FastDateFormat_ParserTest
Running org.apache.commons.lang3.time.DurationFormatUtilsTest
Tests run: 25, Failures: 0, Errors: 0, Skipped: 0, Time elapsed: 0.774 sec - in org.apache.commons.lang3.time.DurationFormatUtilsTest
Running org.apache.commons.lang3.time.DateFormatUtilsTest
Tests run: 10, Failures: 0, Errors: 0, Skipped: 0, Time elapsed: 0.002 sec - in org.apache.commons.lang3.time.DateFormatUtilsTest
Running org.apache.commons.lang3.time.DateUtilsFragmentTest
Tests run: 57, Failures: 0, Errors: 0, Skipped: 0, Time elapsed: 0.01 sec - in org.apache.commons.lang3.time.DateUtilsFragmentTest
Running org.apache.commons.lang3.time.FastDatePrinterTimeZonesTest
Tests run: 617, Failures: 0, Errors: 0, Skipped: 0, Time elapsed: 0.213 sec - in org.apache.commons.lang3.time.FastDatePrinterTimeZonesTest
Running org.apache.commons.lang3.time.FastDateFormatTest
>>FastDateFormatTest: FastDateParser:37191  SimpleDateFormat:3273
Tests run: 14, Failures: 0, Errors: 0, Skipped: 0, Time elapsed: 4.347 sec - in org.apache.commons.lang3.time.FastDateFormatTest
Running org.apache.commons.lang3.time.FastDateFormat_PrinterTest
Tests run: 17, Failures: 0, Errors: 0, Skipped: 0, Time elapsed: 0.009 sec - in org.apache.commons.lang3.time.FastDateFormat_PrinterTest
Running org.apache.commons.lang3.time.FastDatePrinterTest
Tests run: 17, Failures: 0, Errors: 0, Skipped: 0, Time elapsed: 0.005 sec - in org.apache.commons.lang3.time.FastDatePrinterTest
Running org.apache.commons.lang3.time.FastDateParserSDFTest
Tests run: 276, Failures: 0, Errors: 0, Skipped: 92, Time elapsed: 0.064 sec - in org.apache.commons.lang3.time.FastDateParserSDFTest
Running org.apache.commons.lang3.time.DateUtilsTest
DateUtilsTest: Default Locale=en_US
Tests run: 38, Failures: 0, Errors: 0, Skipped: 0, Time elapsed: 0.021 sec - in org.apache.commons.lang3.time.DateUtilsTest
Running org.apache.commons.lang3.reflect.InheritanceUtilsTest
Tests run: 9, Failures: 0, Errors: 0, Skipped: 0, Time elapsed: 0.003 sec - in org.apache.commons.lang3.reflect.InheritanceUtilsTest
Running org.apache.commons.lang3.reflect.MethodUtilsTest
Tests run: 23, Failures: 0, Errors: 0, Skipped: 0, Time elapsed: 0.048 sec - in org.apache.commons.lang3.reflect.MethodUtilsTest
Running org.apache.commons.lang3.reflect.ConstructorUtilsTest
Tests run: 7, Failures: 0, Errors: 0, Skipped: 0, Time elapsed: 0.005 sec - in org.apache.commons.lang3.reflect.ConstructorUtilsTest
Running org.apache.commons.lang3.reflect.FieldUtilsTest
Tests run: 64, Failures: 0, Errors: 0, Skipped: 0, Time elapsed: 0.029 sec - in org.apache.commons.lang3.reflect.FieldUtilsTest
Running org.apache.commons.lang3.reflect.TypeLiteralTest
Tests run: 4, Failures: 0, Errors: 0, Skipped: 0, Time elapsed: 0.004 sec - in org.apache.commons.lang3.reflect.TypeLiteralTest
Running org.apache.commons.lang3.reflect.TypeUtilsTest
Tests run: 19, Failures: 0, Errors: 0, Skipped: 0, Time elapsed: 0.046 sec - in org.apache.commons.lang3.reflect.TypeUtilsTest
Running org.apache.commons.lang3.mutable.MutableByteTest
Tests run: 17, Failures: 0, Errors: 0, Skipped: 0, Time elapsed: 0.003 sec - in org.apache.commons.lang3.mutable.MutableByteTest
Running org.apache.commons.lang3.mutable.MutableShortTest
Tests run: 14, Failures: 0, Errors: 0, Skipped: 0, Time elapsed: 0.003 sec - in org.apache.commons.lang3.mutable.MutableShortTest
Running org.apache.commons.lang3.mutable.MutableIntTest
Tests run: 17, Failures: 0, Errors: 0, Skipped: 0, Time elapsed: 0.005 sec - in org.apache.commons.lang3.mutable.MutableIntTest
Running org.apache.commons.lang3.mutable.MutableDoubleTest
Tests run: 18, Failures: 0, Errors: 0, Skipped: 0, Time elapsed: 0.005 sec - in org.apache.commons.lang3.mutable.MutableDoubleTest
Running org.apache.commons.lang3.mutable.MutableFloatTest
Tests run: 18, Failures: 0, Errors: 0, Skipped: 0, Time elapsed: 0.006 sec - in org.apache.commons.lang3.mutable.MutableFloatTest
Running org.apache.commons.lang3.mutable.MutableLongTest
Tests run: 17, Failures: 0, Errors: 0, Skipped: 0, Time elapsed: 0.002 sec - in org.apache.commons.lang3.mutable.MutableLongTest
Running org.apache.commons.lang3.mutable.MutableBooleanTest
Tests run: 9, Failures: 0, Errors: 0, Skipped: 0, Time elapsed: 0.003 sec - in org.apache.commons.lang3.mutable.MutableBooleanTest
Running org.apache.commons.lang3.mutable.MutableObjectTest
Tests run: 5, Failures: 0, Errors: 0, Skipped: 0, Time elapsed: 0.001 sec - in org.apache.commons.lang3.mutable.MutableObjectTest
Running org.apache.commons.lang3.text.translate.UnicodeEscaperTest
Tests run: 3, Failures: 0, Errors: 0, Skipped: 0, Time elapsed: 0.001 sec - in org.apache.commons.lang3.text.translate.UnicodeEscaperTest
Running org.apache.commons.lang3.text.translate.EntityArraysTest
Tests run: 3, Failures: 0, Errors: 0, Skipped: 0, Time elapsed: 0 sec - in org.apache.commons.lang3.text.translate.EntityArraysTest
Running org.apache.commons.lang3.text.translate.UnicodeUnpairedSurrogateRemoverTest
Tests run: 2, Failures: 0, Errors: 0, Skipped: 0, Time elapsed: 0 sec - in org.apache.commons.lang3.text.translate.UnicodeUnpairedSurrogateRemoverTest
Running org.apache.commons.lang3.text.translate.NumericEntityUnescaperTest
Tests run: 3, Failures: 0, Errors: 0, Skipped: 0, Time elapsed: 0.001 sec - in org.apache.commons.lang3.text.translate.NumericEntityUnescaperTest
Running org.apache.commons.lang3.text.translate.NumericEntityEscaperTest
Tests run: 4, Failures: 0, Errors: 0, Skipped: 0, Time elapsed: 0.001 sec - in org.apache.commons.lang3.text.translate.NumericEntityEscaperTest
Running org.apache.commons.lang3.text.translate.LookupTranslatorTest
Tests run: 2, Failures: 0, Errors: 0, Skipped: 0, Time elapsed: 0.001 sec - in org.apache.commons.lang3.text.translate.LookupTranslatorTest
Running org.apache.commons.lang3.text.translate.UnicodeUnescaperTest
Tests run: 3, Failures: 0, Errors: 0, Skipped: 0, Time elapsed: 0 sec - in org.apache.commons.lang3.text.translate.UnicodeUnescaperTest
Running org.apache.commons.lang3.text.translate.OctalUnescaperTest
Tests run: 1, Failures: 0, Errors: 0, Skipped: 0, Time elapsed: 0 sec - in org.apache.commons.lang3.text.translate.OctalUnescaperTest
Running org.apache.commons.lang3.text.StrMatcherTest
Tests run: 14, Failures: 0, Errors: 0, Skipped: 0, Time elapsed: 0.004 sec - in org.apache.commons.lang3.text.StrMatcherTest
Running org.apache.commons.lang3.text.StrTokenizerTest
Tests run: 55, Failures: 0, Errors: 0, Skipped: 0, Time elapsed: 0.01 sec - in org.apache.commons.lang3.text.StrTokenizerTest
Running org.apache.commons.lang3.text.FormattableUtilsTest
Tests run: 5, Failures: 0, Errors: 0, Skipped: 0, Time elapsed: 0 sec - in org.apache.commons.lang3.text.FormattableUtilsTest
Running org.apache.commons.lang3.text.CompositeFormatTest
Tests run: 2, Failures: 0, Errors: 0, Skipped: 0, Time elapsed: 0 sec - in org.apache.commons.lang3.text.CompositeFormatTest
Running org.apache.commons.lang3.text.WordUtilsTest
Tests run: 12, Failures: 0, Errors: 0, Skipped: 0, Time elapsed: 0.003 sec - in org.apache.commons.lang3.text.WordUtilsTest
Running org.apache.commons.lang3.text.StrLookupTest
Tests run: 5, Failures: 0, Errors: 0, Skipped: 0, Time elapsed: 0.001 sec - in org.apache.commons.lang3.text.StrLookupTest
Running org.apache.commons.lang3.text.StrBuilderAppendInsertTest
Tests run: 51, Failures: 0, Errors: 0, Skipped: 0, Time elapsed: 0.009 sec - in org.apache.commons.lang3.text.StrBuilderAppendInsertTest
Running org.apache.commons.lang3.text.ExtendedMessageFormatTest
Tests run: 10, Failures: 0, Errors: 0, Skipped: 0, Time elapsed: 0.748 sec - in org.apache.commons.lang3.text.ExtendedMessageFormatTest
Running org.apache.commons.lang3.text.StrSubstitutorTest
Tests run: 40, Failures: 0, Errors: 0, Skipped: 0, Time elapsed: 0.031 sec - in org.apache.commons.lang3.text.StrSubstitutorTest
Running org.apache.commons.lang3.text.StrBuilderTest
Tests run: 90, Failures: 0, Errors: 0, Skipped: 0, Time elapsed: 0.041 sec - in org.apache.commons.lang3.text.StrBuilderTest
Running org.apache.commons.lang3.StringEscapeUtilsTest
Tests run: 28, Failures: 0, Errors: 0, Skipped: 0, Time elapsed: 0.38 sec - in org.apache.commons.lang3.StringEscapeUtilsTest
Running org.apache.commons.lang3.AnnotationUtilsTest
Tests run: 10, Failures: 0, Errors: 0, Skipped: 0, Time elapsed: 0.02 sec - in org.apache.commons.lang3.AnnotationUtilsTest
Running org.apache.commons.lang3.ConversionTest
Tests run: 42, Failures: 0, Errors: 0, Skipped: 0, Time elapsed: 0.015 sec - in org.apache.commons.lang3.ConversionTest
Running org.apache.commons.lang3.StringUtilsTrimEmptyTest
Tests run: 15, Failures: 0, Errors: 0, Skipped: 0, Time elapsed: 0.006 sec - in org.apache.commons.lang3.StringUtilsTrimEmptyTest
Running org.apache.commons.lang3.EnumUtilsTest
Tests run: 34, Failures: 0, Errors: 0, Skipped: 0, Time elapsed: 0.008 sec - in org.apache.commons.lang3.EnumUtilsTest
Running org.apache.commons.lang3.exception.ExceptionUtilsTest
Tests run: 28, Failures: 0, Errors: 0, Skipped: 0, Time elapsed: 0.026 sec - in org.apache.commons.lang3.exception.ExceptionUtilsTest
Running org.apache.commons.lang3.exception.DefaultExceptionContextTest
Tests run: 8, Failures: 0, Errors: 0, Skipped: 0, Time elapsed: 0.004 sec - in org.apache.commons.lang3.exception.DefaultExceptionContextTest
Running org.apache.commons.lang3.exception.ContextedExceptionTest
Tests run: 14, Failures: 0, Errors: 0, Skipped: 0, Time elapsed: 0.009 sec - in org.apache.commons.lang3.exception.ContextedExceptionTest
Running org.apache.commons.lang3.exception.ContextedRuntimeExceptionTest
Tests run: 14, Failures: 0, Errors: 0, Skipped: 0, Time elapsed: 0.01 sec - in org.apache.commons.lang3.exception.ContextedRuntimeExceptionTest
Running org.apache.commons.lang3.BitFieldTest
Tests run: 15, Failures: 0, Errors: 0, Skipped: 0, Time elapsed: 0.002 sec - in org.apache.commons.lang3.BitFieldTest
Running org.apache.commons.lang3.ArrayUtilsRemoveMultipleTest
Tests run: 55, Failures: 0, Errors: 0, Skipped: 0, Time elapsed: 0.013 sec - in org.apache.commons.lang3.ArrayUtilsRemoveMultipleTest
Running org.apache.commons.lang3.HashSetvBitSetTest
Ratio=9% array=100 count=1 extract=20824279 bitset=1881007
Ratio=34% array=100 count=10 extract=5475007 bitset=1863393
Ratio=7% array=100 count=50 extract=11312537 bitset=843439
Ratio=4% array=100 count=100 extract=12000599 bitset=574880
Ratio=80% array=1000 count=10 extract=5824793 bitset=4704274
Ratio=28% array=1000 count=100 extract=13761119 bitset=3986736
Ratio=7% array=1000 count=500 extract=41543802 bitset=2931341
Ratio=0% array=1000 count=1000 extract=79574891 bitset=739316
Ratio=4% count=0 hash=3336872 bits=134363
Ratio=33% count=5 hash=559939 bits=186170
Ratio=31% count=10 hash=872790 bits=273511
Ratio=22% count=200 hash=18581193 bits=4140706
Ratio=12% count=50 hash=9007217 bits=1139910
Ratio=27% count=100 hash=8210804 bits=2292438
Ratio=21% count=1000 hash=71456026 bits=15712212
Ratio=21% count=2000 hash=145375663 bits=31069778
Tests run: 2, Failures: 0, Errors: 0, Skipped: 0, Time elapsed: 0.617 sec - in org.apache.commons.lang3.HashSetvBitSetTest
Running org.apache.commons.lang3.StringUtilsTest
Tests run: 124, Failures: 0, Errors: 0, Skipped: 0, Time elapsed: 0.192 sec - in org.apache.commons.lang3.StringUtilsTest
Running org.apache.commons.lang3.ArrayUtilsRemoveTest
Tests run: 19, Failures: 0, Errors: 0, Skipped: 0, Time elapsed: 0.002 sec - in org.apache.commons.lang3.ArrayUtilsRemoveTest
Running org.apache.commons.lang3.ObjectUtilsTest
Tests run: 36, Failures: 0, Errors: 0, Skipped: 0, Time elapsed: 0.012 sec - in org.apache.commons.lang3.ObjectUtilsTest
Running org.apache.commons.lang3.ClassPathUtilsTest
Tests run: 13, Failures: 0, Errors: 0, Skipped: 0, Time elapsed: 0.002 sec - in org.apache.commons.lang3.ClassPathUtilsTest
Running org.apache.commons.lang3.math.NumberUtilsTest
Tests run: 91, Failures: 0, Errors: 0, Skipped: 0, Time elapsed: 0.025 sec - in org.apache.commons.lang3.math.NumberUtilsTest
Running org.apache.commons.lang3.math.IEEE754rUtilsTest
Tests run: 3, Failures: 0, Errors: 0, Skipped: 0, Time elapsed: 0 sec - in org.apache.commons.lang3.math.IEEE754rUtilsTest
Running org.apache.commons.lang3.math.FractionTest
Tests run: 25, Failures: 0, Errors: 0, Skipped: 0, Time elapsed: 0.123 sec - in org.apache.commons.lang3.math.FractionTest
Running org.apache.commons.lang3.BooleanUtilsTest
Tests run: 72, Failures: 0, Errors: 0, Skipped: 0, Time elapsed: 0.015 sec - in org.apache.commons.lang3.BooleanUtilsTest
Running org.apache.commons.lang3.CharSequenceUtilsTest
Tests run: 2, Failures: 0, Errors: 0, Skipped: 0, Time elapsed: 0.001 sec - in org.apache.commons.lang3.CharSequenceUtilsTest
Running org.apache.commons.lang3.CharSetUtilsTest
Tests run: 11, Failures: 0, Errors: 0, Skipped: 0, Time elapsed: 0.001 sec - in org.apache.commons.lang3.CharSetUtilsTest
Running org.apache.commons.lang3.ArrayUtilsAddTest
Tests run: 13, Failures: 0, Errors: 0, Skipped: 0, Time elapsed: 0.001 sec - in org.apache.commons.lang3.ArrayUtilsAddTest
Running org.apache.commons.lang3.CharEncodingTest
Tests run: 6, Failures: 0, Errors: 0, Skipped: 0, Time elapsed: 0.031 sec - in org.apache.commons.lang3.CharEncodingTest
Running org.apache.commons.lang3.ClassUtilsTest
Tests run: 57, Failures: 0, Errors: 0, Skipped: 0, Time elapsed: 0.024 sec - in org.apache.commons.lang3.ClassUtilsTest
Running org.apache.commons.lang3.RangeTest
Tests run: 24, Failures: 0, Errors: 0, Skipped: 0, Time elapsed: 0.009 sec - in org.apache.commons.lang3.RangeTest
Running org.apache.commons.lang3.event.EventUtilsTest
Tests run: 8, Failures: 0, Errors: 0, Skipped: 0, Time elapsed: 0.013 sec - in org.apache.commons.lang3.event.EventUtilsTest
Running org.apache.commons.lang3.event.EventListenerSupportTest
Tests run: 9, Failures: 0, Errors: 0, Skipped: 0, Time elapsed: 0.022 sec - in org.apache.commons.lang3.event.EventListenerSupportTest
Running org.apache.commons.lang3.ArrayUtilsTest
Tests run: 205, Failures: 0, Errors: 0, Skipped: 0, Time elapsed: 0.071 sec - in org.apache.commons.lang3.ArrayUtilsTest
Running org.apache.commons.lang3.CharUtilsTest
Tests run: 24, Failures: 0, Errors: 0, Skipped: 0, Time elapsed: 0.001 sec - in org.apache.commons.lang3.CharUtilsTest
Running org.apache.commons.lang3.NotImplementedExceptionTest
Tests run: 1, Failures: 0, Errors: 0, Skipped: 0, Time elapsed: 0 sec - in org.apache.commons.lang3.NotImplementedExceptionTest
Running org.apache.commons.lang3.StringUtilsEqualsIndexOfTest
Tests run: 50, Failures: 0, Errors: 0, Skipped: 0, Time elapsed: 0.009 sec - in org.apache.commons.lang3.StringUtilsEqualsIndexOfTest
Running org.apache.commons.lang3.RandomUtilsTest
Tests run: 23, Failures: 0, Errors: 0, Skipped: 0, Time elapsed: 0.001 sec - in org.apache.commons.lang3.RandomUtilsTest

Results :

Failed tests: 
  DefaultToStringStyleTest.testLong:96 expected:<...ng.Integer@3edcbc7b[[]3]> but was:<...ng.Integer@3edcbc7b[[null=]3]>
  DefaultToStringStyleTest.testLongArray:114 expected:<...ng.Integer@3edcbc7b[[]{1,2,-3,4}]> but was:<...ng.Integer@3edcbc7b[[null=]{1,2,-3,4}]>
  DefaultToStringStyleTest.testLongArrayArray:124 expected:<...ng.Integer@3edcbc7b[[]{{1,2},<null>,{5}}]> but was:<...ng.Integer@3edcbc7b[[null=]{{1,2},<null>,{5}}]>
  DefaultToStringStyleTest.testObject:70 expected:<...ng.Integer@3edcbc7b[[]<null>]> but was:<...ng.Integer@3edcbc7b[[null=]<null>]>
  DefaultToStringStyleTest.testObjectArray:104 expected:<...ng.Integer@3edcbc7b[[]{<null>,5,{3,6}}]> but was:<...ng.Integer@3edcbc7b[[null=]{<null>,5,{3,6}}]>
  MultiLineToStringStyleTest.testLong:97 expected:<...Integer@3edcbc7b[
  []3
]> but was:<...Integer@3edcbc7b[
  [null=]3
]>
  MultiLineToStringStyleTest.testLongArray:115 expected:<...Integer@3edcbc7b[
  []{1,2,-3,4}
]> but was:<...Integer@3edcbc7b[
  [null=]{1,2,-3,4}
]>
  MultiLineToStringStyleTest.testLongArrayArray:125 expected:<...Integer@3edcbc7b[
  []{{1,2},<null>,{5}}
]> but was:<...Integer@3edcbc7b[
  [null=]{{1,2},<null>,{5}}
]>
  MultiLineToStringStyleTest.testObject:71 expected:<...Integer@3edcbc7b[
  []<null>
]> but was:<...Integer@3edcbc7b[
  [null=]<null>
]>
  MultiLineToStringStyleTest.testObjectArray:105 expected:<...Integer@3edcbc7b[
  []{<null>,5,{3,6}}
]> but was:<...Integer@3edcbc7b[
  [null=]{<null>,5,{3,6}}
]>
  NoClassNameToStringStyleTest.testLong:94 expected:<[[]3]> but was:<[[null=]3]>
  NoClassNameToStringStyleTest.testLongArray:112 expected:<[[]{1,2,-3,4}]> but was:<[[null=]{1,2,-3,4}]>
  NoClassNameToStringStyleTest.testLongArrayArray:122 expected:<[[]{{1,2},<null>,{5}}]> but was:<[[null=]{{1,2},<null>,{5}}]>
  NoClassNameToStringStyleTest.testObject:69 expected:<[[]<null>]> but was:<[[null=]<null>]>
  NoClassNameToStringStyleTest.testObjectArray:102 expected:<[[]{<null>,5,{3,6}}]> but was:<[[null=]{<null>,5,{3,6}}]>
  NoFieldNamesToStringStyleTest.testAppendSuper:61 expected:<...ng.Integer@3edcbc7b[[]hello]> but was:<...ng.Integer@3edcbc7b[[a=]hello]>
  NoFieldNamesToStringStyleTest.testLong:97 expected:<...ng.Integer@3edcbc7b[[]3]> but was:<...ng.Integer@3edcbc7b[[a=]3]>
  NoFieldNamesToStringStyleTest.testObject:72 expected:<...ng.Integer@3edcbc7b[[]<null>]> but was:<...ng.Integer@3edcbc7b[[a=]<null>]>
  NoFieldNamesToStringStyleTest.testPerson:91 expected:<...est$Person@3a20b88e[[Ron Paul,72,]false]> but was:<...est$Person@3a20b88e[[name=Ron Paul,age=72,smoker=]false]>
  RecursiveToStringStyleTest.testLong:99 expected:<...ng.Integer@3edcbc7b[[]3]> but was:<...ng.Integer@3edcbc7b[[null=]3]>
  RecursiveToStringStyleTest.testLongArray:117 expected:<...ng.Integer@3edcbc7b[[]{1,2,-3,4}]> but was:<...ng.Integer@3edcbc7b[[null=]{1,2,-3,4}]>
  RecursiveToStringStyleTest.testLongArrayArray:127 expected:<...ng.Integer@3edcbc7b[[]{{1,2},<null>,{5}}]> but was:<...ng.Integer@3edcbc7b[[null=]{{1,2},<null>,{5}}]>
  RecursiveToStringStyleTest.testObject:69 expected:<...ng.Integer@3edcbc7b[[]<null>]> but was:<...ng.Integer@3edcbc7b[[null=]<null>]>
  RecursiveToStringStyleTest.testObjectArray:107 expected:<...ng.Integer@3edcbc7b[[]{<null>,5,{3,6}}]> but was:<...ng.Integer@3edcbc7b[[null=]{<null>,5,{3,6}}]>
  ShortPrefixToStringStyleTest.testLong:96 expected:<Integer[[]3]> but was:<Integer[[null=]3]>
  ShortPrefixToStringStyleTest.testLongArray:114 expected:<Integer[[]{1,2,-3,4}]> but was:<Integer[[null=]{1,2,-3,4}]>
  ShortPrefixToStringStyleTest.testLongArrayArray:124 expected:<Integer[[]{{1,2},<null>,{5}}]> but was:<Integer[[null=]{{1,2},<null>,{5}}]>
  ShortPrefixToStringStyleTest.testObject:70 expected:<Integer[[]<null>]> but was:<Integer[[null=]<null>]>
  ShortPrefixToStringStyleTest.testObjectArray:104 expected:<Integer[[]{<null>,5,{3,6}}]> but was:<Integer[[null=]{<null>,5,{3,6}}]>
  SimpleToStringStyleTest.testAppendSuper:60 expected:<[]hello> but was:<[a=]hello>
  SimpleToStringStyleTest.testLong:95 expected:<[]3> but was:<[a=]3>
  SimpleToStringStyleTest.testObject:71 expected:<[]<null>> but was:<[a=]<null>>
  SimpleToStringStyleTest.testPerson:89 expected:<[Jane Q. Public,47,]false> but was:<[name=Jane Q. Public,age=47,smoker=]false>
  StandardToStringStyleTest.testLong:111 expected:<Integer[[]3]> but was:<Integer[[null=]3]>
  StandardToStringStyleTest.testLongArray:129 expected:<Integer[[][1, 2, -3, 4]]> but was:<Integer[[null=][1, 2, -3, 4]]>
  StandardToStringStyleTest.testLongArrayArray:139 expected:<Integer[[][[1, 2], %NULL%, [5]...> but was:<Integer[[null=][[1, 2], %NULL%, [5]...>
  StandardToStringStyleTest.testObject:85 expected:<Integer[[]%NULL%]> but was:<Integer[[null=]%NULL%]>
  StandardToStringStyleTest.testObjectArray:119 expected:<Integer[[][%NULL%, 5, [3, 6]]]> but was:<Integer[[null=][%NULL%, 5, [3, 6]]]>
  ToStringBuilderTest.testBoolean:708 expected:<...ng.Integer@3edcbc7b[[]true]> but was:<...ng.Integer@3edcbc7b[[null=]true]>
  ToStringBuilderTest.testBooleanArray:797 expected:<...ng.Integer@3edcbc7b[[]{true,false,false}]> but was:<...ng.Integer@3edcbc7b[[null=]{true,false,false}]>
  ToStringBuilderTest.testBooleanArrayArray:877 expected:<...ng.Integer@3edcbc7b[[]{{true,false},<null>...> but was:<...ng.Integer@3edcbc7b[[null=]{{true,false},<null>...>
  ToStringBuilderTest.testByte:686 expected:<...ng.Integer@3edcbc7b[[]3]> but was:<...ng.Integer@3edcbc7b[[null=]3]>
  ToStringBuilderTest.testByteArray:757 expected:<...ng.Integer@3edcbc7b[[]{1,2,-3,4}]> but was:<...ng.Integer@3edcbc7b[[null=]{1,2,-3,4}]>
  ToStringBuilderTest.testByteArrayArray:837 expected:<...ng.Integer@3edcbc7b[[]{{1,2},<null>,{5}}]> but was:<...ng.Integer@3edcbc7b[[null=]{{1,2},<null>,{5}}]>
  ToStringBuilderTest.testChar:679 expected:<...ng.Integer@3edcbc7b[[]A]> but was:<...ng.Integer@3edcbc7b[[null=]A]>
  ToStringBuilderTest.testCharArray:767 expected:<...ng.Integer@3edcbc7b[[]{A,2,_,D}]> but was:<...ng.Integer@3edcbc7b[[null=]{A,2,_,D}]>
  ToStringBuilderTest.testCharArrayArray:847 expected:<...ng.Integer@3edcbc7b[[]{{A,B},<null>,{p}}]> but was:<...ng.Integer@3edcbc7b[[null=]{{A,B},<null>,{p}}]>
  ToStringBuilderTest.testDouble:694 expected:<...ng.Integer@3edcbc7b[[]3.2]> but was:<...ng.Integer@3edcbc7b[[null=]3.2]>
  ToStringBuilderTest.testDoubleArray:777 expected:<...ng.Integer@3edcbc7b[[]{1.0,2.9876,-3.00001...> but was:<...ng.Integer@3edcbc7b[[null=]{1.0,2.9876,-3.00001...>
  ToStringBuilderTest.testDoubleArrayArray:857 expected:<...ng.Integer@3edcbc7b[[]{{1.0,2.29686},<null...> but was:<...ng.Integer@3edcbc7b[[null=]{{1.0,2.29686},<null...>
  ToStringBuilderTest.testFloat:701 expected:<...ng.Integer@3edcbc7b[[]3.2]> but was:<...ng.Integer@3edcbc7b[[null=]3.2]>
  ToStringBuilderTest.testFloatArray:787 expected:<...ng.Integer@3edcbc7b[[]{1.0,2.9876,-3.00001...> but was:<...ng.Integer@3edcbc7b[[null=]{1.0,2.9876,-3.00001...>
  ToStringBuilderTest.testFloatArrayArray:867 expected:<...ng.Integer@3edcbc7b[[]{{1.0,2.29686},<null...> but was:<...ng.Integer@3edcbc7b[[null=]{{1.0,2.29686},<null...>
  ToStringBuilderTest.testInt:665 expected:<...ng.Integer@3edcbc7b[[]3]> but was:<...ng.Integer@3edcbc7b[[null=]3]>
  ToStringBuilderTest.testIntArray:737 expected:<...ng.Integer@3edcbc7b[[]{1,2,-3,4}]> but was:<...ng.Integer@3edcbc7b[[null=]{1,2,-3,4}]>
  ToStringBuilderTest.testIntArrayArray:817 expected:<...ng.Integer@3edcbc7b[[]{{1,2},<null>,{5}}]> but was:<...ng.Integer@3edcbc7b[[null=]{{1,2},<null>,{5}}]>
  ToStringBuilderTest.testLong:657 expected:<...ng.Integer@3edcbc7b[[]3]> but was:<...ng.Integer@3edcbc7b[[null=]3]>
  ToStringBuilderTest.testLongArray:727 expected:<...ng.Integer@3edcbc7b[[]{1,2,-3,4}]> but was:<...ng.Integer@3edcbc7b[[null=]{1,2,-3,4}]>
  ToStringBuilderTest.testLongArrayArray:807 expected:<...ng.Integer@3edcbc7b[[]{{1,2},<null>,{5}}]> but was:<...ng.Integer@3edcbc7b[[null=]{{1,2},<null>,{5}}]>
  ToStringBuilderTest.testObject:623 expected:<...ng.Integer@3edcbc7b[[]<null>]> but was:<...ng.Integer@3edcbc7b[[null=]<null>]>
  ToStringBuilderTest.testObjectArray:717 expected:<...ng.Integer@3edcbc7b[[]{<null>,5,{3,6}}]> but was:<...ng.Integer@3edcbc7b[[null=]{<null>,5,{3,6}}]>
  ToStringBuilderTest.testObjectBuild:641 expected:<...ng.Integer@3edcbc7b[[]<null>]> but was:<...ng.Integer@3edcbc7b[[null=]<null>]>
  ToStringBuilderTest.testObjectCycle:892 expected:<...bjectCycle@75b3adec[[org.apache.commons.lang3.builder.ToStringBuilderTest$ObjectCycle@675f9d52[]org.apache.commons.l...> but was:<...bjectCycle@75b3adec[[null=org.apache.commons.lang3.builder.ToStringBuilderTest$ObjectCycle@675f9d52[null=]org.apache.commons.l...>
  ToStringBuilderTest.testShort:672 expected:<...ng.Integer@3edcbc7b[[]3]> but was:<...ng.Integer@3edcbc7b[[null=]3]>
  ToStringBuilderTest.testShortArray:747 expected:<...ng.Integer@3edcbc7b[[]{1,2,-3,4}]> but was:<...ng.Integer@3edcbc7b[[null=]{1,2,-3,4}]>
  ToStringBuilderTest.testShortArrayArray:827 expected:<...ng.Integer@3edcbc7b[[]{{1,2},<null>,{5}}]> but was:<...ng.Integer@3edcbc7b[[null=]{{1,2},<null>,{5}}]>



Tests run: 3526, Failures: 66, Errors: 0, Skipped: 97

[INFO] ------------------------------------------------------------------------
[INFO] BUILD FAILURE
[INFO] ------------------------------------------------------------------------
[INFO] Total time: 35.034s
[INFO] Finished at: Tue Aug 04 09:15:11 BST 2015
[INFO] Final Memory: 23M/414M
[INFO] ------------------------------------------------------------------------
[ERROR] Failed to execute goal org.apache.maven.plugins:maven-surefire-plugin:2.18:test (default-test) on project commons-lang3: There are test failures.
[ERROR] 
[ERROR] Please refer to /home/perham/Study/LittleDarwin/Cases/commons-lang3-3.4-src/target/surefire-reports for the individual test results.
[ERROR] -> [Help 1]
[ERROR] 
[ERROR] To see the full stack trace of the errors, re-run Maven with the -e switch.
[ERROR] Re-run Maven using the -X switch to enable full debug logging.
[ERROR] 
[ERROR] For more information about the errors and possible solutions, please read the following articles:
[ERROR] [Help 1] http://cwiki.apache.org/confluence/display/MAVEN/MojoFailureException
