[INFO] Scanning for projects...
[INFO]                                                                         
[INFO] ------------------------------------------------------------------------
[INFO] Building Apache Commons Lang 3.4
[INFO] ------------------------------------------------------------------------
[INFO] 
[INFO] --- maven-enforcer-plugin:1.3.1:enforce (enforce-maven-3) @ commons-lang3 ---
[INFO] 
[INFO] --- build-helper-maven-plugin:1.8:parse-version (parse-version) @ commons-lang3 ---
[INFO] 
[INFO] --- maven-antrun-plugin:1.8:run (javadoc.resources) @ commons-lang3 ---
[INFO] Executing tasks

main:
[INFO] Executed tasks
[INFO] 
[INFO] --- maven-remote-resources-plugin:1.5:process (default) @ commons-lang3 ---
[INFO] 
[INFO] --- buildnumber-maven-plugin:1.3:create (default) @ commons-lang3 ---
[INFO] Executing: /bin/sh -c cd /home/perham/Study/LittleDarwin/Cases/commons-lang3-3.4-src && svn --non-interactive info
[INFO] Working directory: /home/perham/Study/LittleDarwin/Cases/commons-lang3-3.4-src
[INFO] Storing buildNumber: ?????? at timestamp: 1438675504137
[INFO] Executing: /bin/sh -c cd /home/perham/Study/LittleDarwin/Cases/commons-lang3-3.4-src && svn --non-interactive info
[INFO] Working directory: /home/perham/Study/LittleDarwin/Cases/commons-lang3-3.4-src
[INFO] Storing buildScmBranch: UNKNOWN_BRANCH
[INFO] 
[INFO] --- maven-resources-plugin:2.7:resources (default-resources) @ commons-lang3 ---
[INFO] Using 'ISO-8859-1' encoding to copy filtered resources.
[INFO] Copying 0 resource
[INFO] Copying 2 resources to META-INF
[INFO] 
[INFO] --- maven-compiler-plugin:3.2:compile (default-compile) @ commons-lang3 ---
[INFO] Changes detected - recompiling the module!
[INFO] Compiling 133 source files to /home/perham/Study/LittleDarwin/Cases/commons-lang3-3.4-src/target/classes
[INFO] /home/perham/Study/LittleDarwin/Cases/commons-lang3-3.4-src/src/main/java/org/apache/commons/lang3/SerializationUtils.java: /home/perham/Study/LittleDarwin/Cases/commons-lang3-3.4-src/src/main/java/org/apache/commons/lang3/SerializationUtils.java uses unchecked or unsafe operations.
[INFO] /home/perham/Study/LittleDarwin/Cases/commons-lang3-3.4-src/src/main/java/org/apache/commons/lang3/SerializationUtils.java: Recompile with -Xlint:unchecked for details.
[INFO] 
[INFO] --- maven-bundle-plugin:2.5.3:manifest (bundle-manifest) @ commons-lang3 ---
[INFO] 
[INFO] --- animal-sniffer-maven-plugin:1.13:check (checkAPIcompatibility) @ commons-lang3 ---
[INFO] Checking unresolved references to org.codehaus.mojo.signature:java16:1.0
[INFO] 
[INFO] --- maven-resources-plugin:2.7:testResources (default-testResources) @ commons-lang3 ---
[INFO] Using 'ISO-8859-1' encoding to copy filtered resources.
[INFO] Copying 2 resources
[INFO] Copying 2 resources to META-INF
[INFO] 
[INFO] --- maven-compiler-plugin:3.2:testCompile (default-testCompile) @ commons-lang3 ---
[INFO] Nothing to compile - all classes are up to date
[INFO] 
[INFO] --- maven-surefire-plugin:2.18:test (default-test) @ commons-lang3 ---
[INFO] Surefire report directory: /home/perham/Study/LittleDarwin/Cases/commons-lang3-3.4-src/target/surefire-reports

-------------------------------------------------------
 T E S T S
-------------------------------------------------------
Running org.apache.commons.lang3.ValidateTest
Tests run: 63, Failures: 0, Errors: 0, Skipped: 0, Time elapsed: 0.05 sec - in org.apache.commons.lang3.ValidateTest
Running org.apache.commons.lang3.LocaleUtilsTest
Tests run: 15, Failures: 0, Errors: 0, Skipped: 0, Time elapsed: 0.02 sec - in org.apache.commons.lang3.LocaleUtilsTest
Running org.apache.commons.lang3.tuple.MutableTripleTest
Tests run: 8, Failures: 0, Errors: 0, Skipped: 0, Time elapsed: 0.008 sec - in org.apache.commons.lang3.tuple.MutableTripleTest
Running org.apache.commons.lang3.tuple.TripleTest
Tests run: 10, Failures: 0, Errors: 0, Skipped: 0, Time elapsed: 0.002 sec - in org.apache.commons.lang3.tuple.TripleTest
Running org.apache.commons.lang3.tuple.ImmutablePairTest
Tests run: 6, Failures: 0, Errors: 0, Skipped: 0, Time elapsed: 0 sec - in org.apache.commons.lang3.tuple.ImmutablePairTest
Running org.apache.commons.lang3.tuple.MutablePairTest
Tests run: 8, Failures: 0, Errors: 0, Skipped: 0, Time elapsed: 0 sec - in org.apache.commons.lang3.tuple.MutablePairTest
Running org.apache.commons.lang3.tuple.ImmutableTripleTest
Tests run: 6, Failures: 0, Errors: 0, Skipped: 0, Time elapsed: 0.001 sec - in org.apache.commons.lang3.tuple.ImmutableTripleTest
Running org.apache.commons.lang3.tuple.PairTest
Tests run: 9, Failures: 0, Errors: 0, Skipped: 0, Time elapsed: 0.001 sec - in org.apache.commons.lang3.tuple.PairTest
Running org.apache.commons.lang3.StringUtilsIsTest
Tests run: 8, Failures: 0, Errors: 0, Skipped: 0, Time elapsed: 0.008 sec - in org.apache.commons.lang3.StringUtilsIsTest
Running org.apache.commons.lang3.JavaVersionTest
Tests run: 3, Failures: 0, Errors: 0, Skipped: 0, Time elapsed: 0.001 sec - in org.apache.commons.lang3.JavaVersionTest
Running org.apache.commons.lang3.builder.NoFieldNamesToStringStyleTest
Tests run: 8, Failures: 8, Errors: 0, Skipped: 0, Time elapsed: 0.017 sec <<< FAILURE! - in org.apache.commons.lang3.builder.NoFieldNamesToStringStyleTest
testObjectArray(org.apache.commons.lang3.builder.NoFieldNamesToStringStyleTest)  Time elapsed: 0.013 sec  <<< FAILURE!
org.junit.ComparisonFailure: expected:<...f7b[{<null>,5,{3,6}}[]]> but was:<...f7b[{<null>,5,{3,6}}[,]]>
	at org.junit.Assert.assertEquals(Assert.java:115)
	at org.junit.Assert.assertEquals(Assert.java:144)
	at org.apache.commons.lang3.builder.NoFieldNamesToStringStyleTest.testObjectArray(NoFieldNamesToStringStyleTest.java:104)

testBlank(org.apache.commons.lang3.builder.NoFieldNamesToStringStyleTest)  Time elapsed: 0 sec  <<< FAILURE!
org.junit.ComparisonFailure: expected:<...lang.Integer@dda4f7b[[]]> but was:<...lang.Integer@dda4f7b[]]>
	at org.junit.Assert.assertEquals(Assert.java:115)
	at org.junit.Assert.assertEquals(Assert.java:144)
	at org.apache.commons.lang3.builder.NoFieldNamesToStringStyleTest.testBlank(NoFieldNamesToStringStyleTest.java:53)

testLong(org.apache.commons.lang3.builder.NoFieldNamesToStringStyleTest)  Time elapsed: 0 sec  <<< FAILURE!
org.junit.ComparisonFailure: expected:<...ng.Integer@dda4f7b[3[]]> but was:<...ng.Integer@dda4f7b[3[,]]>
	at org.junit.Assert.assertEquals(Assert.java:115)
	at org.junit.Assert.assertEquals(Assert.java:144)
	at org.apache.commons.lang3.builder.NoFieldNamesToStringStyleTest.testLong(NoFieldNamesToStringStyleTest.java:96)

testLongArrayArray(org.apache.commons.lang3.builder.NoFieldNamesToStringStyleTest)  Time elapsed: 0 sec  <<< FAILURE!
org.junit.ComparisonFailure: expected:<...b[{{1,2},<null>,{5}}[]]> but was:<...b[{{1,2},<null>,{5}}[,]]>
	at org.junit.Assert.assertEquals(Assert.java:115)
	at org.junit.Assert.assertEquals(Assert.java:144)
	at org.apache.commons.lang3.builder.NoFieldNamesToStringStyleTest.testLongArrayArray(NoFieldNamesToStringStyleTest.java:124)

testLongArray(org.apache.commons.lang3.builder.NoFieldNamesToStringStyleTest)  Time elapsed: 0.001 sec  <<< FAILURE!
org.junit.ComparisonFailure: expected:<...r@dda4f7b[{1,2,-3,4}[]]> but was:<...r@dda4f7b[{1,2,-3,4}[,]]>
	at org.junit.Assert.assertEquals(Assert.java:115)
	at org.junit.Assert.assertEquals(Assert.java:144)
	at org.apache.commons.lang3.builder.NoFieldNamesToStringStyleTest.testLongArray(NoFieldNamesToStringStyleTest.java:114)

testObject(org.apache.commons.lang3.builder.NoFieldNamesToStringStyleTest)  Time elapsed: 0.001 sec  <<< FAILURE!
org.junit.ComparisonFailure: expected:<...teger@dda4f7b[<null>[]]> but was:<...teger@dda4f7b[<null>[,]]>
	at org.junit.Assert.assertEquals(Assert.java:115)
	at org.junit.Assert.assertEquals(Assert.java:144)
	at org.apache.commons.lang3.builder.NoFieldNamesToStringStyleTest.testObject(NoFieldNamesToStringStyleTest.java:70)

testPerson(org.apache.commons.lang3.builder.NoFieldNamesToStringStyleTest)  Time elapsed: 0.001 sec  <<< FAILURE!
org.junit.ComparisonFailure: expected:<...ae[Ron Paul,72,false[]]> but was:<...ae[Ron Paul,72,false[,]]>
	at org.junit.Assert.assertEquals(Assert.java:115)
	at org.junit.Assert.assertEquals(Assert.java:144)
	at org.apache.commons.lang3.builder.NoFieldNamesToStringStyleTest.testPerson(NoFieldNamesToStringStyleTest.java:91)

testAppendSuper(org.apache.commons.lang3.builder.NoFieldNamesToStringStyleTest)  Time elapsed: 0 sec  <<< FAILURE!
org.junit.ComparisonFailure: expected:<...lang.Integer@dda4f7b[[]]> but was:<...lang.Integer@dda4f7b[]]>
	at org.junit.Assert.assertEquals(Assert.java:115)
	at org.junit.Assert.assertEquals(Assert.java:144)
	at org.apache.commons.lang3.builder.NoFieldNamesToStringStyleTest.testAppendSuper(NoFieldNamesToStringStyleTest.java:58)

Running org.apache.commons.lang3.builder.ShortPrefixToStringStyleTest
Tests run: 8, Failures: 8, Errors: 0, Skipped: 0, Time elapsed: 0.002 sec <<< FAILURE! - in org.apache.commons.lang3.builder.ShortPrefixToStringStyleTest
testObjectArray(org.apache.commons.lang3.builder.ShortPrefixToStringStyleTest)  Time elapsed: 0 sec  <<< FAILURE!
org.junit.ComparisonFailure: expected:<...ger[{<null>,5,{3,6}}[]]> but was:<...ger[{<null>,5,{3,6}}[,]]>
	at org.junit.Assert.assertEquals(Assert.java:115)
	at org.junit.Assert.assertEquals(Assert.java:144)
	at org.apache.commons.lang3.builder.ShortPrefixToStringStyleTest.testObjectArray(ShortPrefixToStringStyleTest.java:104)

testBlank(org.apache.commons.lang3.builder.ShortPrefixToStringStyleTest)  Time elapsed: 0 sec  <<< FAILURE!
org.junit.ComparisonFailure: expected:<Integer[[]]> but was:<Integer[]]>
	at org.junit.Assert.assertEquals(Assert.java:115)
	at org.junit.Assert.assertEquals(Assert.java:144)
	at org.apache.commons.lang3.builder.ShortPrefixToStringStyleTest.testBlank(ShortPrefixToStringStyleTest.java:53)

testLong(org.apache.commons.lang3.builder.ShortPrefixToStringStyleTest)  Time elapsed: 0 sec  <<< FAILURE!
org.junit.ComparisonFailure: expected:<Integer[3[]]> but was:<Integer[3[,]]>
	at org.junit.Assert.assertEquals(Assert.java:115)
	at org.junit.Assert.assertEquals(Assert.java:144)
	at org.apache.commons.lang3.builder.ShortPrefixToStringStyleTest.testLong(ShortPrefixToStringStyleTest.java:96)

testLongArrayArray(org.apache.commons.lang3.builder.ShortPrefixToStringStyleTest)  Time elapsed: 0.001 sec  <<< FAILURE!
org.junit.ComparisonFailure: expected:<...r[{{1,2},<null>,{5}}[]]> but was:<...r[{{1,2},<null>,{5}}[,]]>
	at org.junit.Assert.assertEquals(Assert.java:115)
	at org.junit.Assert.assertEquals(Assert.java:144)
	at org.apache.commons.lang3.builder.ShortPrefixToStringStyleTest.testLongArrayArray(ShortPrefixToStringStyleTest.java:124)

testLongArray(org.apache.commons.lang3.builder.ShortPrefixToStringStyleTest)  Time elapsed: 0 sec  <<< FAILURE!
org.junit.ComparisonFailure: expected:<Integer[{1,2,-3,4}[]]> but was:<Integer[{1,2,-3,4}[,]]>
	at org.junit.Assert.assertEquals(Assert.java:115)
	at org.junit.Assert.assertEquals(Assert.java:144)
	at org.apache.commons.lang3.builder.ShortPrefixToStringStyleTest.testLongArray(ShortPrefixToStringStyleTest.java:114)

testObject(org.apache.commons.lang3.builder.ShortPrefixToStringStyleTest)  Time elapsed: 0 sec  <<< FAILURE!
org.junit.ComparisonFailure: expected:<Integer[<null>[]]> but was:<Integer[<null>[,]]>
	at org.junit.Assert.assertEquals(Assert.java:115)
	at org.junit.Assert.assertEquals(Assert.java:144)
	at org.apache.commons.lang3.builder.ShortPrefixToStringStyleTest.testObject(ShortPrefixToStringStyleTest.java:70)

testPerson(org.apache.commons.lang3.builder.ShortPrefixToStringStyleTest)  Time elapsed: 0.001 sec  <<< FAILURE!
org.junit.ComparisonFailure: expected:<...c,age=45,smoker=true[]]> but was:<...c,age=45,smoker=true[,]]>
	at org.junit.Assert.assertEquals(Assert.java:115)
	at org.junit.Assert.assertEquals(Assert.java:144)
	at org.apache.commons.lang3.builder.ShortPrefixToStringStyleTest.testPerson(ShortPrefixToStringStyleTest.java:91)

testAppendSuper(org.apache.commons.lang3.builder.ShortPrefixToStringStyleTest)  Time elapsed: 0 sec  <<< FAILURE!
org.junit.ComparisonFailure: expected:<Integer[[]]> but was:<Integer[]]>
	at org.junit.Assert.assertEquals(Assert.java:115)
	at org.junit.Assert.assertEquals(Assert.java:144)
	at org.apache.commons.lang3.builder.ShortPrefixToStringStyleTest.testAppendSuper(ShortPrefixToStringStyleTest.java:58)

Running org.apache.commons.lang3.builder.DiffResultTest
Tests run: 9, Failures: 1, Errors: 0, Skipped: 0, Time elapsed: 0.006 sec <<< FAILURE! - in org.apache.commons.lang3.builder.DiffResultTest
testToStringOutput(org.apache.commons.lang3.builder.DiffResultTest)  Time elapsed: 0.004 sec  <<< FAILURE!
org.junit.ComparisonFailure: expected:<...mptyClass[test=false[] differs from DiffResultTest.EmptyClass[test=true]]> but was:<...mptyClass[test=false[,] differs from DiffResultTest.EmptyClass[test=true,]]>
	at org.junit.Assert.assertEquals(Assert.java:115)
	at org.junit.Assert.assertEquals(Assert.java:144)
	at org.apache.commons.lang3.builder.DiffResultTest.testToStringOutput(DiffResultTest.java:95)

Running org.apache.commons.lang3.builder.CompareToBuilderTest
Tests run: 48, Failures: 0, Errors: 0, Skipped: 0, Time elapsed: 0.016 sec - in org.apache.commons.lang3.builder.CompareToBuilderTest
Running org.apache.commons.lang3.builder.MultilineRecursiveToStringStyleTest
Tests run: 10, Failures: 10, Errors: 0, Skipped: 0, Time elapsed: 0.015 sec <<< FAILURE! - in org.apache.commons.lang3.builder.MultilineRecursiveToStringStyleTest
doubleArray(org.apache.commons.lang3.builder.MultilineRecursiveToStringStyleTest)  Time elapsed: 0 sec  <<< FAILURE!
org.junit.ComparisonFailure: expected:<...  stringArray=<null>[]
]> but was:<...  stringArray=<null>[,
  ]
]>
	at org.junit.Assert.assertEquals(Assert.java:115)
	at org.junit.Assert.assertEquals(Assert.java:144)
	at org.apache.commons.lang3.builder.MultilineRecursiveToStringStyleTest.doubleArray(MultilineRecursiveToStringStyleTest.java:167)

stringArray(org.apache.commons.lang3.builder.MultilineRecursiveToStringStyleTest)  Time elapsed: 0 sec  <<< FAILURE!
org.junit.ComparisonFailure: expected:<...y={
    a,
    A
  }[]
]> but was:<...y={
    a,
    A
  }[,
  ]
]>
	at org.junit.Assert.assertEquals(Assert.java:115)
	at org.junit.Assert.assertEquals(Assert.java:144)
	at org.apache.commons.lang3.builder.MultilineRecursiveToStringStyleTest.stringArray(MultilineRecursiveToStringStyleTest.java:203)

simpleObject(org.apache.commons.lang3.builder.MultilineRecursiveToStringStyleTest)  Time elapsed: 0 sec  <<< FAILURE!
org.junit.ComparisonFailure: expected:<...0,
  date=2014.10.15[]
]> but was:<...0,
  date=2014.10.15[,
  ]
]>
	at org.junit.Assert.assertEquals(Assert.java:115)
	at org.junit.Assert.assertEquals(Assert.java:144)
	at org.apache.commons.lang3.builder.MultilineRecursiveToStringStyleTest.simpleObject(MultilineRecursiveToStringStyleTest.java:42)

longArray(org.apache.commons.lang3.builder.MultilineRecursiveToStringStyleTest)  Time elapsed: 0 sec  <<< FAILURE!
org.junit.ComparisonFailure: expected:<...  stringArray=<null>[]
]> but was:<...  stringArray=<null>[,
  ]
]>
	at org.junit.Assert.assertEquals(Assert.java:115)
	at org.junit.Assert.assertEquals(Assert.java:144)
	at org.apache.commons.lang3.builder.MultilineRecursiveToStringStyleTest.longArray(MultilineRecursiveToStringStyleTest.java:185)

intArray(org.apache.commons.lang3.builder.MultilineRecursiveToStringStyleTest)  Time elapsed: 0 sec  <<< FAILURE!
org.junit.ComparisonFailure: expected:<...  stringArray=<null>[]
]> but was:<...  stringArray=<null>[,
  ]
]>
	at org.junit.Assert.assertEquals(Assert.java:115)
	at org.junit.Assert.assertEquals(Assert.java:144)
	at org.apache.commons.lang3.builder.MultilineRecursiveToStringStyleTest.intArray(MultilineRecursiveToStringStyleTest.java:149)

nestedAndArray(org.apache.commons.lang3.builder.MultilineRecursiveToStringStyleTest)  Time elapsed: 0.002 sec  <<< FAILURE!
org.junit.ComparisonFailure: expected:<...     date=2014.10.14[
    ],
    org.apache.commons.lang3.builder.MultilineRecursiveToStringStyleTest$Transaction@264b72a2[
      amount=50.0,
      date=2014.10.15
    ]
  }]
]> but was:<...     date=2014.10.14[,
      
    ],
    org.apache.commons.lang3.builder.MultilineRecursiveToStringStyleTest$Transaction@264b72a2[
      amount=50.0,
      date=2014.10.15,
      
    ]
  },
  ]
]>
	at org.junit.Assert.assertEquals(Assert.java:115)
	at org.junit.Assert.assertEquals(Assert.java:144)
	at org.apache.commons.lang3.builder.MultilineRecursiveToStringStyleTest.nestedAndArray(MultilineRecursiveToStringStyleTest.java:80)

charArray(org.apache.commons.lang3.builder.MultilineRecursiveToStringStyleTest)  Time elapsed: 0 sec  <<< FAILURE!
org.junit.ComparisonFailure: expected:<...  stringArray=<null>[]
]> but was:<...  stringArray=<null>[,
  ]
]>
	at org.junit.Assert.assertEquals(Assert.java:115)
	at org.junit.Assert.assertEquals(Assert.java:144)
	at org.apache.commons.lang3.builder.MultilineRecursiveToStringStyleTest.charArray(MultilineRecursiveToStringStyleTest.java:131)

nestedElements(org.apache.commons.lang3.builder.MultilineRecursiveToStringStyleTest)  Time elapsed: 0.001 sec  <<< FAILURE!
org.junit.ComparisonFailure: expected:<...e[
    name=ASF Bank[
  ],
  accounts=<null>]
]> but was:<...e[
    name=ASF Bank[,
    
  ],
  accounts=<null>,
  ]
]>
	at org.junit.Assert.assertEquals(Assert.java:115)
	at org.junit.Assert.assertEquals(Assert.java:144)
	at org.apache.commons.lang3.builder.MultilineRecursiveToStringStyleTest.nestedElements(MultilineRecursiveToStringStyleTest.java:57)

boolArray(org.apache.commons.lang3.builder.MultilineRecursiveToStringStyleTest)  Time elapsed: 0.001 sec  <<< FAILURE!
org.junit.ComparisonFailure: expected:<...  stringArray=<null>[]
]> but was:<...  stringArray=<null>[,
  ]
]>
	at org.junit.Assert.assertEquals(Assert.java:115)
	at org.junit.Assert.assertEquals(Assert.java:144)
	at org.apache.commons.lang3.builder.MultilineRecursiveToStringStyleTest.boolArray(MultilineRecursiveToStringStyleTest.java:113)

noArray(org.apache.commons.lang3.builder.MultilineRecursiveToStringStyleTest)  Time elapsed: 0.008 sec  <<< FAILURE!
org.junit.ComparisonFailure: expected:<...  stringArray=<null>[]
]> but was:<...  stringArray=<null>[,
  ]
]>
	at org.junit.Assert.assertEquals(Assert.java:115)
	at org.junit.Assert.assertEquals(Assert.java:144)
	at org.apache.commons.lang3.builder.MultilineRecursiveToStringStyleTest.noArray(MultilineRecursiveToStringStyleTest.java:94)

Running org.apache.commons.lang3.builder.RecursiveToStringStyleTest
Tests run: 8, Failures: 8, Errors: 0, Skipped: 0, Time elapsed: 0.001 sec <<< FAILURE! - in org.apache.commons.lang3.builder.RecursiveToStringStyleTest
testObjectArray(org.apache.commons.lang3.builder.RecursiveToStringStyleTest)  Time elapsed: 0 sec  <<< FAILURE!
org.junit.ComparisonFailure: expected:<...f7b[{<null>,5,{3,6}}[]]> but was:<...f7b[{<null>,5,{3,6}}[,]]>
	at org.junit.Assert.assertEquals(Assert.java:115)
	at org.junit.Assert.assertEquals(Assert.java:144)
	at org.apache.commons.lang3.builder.RecursiveToStringStyleTest.testObjectArray(RecursiveToStringStyleTest.java:107)

testBlank(org.apache.commons.lang3.builder.RecursiveToStringStyleTest)  Time elapsed: 0 sec  <<< FAILURE!
org.junit.ComparisonFailure: expected:<...lang.Integer@dda4f7b[[]]> but was:<...lang.Integer@dda4f7b[]]>
	at org.junit.Assert.assertEquals(Assert.java:115)
	at org.junit.Assert.assertEquals(Assert.java:144)
	at org.apache.commons.lang3.builder.RecursiveToStringStyleTest.testBlank(RecursiveToStringStyleTest.java:52)

testLong(org.apache.commons.lang3.builder.RecursiveToStringStyleTest)  Time elapsed: 0 sec  <<< FAILURE!
org.junit.ComparisonFailure: expected:<...ng.Integer@dda4f7b[3[]]> but was:<...ng.Integer@dda4f7b[3[,]]>
	at org.junit.Assert.assertEquals(Assert.java:115)
	at org.junit.Assert.assertEquals(Assert.java:144)
	at org.apache.commons.lang3.builder.RecursiveToStringStyleTest.testLong(RecursiveToStringStyleTest.java:99)

testLongArrayArray(org.apache.commons.lang3.builder.RecursiveToStringStyleTest)  Time elapsed: 0 sec  <<< FAILURE!
org.junit.ComparisonFailure: expected:<...b[{{1,2},<null>,{5}}[]]> but was:<...b[{{1,2},<null>,{5}}[,]]>
	at org.junit.Assert.assertEquals(Assert.java:115)
	at org.junit.Assert.assertEquals(Assert.java:144)
	at org.apache.commons.lang3.builder.RecursiveToStringStyleTest.testLongArrayArray(RecursiveToStringStyleTest.java:127)

testLongArray(org.apache.commons.lang3.builder.RecursiveToStringStyleTest)  Time elapsed: 0 sec  <<< FAILURE!
org.junit.ComparisonFailure: expected:<...r@dda4f7b[{1,2,-3,4}[]]> but was:<...r@dda4f7b[{1,2,-3,4}[,]]>
	at org.junit.Assert.assertEquals(Assert.java:115)
	at org.junit.Assert.assertEquals(Assert.java:144)
	at org.apache.commons.lang3.builder.RecursiveToStringStyleTest.testLongArray(RecursiveToStringStyleTest.java:117)

testObject(org.apache.commons.lang3.builder.RecursiveToStringStyleTest)  Time elapsed: 0 sec  <<< FAILURE!
org.junit.ComparisonFailure: expected:<...teger@dda4f7b[<null>[]]> but was:<...teger@dda4f7b[<null>[,]]>
	at org.junit.Assert.assertEquals(Assert.java:115)
	at org.junit.Assert.assertEquals(Assert.java:144)
	at org.apache.commons.lang3.builder.RecursiveToStringStyleTest.testObject(RecursiveToStringStyleTest.java:69)

testPerson(org.apache.commons.lang3.builder.RecursiveToStringStyleTest)  Time elapsed: 0 sec  <<< FAILURE!
org.junit.ComparisonFailure: expected:<...d0f282[title=Manager[]]]> but was:<...d0f282[title=Manager[,],]]>
	at org.junit.Assert.assertEquals(Assert.java:115)
	at org.junit.Assert.assertEquals(Assert.java:144)
	at org.apache.commons.lang3.builder.RecursiveToStringStyleTest.testPerson(RecursiveToStringStyleTest.java:93)

testAppendSuper(org.apache.commons.lang3.builder.RecursiveToStringStyleTest)  Time elapsed: 0 sec  <<< FAILURE!
org.junit.ComparisonFailure: expected:<...lang.Integer@dda4f7b[[]]> but was:<...lang.Integer@dda4f7b[]]>
	at org.junit.Assert.assertEquals(Assert.java:115)
	at org.junit.Assert.assertEquals(Assert.java:144)
	at org.apache.commons.lang3.builder.RecursiveToStringStyleTest.testAppendSuper(RecursiveToStringStyleTest.java:57)

Running org.apache.commons.lang3.builder.DefaultToStringStyleTest
Tests run: 8, Failures: 8, Errors: 0, Skipped: 0, Time elapsed: 0.003 sec <<< FAILURE! - in org.apache.commons.lang3.builder.DefaultToStringStyleTest
testObjectArray(org.apache.commons.lang3.builder.DefaultToStringStyleTest)  Time elapsed: 0 sec  <<< FAILURE!
org.junit.ComparisonFailure: expected:<...f7b[{<null>,5,{3,6}}[]]> but was:<...f7b[{<null>,5,{3,6}}[,]]>
	at org.junit.Assert.assertEquals(Assert.java:115)
	at org.junit.Assert.assertEquals(Assert.java:144)
	at org.apache.commons.lang3.builder.DefaultToStringStyleTest.testObjectArray(DefaultToStringStyleTest.java:104)

testBlank(org.apache.commons.lang3.builder.DefaultToStringStyleTest)  Time elapsed: 0 sec  <<< FAILURE!
org.junit.ComparisonFailure: expected:<...lang.Integer@dda4f7b[[]]> but was:<...lang.Integer@dda4f7b[]]>
	at org.junit.Assert.assertEquals(Assert.java:115)
	at org.junit.Assert.assertEquals(Assert.java:144)
	at org.apache.commons.lang3.builder.DefaultToStringStyleTest.testBlank(DefaultToStringStyleTest.java:53)

testLong(org.apache.commons.lang3.builder.DefaultToStringStyleTest)  Time elapsed: 0 sec  <<< FAILURE!
org.junit.ComparisonFailure: expected:<...ng.Integer@dda4f7b[3[]]> but was:<...ng.Integer@dda4f7b[3[,]]>
	at org.junit.Assert.assertEquals(Assert.java:115)
	at org.junit.Assert.assertEquals(Assert.java:144)
	at org.apache.commons.lang3.builder.DefaultToStringStyleTest.testLong(DefaultToStringStyleTest.java:96)

testLongArrayArray(org.apache.commons.lang3.builder.DefaultToStringStyleTest)  Time elapsed: 0 sec  <<< FAILURE!
org.junit.ComparisonFailure: expected:<...b[{{1,2},<null>,{5}}[]]> but was:<...b[{{1,2},<null>,{5}}[,]]>
	at org.junit.Assert.assertEquals(Assert.java:115)
	at org.junit.Assert.assertEquals(Assert.java:144)
	at org.apache.commons.lang3.builder.DefaultToStringStyleTest.testLongArrayArray(DefaultToStringStyleTest.java:124)

testLongArray(org.apache.commons.lang3.builder.DefaultToStringStyleTest)  Time elapsed: 0 sec  <<< FAILURE!
org.junit.ComparisonFailure: expected:<...r@dda4f7b[{1,2,-3,4}[]]> but was:<...r@dda4f7b[{1,2,-3,4}[,]]>
	at org.junit.Assert.assertEquals(Assert.java:115)
	at org.junit.Assert.assertEquals(Assert.java:144)
	at org.apache.commons.lang3.builder.DefaultToStringStyleTest.testLongArray(DefaultToStringStyleTest.java:114)

testObject(org.apache.commons.lang3.builder.DefaultToStringStyleTest)  Time elapsed: 0 sec  <<< FAILURE!
org.junit.ComparisonFailure: expected:<...teger@dda4f7b[<null>[]]> but was:<...teger@dda4f7b[<null>[,]]>
	at org.junit.Assert.assertEquals(Assert.java:115)
	at org.junit.Assert.assertEquals(Assert.java:144)
	at org.apache.commons.lang3.builder.DefaultToStringStyleTest.testObject(DefaultToStringStyleTest.java:70)

testPerson(org.apache.commons.lang3.builder.DefaultToStringStyleTest)  Time elapsed: 0 sec  <<< FAILURE!
org.junit.ComparisonFailure: expected:<...,age=33,smoker=false[]]> but was:<...,age=33,smoker=false[,]]>
	at org.junit.Assert.assertEquals(Assert.java:115)
	at org.junit.Assert.assertEquals(Assert.java:144)
	at org.apache.commons.lang3.builder.DefaultToStringStyleTest.testPerson(DefaultToStringStyleTest.java:91)

testAppendSuper(org.apache.commons.lang3.builder.DefaultToStringStyleTest)  Time elapsed: 0.001 sec  <<< FAILURE!
org.junit.ComparisonFailure: expected:<...lang.Integer@dda4f7b[[]]> but was:<...lang.Integer@dda4f7b[]]>
	at org.junit.Assert.assertEquals(Assert.java:115)
	at org.junit.Assert.assertEquals(Assert.java:144)
	at org.apache.commons.lang3.builder.DefaultToStringStyleTest.testAppendSuper(DefaultToStringStyleTest.java:58)

Running org.apache.commons.lang3.builder.ReflectionToStringBuilderExcludeTest
Tests run: 11, Failures: 0, Errors: 0, Skipped: 0, Time elapsed: 0.003 sec - in org.apache.commons.lang3.builder.ReflectionToStringBuilderExcludeTest
Running org.apache.commons.lang3.builder.StandardToStringStyleTest
Tests run: 8, Failures: 8, Errors: 0, Skipped: 0, Time elapsed: 0.005 sec <<< FAILURE! - in org.apache.commons.lang3.builder.StandardToStringStyleTest
testObjectArray(org.apache.commons.lang3.builder.StandardToStringStyleTest)  Time elapsed: 0 sec  <<< FAILURE!
org.junit.ComparisonFailure: expected:<...[[%NULL%, 5, [3, 6]][]]> but was:<...[[%NULL%, 5, [3, 6]][,]]>
	at org.junit.Assert.assertEquals(Assert.java:115)
	at org.junit.Assert.assertEquals(Assert.java:144)
	at org.apache.commons.lang3.builder.StandardToStringStyleTest.testObjectArray(StandardToStringStyleTest.java:119)

testBlank(org.apache.commons.lang3.builder.StandardToStringStyleTest)  Time elapsed: 0 sec  <<< FAILURE!
org.junit.ComparisonFailure: expected:<Integer[[]]> but was:<Integer[]]>
	at org.junit.Assert.assertEquals(Assert.java:115)
	at org.junit.Assert.assertEquals(Assert.java:144)
	at org.apache.commons.lang3.builder.StandardToStringStyleTest.testBlank(StandardToStringStyleTest.java:68)

testLong(org.apache.commons.lang3.builder.StandardToStringStyleTest)  Time elapsed: 0 sec  <<< FAILURE!
org.junit.ComparisonFailure: expected:<Integer[3[]]> but was:<Integer[3[,]]>
	at org.junit.Assert.assertEquals(Assert.java:115)
	at org.junit.Assert.assertEquals(Assert.java:144)
	at org.apache.commons.lang3.builder.StandardToStringStyleTest.testLong(StandardToStringStyleTest.java:111)

testLongArrayArray(org.apache.commons.lang3.builder.StandardToStringStyleTest)  Time elapsed: 0 sec  <<< FAILURE!
org.junit.ComparisonFailure: expected:<...[1, 2], %NULL%, [5]][]]> but was:<...[1, 2], %NULL%, [5]][,]]>
	at org.junit.Assert.assertEquals(Assert.java:115)
	at org.junit.Assert.assertEquals(Assert.java:144)
	at org.apache.commons.lang3.builder.StandardToStringStyleTest.testLongArrayArray(StandardToStringStyleTest.java:139)

testLongArray(org.apache.commons.lang3.builder.StandardToStringStyleTest)  Time elapsed: 0 sec  <<< FAILURE!
org.junit.ComparisonFailure: expected:<...nteger[[1, 2, -3, 4][]]> but was:<...nteger[[1, 2, -3, 4][,]]>
	at org.junit.Assert.assertEquals(Assert.java:115)
	at org.junit.Assert.assertEquals(Assert.java:144)
	at org.apache.commons.lang3.builder.StandardToStringStyleTest.testLongArray(StandardToStringStyleTest.java:129)

testObject(org.apache.commons.lang3.builder.StandardToStringStyleTest)  Time elapsed: 0.001 sec  <<< FAILURE!
org.junit.ComparisonFailure: expected:<Integer[%NULL%[]]> but was:<Integer[%NULL%[,]]>
	at org.junit.Assert.assertEquals(Assert.java:115)
	at org.junit.Assert.assertEquals(Assert.java:144)
	at org.apache.commons.lang3.builder.StandardToStringStyleTest.testObject(StandardToStringStyleTest.java:85)

testPerson(org.apache.commons.lang3.builder.StandardToStringStyleTest)  Time elapsed: 0 sec  <<< FAILURE!
org.junit.ComparisonFailure: expected:<...,age=19,smoker=false[]]> but was:<...,age=19,smoker=false[,]]>
	at org.junit.Assert.assertEquals(Assert.java:115)
	at org.junit.Assert.assertEquals(Assert.java:144)
	at org.apache.commons.lang3.builder.StandardToStringStyleTest.testPerson(StandardToStringStyleTest.java:106)

testAppendSuper(org.apache.commons.lang3.builder.StandardToStringStyleTest)  Time elapsed: 0.001 sec  <<< FAILURE!
org.junit.ComparisonFailure: expected:<Integer[[]]> but was:<Integer[]]>
	at org.junit.Assert.assertEquals(Assert.java:115)
	at org.junit.Assert.assertEquals(Assert.java:144)
	at org.apache.commons.lang3.builder.StandardToStringStyleTest.testAppendSuper(StandardToStringStyleTest.java:73)

Running org.apache.commons.lang3.builder.ToStringStyleTest
Tests run: 12, Failures: 0, Errors: 0, Skipped: 0, Time elapsed: 0.003 sec - in org.apache.commons.lang3.builder.ToStringStyleTest
Running org.apache.commons.lang3.builder.DiffTest
Tests run: 4, Failures: 0, Errors: 0, Skipped: 0, Time elapsed: 0.001 sec - in org.apache.commons.lang3.builder.DiffTest
Running org.apache.commons.lang3.builder.SimpleToStringStyleTest
Tests run: 8, Failures: 7, Errors: 0, Skipped: 0, Time elapsed: 0.01 sec <<< FAILURE! - in org.apache.commons.lang3.builder.SimpleToStringStyleTest
testObjectArray(org.apache.commons.lang3.builder.SimpleToStringStyleTest)  Time elapsed: 0.001 sec  <<< FAILURE!
org.junit.ComparisonFailure: expected:<{<null>,5,{3,6}}[]> but was:<{<null>,5,{3,6}}[,]>
	at org.junit.Assert.assertEquals(Assert.java:115)
	at org.junit.Assert.assertEquals(Assert.java:144)
	at org.apache.commons.lang3.builder.SimpleToStringStyleTest.testObjectArray(SimpleToStringStyleTest.java:102)

testLong(org.apache.commons.lang3.builder.SimpleToStringStyleTest)  Time elapsed: 0.002 sec  <<< FAILURE!
org.junit.ComparisonFailure: expected:<3[]> but was:<3[,]>
	at org.junit.Assert.assertEquals(Assert.java:115)
	at org.junit.Assert.assertEquals(Assert.java:144)
	at org.apache.commons.lang3.builder.SimpleToStringStyleTest.testLong(SimpleToStringStyleTest.java:94)

testLongArrayArray(org.apache.commons.lang3.builder.SimpleToStringStyleTest)  Time elapsed: 0.001 sec  <<< FAILURE!
org.junit.ComparisonFailure: expected:<{{1,2},<null>,{5}}[]> but was:<{{1,2},<null>,{5}}[,]>
	at org.junit.Assert.assertEquals(Assert.java:115)
	at org.junit.Assert.assertEquals(Assert.java:144)
	at org.apache.commons.lang3.builder.SimpleToStringStyleTest.testLongArrayArray(SimpleToStringStyleTest.java:122)

testLongArray(org.apache.commons.lang3.builder.SimpleToStringStyleTest)  Time elapsed: 0.001 sec  <<< FAILURE!
org.junit.ComparisonFailure: expected:<{1,2,-3,4}[]> but was:<{1,2,-3,4}[,]>
	at org.junit.Assert.assertEquals(Assert.java:115)
	at org.junit.Assert.assertEquals(Assert.java:144)
	at org.apache.commons.lang3.builder.SimpleToStringStyleTest.testLongArray(SimpleToStringStyleTest.java:112)

testObject(org.apache.commons.lang3.builder.SimpleToStringStyleTest)  Time elapsed: 0.001 sec  <<< FAILURE!
org.junit.ComparisonFailure: expected:<<null>[]> but was:<<null>[,]>
	at org.junit.Assert.assertEquals(Assert.java:115)
	at org.junit.Assert.assertEquals(Assert.java:144)
	at org.apache.commons.lang3.builder.SimpleToStringStyleTest.testObject(SimpleToStringStyleTest.java:69)

testPerson(org.apache.commons.lang3.builder.SimpleToStringStyleTest)  Time elapsed: 0.001 sec  <<< FAILURE!
org.junit.ComparisonFailure: expected:<...e Q. Public,47,false[]> but was:<...e Q. Public,47,false[,]>
	at org.junit.Assert.assertEquals(Assert.java:115)
	at org.junit.Assert.assertEquals(Assert.java:144)
	at org.apache.commons.lang3.builder.SimpleToStringStyleTest.testPerson(SimpleToStringStyleTest.java:89)

testAppendSuper(org.apache.commons.lang3.builder.SimpleToStringStyleTest)  Time elapsed: 0.001 sec  <<< FAILURE!
org.junit.ComparisonFailure: expected:<<null>[]> but was:<<null>[,]>
	at org.junit.Assert.assertEquals(Assert.java:115)
	at org.junit.Assert.assertEquals(Assert.java:144)
	at org.apache.commons.lang3.builder.SimpleToStringStyleTest.testAppendSuper(SimpleToStringStyleTest.java:58)

Running org.apache.commons.lang3.builder.MultiLineToStringStyleTest
Tests run: 8, Failures: 8, Errors: 0, Skipped: 0, Time elapsed: 0.006 sec <<< FAILURE! - in org.apache.commons.lang3.builder.MultiLineToStringStyleTest
testObjectArray(org.apache.commons.lang3.builder.MultiLineToStringStyleTest)  Time elapsed: 0.001 sec  <<< FAILURE!
org.junit.ComparisonFailure: expected:<...
  {<null>,5,{3,6}}
[]]> but was:<...
  {<null>,5,{3,6}}
[  
]]>
	at org.junit.Assert.assertEquals(Assert.java:115)
	at org.junit.Assert.assertEquals(Assert.java:144)
	at org.apache.commons.lang3.builder.MultiLineToStringStyleTest.testObjectArray(MultiLineToStringStyleTest.java:105)

testBlank(org.apache.commons.lang3.builder.MultiLineToStringStyleTest)  Time elapsed: 0.001 sec  <<< FAILURE!
org.junit.ComparisonFailure: expected:<...ng.Integer@dda4f7b[
[]]> but was:<...ng.Integer@dda4f7b[
[  
]]>
	at org.junit.Assert.assertEquals(Assert.java:115)
	at org.junit.Assert.assertEquals(Assert.java:144)
	at org.apache.commons.lang3.builder.MultiLineToStringStyleTest.testBlank(MultiLineToStringStyleTest.java:54)

testLong(org.apache.commons.lang3.builder.MultiLineToStringStyleTest)  Time elapsed: 0.001 sec  <<< FAILURE!
org.junit.ComparisonFailure: expected:<...nteger@dda4f7b[
  3
[]]> but was:<...nteger@dda4f7b[
  3
[  
]]>
	at org.junit.Assert.assertEquals(Assert.java:115)
	at org.junit.Assert.assertEquals(Assert.java:144)
	at org.apache.commons.lang3.builder.MultiLineToStringStyleTest.testLong(MultiLineToStringStyleTest.java:97)

testLongArrayArray(org.apache.commons.lang3.builder.MultiLineToStringStyleTest)  Time elapsed: 0 sec  <<< FAILURE!
org.junit.ComparisonFailure: expected:<... {{1,2},<null>,{5}}
[]]> but was:<... {{1,2},<null>,{5}}
[  
]]>
	at org.junit.Assert.assertEquals(Assert.java:115)
	at org.junit.Assert.assertEquals(Assert.java:144)
	at org.apache.commons.lang3.builder.MultiLineToStringStyleTest.testLongArrayArray(MultiLineToStringStyleTest.java:125)

testLongArray(org.apache.commons.lang3.builder.MultiLineToStringStyleTest)  Time elapsed: 0.001 sec  <<< FAILURE!
org.junit.ComparisonFailure: expected:<...a4f7b[
  {1,2,-3,4}
[]]> but was:<...a4f7b[
  {1,2,-3,4}
[  
]]>
	at org.junit.Assert.assertEquals(Assert.java:115)
	at org.junit.Assert.assertEquals(Assert.java:144)
	at org.apache.commons.lang3.builder.MultiLineToStringStyleTest.testLongArray(MultiLineToStringStyleTest.java:115)

testObject(org.apache.commons.lang3.builder.MultiLineToStringStyleTest)  Time elapsed: 0 sec  <<< FAILURE!
org.junit.ComparisonFailure: expected:<...r@dda4f7b[
  <null>
[]]> but was:<...r@dda4f7b[
  <null>
[  
]]>
	at org.junit.Assert.assertEquals(Assert.java:115)
	at org.junit.Assert.assertEquals(Assert.java:144)
	at org.apache.commons.lang3.builder.MultiLineToStringStyleTest.testObject(MultiLineToStringStyleTest.java:71)

testPerson(org.apache.commons.lang3.builder.MultiLineToStringStyleTest)  Time elapsed: 0.001 sec  <<< FAILURE!
org.junit.ComparisonFailure: expected:<...ge=25
  smoker=true
[]]> but was:<...ge=25
  smoker=true
[  
]]>
	at org.junit.Assert.assertEquals(Assert.java:115)
	at org.junit.Assert.assertEquals(Assert.java:144)
	at org.apache.commons.lang3.builder.MultiLineToStringStyleTest.testPerson(MultiLineToStringStyleTest.java:92)

testAppendSuper(org.apache.commons.lang3.builder.MultiLineToStringStyleTest)  Time elapsed: 0 sec  <<< FAILURE!
org.junit.ComparisonFailure: expected:<...ng.Integer@dda4f7b[
[]]> but was:<...ng.Integer@dda4f7b[
[  
]]>
	at org.junit.Assert.assertEquals(Assert.java:115)
	at org.junit.Assert.assertEquals(Assert.java:144)
	at org.apache.commons.lang3.builder.MultiLineToStringStyleTest.testAppendSuper(MultiLineToStringStyleTest.java:59)

Running org.apache.commons.lang3.builder.ToStringStyleConcurrencyTest
Tests run: 3, Failures: 0, Errors: 0, Skipped: 0, Time elapsed: 4.089 sec - in org.apache.commons.lang3.builder.ToStringStyleConcurrencyTest
Running org.apache.commons.lang3.builder.ReflectionToStringBuilderMutateInspectConcurrencyTest
Tests run: 1, Failures: 0, Errors: 0, Skipped: 1, Time elapsed: 0 sec - in org.apache.commons.lang3.builder.ReflectionToStringBuilderMutateInspectConcurrencyTest
Running org.apache.commons.lang3.builder.ToStringBuilderTest
Tests run: 74, Failures: 64, Errors: 0, Skipped: 1, Time elapsed: 0.061 sec <<< FAILURE! - in org.apache.commons.lang3.builder.ToStringBuilderTest
testCharArray(org.apache.commons.lang3.builder.ToStringBuilderTest)  Time elapsed: 0 sec  <<< FAILURE!
org.junit.ComparisonFailure: expected:<...er@dda4f7b[{A,2,_,D}[]]> but was:<...er@dda4f7b[{A,2,_,D}[,]]>
	at org.junit.Assert.assertEquals(Assert.java:115)
	at org.junit.Assert.assertEquals(Assert.java:144)
	at org.apache.commons.lang3.builder.ToStringBuilderTest.testCharArray(ToStringBuilderTest.java:767)

testDoubleArrayArray(org.apache.commons.lang3.builder.ToStringBuilderTest)  Time elapsed: 0 sec  <<< FAILURE!
org.junit.ComparisonFailure: expected:<...29686},<null>,{NaN}}[]]> but was:<...29686},<null>,{NaN}}[,]]>
	at org.junit.Assert.assertEquals(Assert.java:115)
	at org.junit.Assert.assertEquals(Assert.java:144)
	at org.apache.commons.lang3.builder.ToStringBuilderTest.testDoubleArrayArray(ToStringBuilderTest.java:857)

testReflectionBoolean(org.apache.commons.lang3.builder.ToStringBuilderTest)  Time elapsed: 0 sec  <<< FAILURE!
org.junit.ComparisonFailure: expected:<...n@f684bc0[value=true[]]> but was:<...n@f684bc0[value=true[,]]>
	at org.junit.Assert.assertEquals(Assert.java:115)
	at org.junit.Assert.assertEquals(Assert.java:144)
	at org.apache.commons.lang3.builder.ToStringBuilderTest.testReflectionBoolean(ToStringBuilderTest.java:116)

testObjectArray(org.apache.commons.lang3.builder.ToStringBuilderTest)  Time elapsed: 0.001 sec  <<< FAILURE!
org.junit.ComparisonFailure: expected:<...f7b[{<null>,5,{3,6}}[]]> but was:<...f7b[{<null>,5,{3,6}}[,]]>
	at org.junit.Assert.assertEquals(Assert.java:115)
	at org.junit.Assert.assertEquals(Assert.java:144)
	at org.apache.commons.lang3.builder.ToStringBuilderTest.testObjectArray(ToStringBuilderTest.java:717)

testObjectBuild(org.apache.commons.lang3.builder.ToStringBuilderTest)  Time elapsed: 0 sec  <<< FAILURE!
org.junit.ComparisonFailure: expected:<...teger@dda4f7b[<null>[]]> but was:<...teger@dda4f7b[<null>[,]]>
	at org.junit.Assert.assertEquals(Assert.java:115)
	at org.junit.Assert.assertEquals(Assert.java:144)
	at org.apache.commons.lang3.builder.ToStringBuilderTest.testObjectBuild(ToStringBuilderTest.java:641)

testObjectCycle(org.apache.commons.lang3.builder.ToStringBuilderTest)  Time elapsed: 0.001 sec  <<< FAILURE!
org.junit.ComparisonFailure: expected:<...$ObjectCycle@9343bd5[]]]> but was:<...$ObjectCycle@9343bd5[,],]]>
	at org.junit.Assert.assertEquals(Assert.java:115)
	at org.junit.Assert.assertEquals(Assert.java:144)
	at org.apache.commons.lang3.builder.ToStringBuilderTest.testObjectCycle(ToStringBuilderTest.java:892)

testReflectionHierarchy(org.apache.commons.lang3.builder.ToStringBuilderTest)  Time elapsed: 0.001 sec  <<< FAILURE!
org.junit.ComparisonFailure: expected:<...ixtureA@11b13588[a=a[]]> but was:<...ixtureA@11b13588[a=a[,]]>
	at org.junit.Assert.assertEquals(Assert.java:115)
	at org.junit.Assert.assertEquals(Assert.java:144)
	at org.apache.commons.lang3.builder.ToStringBuilderTest.testReflectionHierarchy(ToStringBuilderTest.java:338)

testSelfInstanceTwoVarsReflectionObjectCycle(org.apache.commons.lang3.builder.ToStringBuilderTest)  Time elapsed: 0.001 sec  <<< FAILURE!
org.junit.ComparisonFailure: expected:<...rType=The Other Type[]]> but was:<...rType=The Other Type[,]]>
	at org.junit.Assert.assertEquals(Assert.java:115)
	at org.junit.Assert.assertEquals(Assert.java:144)
	at org.apache.commons.lang3.builder.ToStringBuilderTest.testSelfInstanceTwoVarsReflectionObjectCycle(ToStringBuilderTest.java:549)

testShortArrayArray(org.apache.commons.lang3.builder.ToStringBuilderTest)  Time elapsed: 0.001 sec  <<< FAILURE!
org.junit.ComparisonFailure: expected:<...b[{{1,2},<null>,{5}}[]]> but was:<...b[{{1,2},<null>,{5}}[,]]>
	at org.junit.Assert.assertEquals(Assert.java:115)
	at org.junit.Assert.assertEquals(Assert.java:144)
	at org.apache.commons.lang3.builder.ToStringBuilderTest.testShortArrayArray(ToStringBuilderTest.java:827)

testBooleanArrayArray(org.apache.commons.lang3.builder.ToStringBuilderTest)  Time elapsed: 0 sec  <<< FAILURE!
org.junit.ComparisonFailure: expected:<...lse},<null>,{false}}[]]> but was:<...lse},<null>,{false}}[,]]>
	at org.junit.Assert.assertEquals(Assert.java:115)
	at org.junit.Assert.assertEquals(Assert.java:144)
	at org.apache.commons.lang3.builder.ToStringBuilderTest.testBooleanArrayArray(ToStringBuilderTest.java:877)

testFloatArray(org.apache.commons.lang3.builder.ToStringBuilderTest)  Time elapsed: 0.001 sec  <<< FAILURE!
org.junit.ComparisonFailure: expected:<...2.9876,-3.00001,4.3}[]]> but was:<...2.9876,-3.00001,4.3}[,]]>
	at org.junit.Assert.assertEquals(Assert.java:115)
	at org.junit.Assert.assertEquals(Assert.java:144)
	at org.apache.commons.lang3.builder.ToStringBuilderTest.testFloatArray(ToStringBuilderTest.java:787)

testInt(org.apache.commons.lang3.builder.ToStringBuilderTest)  Time elapsed: 0.001 sec  <<< FAILURE!
org.junit.ComparisonFailure: expected:<...ng.Integer@dda4f7b[3[]]> but was:<...ng.Integer@dda4f7b[3[,]]>
	at org.junit.Assert.assertEquals(Assert.java:115)
	at org.junit.Assert.assertEquals(Assert.java:144)
	at org.apache.commons.lang3.builder.ToStringBuilderTest.testInt(ToStringBuilderTest.java:665)

testByteArray(org.apache.commons.lang3.builder.ToStringBuilderTest)  Time elapsed: 0.001 sec  <<< FAILURE!
org.junit.ComparisonFailure: expected:<...r@dda4f7b[{1,2,-3,4}[]]> but was:<...r@dda4f7b[{1,2,-3,4}[,]]>
	at org.junit.Assert.assertEquals(Assert.java:115)
	at org.junit.Assert.assertEquals(Assert.java:144)
	at org.apache.commons.lang3.builder.ToStringBuilderTest.testByteArray(ToStringBuilderTest.java:757)

testReflectionArrayCycle(org.apache.commons.lang3.builder.ToStringBuilderTest)  Time elapsed: 0 sec  <<< FAILURE!
org.junit.ComparisonFailure: expected:<...ang.Object;@5d5ef3e7[}]]> but was:<...ang.Object;@5d5ef3e7[]]>
	at org.junit.Assert.assertEquals(Assert.java:115)
	at org.junit.Assert.assertEquals(Assert.java:144)
	at org.apache.commons.lang3.builder.ToStringBuilderTest.testReflectionArrayCycle(ToStringBuilderTest.java:402)

testReflectionLongArrayArray(org.apache.commons.lang3.builder.ToStringBuilderTest)  Time elapsed: 0.001 sec  <<< FAILURE!
org.junit.ComparisonFailure: expected:<...95[{{1,2},<null>,{5}[}]]> but was:<...95[{{1,2},<null>,{5}[]]>
	at org.junit.Assert.assertEquals(Assert.java:115)
	at org.junit.Assert.assertEquals(Assert.java:144)
	at org.apache.commons.lang3.builder.ToStringBuilderTest.testReflectionLongArrayArray(ToStringBuilderTest.java:253)

testBlank(org.apache.commons.lang3.builder.ToStringBuilderTest)  Time elapsed: 0 sec  <<< FAILURE!
org.junit.ComparisonFailure: expected:<...lang.Integer@dda4f7b[[]]> but was:<...lang.Integer@dda4f7b[]]>
	at org.junit.Assert.assertEquals(Assert.java:115)
	at org.junit.Assert.assertEquals(Assert.java:144)
	at org.apache.commons.lang3.builder.ToStringBuilderTest.testBlank(ToStringBuilderTest.java:89)

testFloat(org.apache.commons.lang3.builder.ToStringBuilderTest)  Time elapsed: 0.001 sec  <<< FAILURE!
org.junit.ComparisonFailure: expected:<....Integer@dda4f7b[3.2[]]> but was:<....Integer@dda4f7b[3.2[,]]>
	at org.junit.Assert.assertEquals(Assert.java:115)
	at org.junit.Assert.assertEquals(Assert.java:144)
	at org.apache.commons.lang3.builder.ToStringBuilderTest.testFloat(ToStringBuilderTest.java:701)

testShort(org.apache.commons.lang3.builder.ToStringBuilderTest)  Time elapsed: 0 sec  <<< FAILURE!
org.junit.ComparisonFailure: expected:<...ng.Integer@dda4f7b[3[]]> but was:<...ng.Integer@dda4f7b[3[,]]>
	at org.junit.Assert.assertEquals(Assert.java:115)
	at org.junit.Assert.assertEquals(Assert.java:144)
	at org.apache.commons.lang3.builder.ToStringBuilderTest.testShort(ToStringBuilderTest.java:672)

testReflectionArrayArrayCycle(org.apache.commons.lang3.builder.ToStringBuilderTest)  Time elapsed: 0.001 sec  <<< FAILURE!
org.junit.ComparisonFailure: expected:<...ng.Object;@3828ef8f}[}]]> but was:<...ng.Object;@3828ef8f}[]]>
	at org.junit.Assert.assertEquals(Assert.java:115)
	at org.junit.Assert.assertEquals(Assert.java:144)
	at org.apache.commons.lang3.builder.ToStringBuilderTest.testReflectionArrayArrayCycle(ToStringBuilderTest.java:432)

testByte(org.apache.commons.lang3.builder.ToStringBuilderTest)  Time elapsed: 0 sec  <<< FAILURE!
org.junit.ComparisonFailure: expected:<...ng.Integer@dda4f7b[3[]]> but was:<...ng.Integer@dda4f7b[3[,]]>
	at org.junit.Assert.assertEquals(Assert.java:115)
	at org.junit.Assert.assertEquals(Assert.java:144)
	at org.apache.commons.lang3.builder.ToStringBuilderTest.testByte(ToStringBuilderTest.java:686)

testChar(org.apache.commons.lang3.builder.ToStringBuilderTest)  Time elapsed: 0 sec  <<< FAILURE!
org.junit.ComparisonFailure: expected:<...ng.Integer@dda4f7b[A[]]> but was:<...ng.Integer@dda4f7b[A[,]]>
	at org.junit.Assert.assertEquals(Assert.java:115)
	at org.junit.Assert.assertEquals(Assert.java:144)
	at org.apache.commons.lang3.builder.ToStringBuilderTest.testChar(ToStringBuilderTest.java:679)

testLong(org.apache.commons.lang3.builder.ToStringBuilderTest)  Time elapsed: 0 sec  <<< FAILURE!
org.junit.ComparisonFailure: expected:<...ng.Integer@dda4f7b[3[]]> but was:<...ng.Integer@dda4f7b[3[,]]>
	at org.junit.Assert.assertEquals(Assert.java:115)
	at org.junit.Assert.assertEquals(Assert.java:144)
	at org.apache.commons.lang3.builder.ToStringBuilderTest.testLong(ToStringBuilderTest.java:657)

testReflectionFloatArray(org.apache.commons.lang3.builder.ToStringBuilderTest)  Time elapsed: 0.001 sec  <<< FAILURE!
org.junit.ComparisonFailure: expected:<...,2.9876,-3.00001,4.3[}]]> but was:<...,2.9876,-3.00001,4.3[]]>
	at org.junit.Assert.assertEquals(Assert.java:115)
	at org.junit.Assert.assertEquals(Assert.java:144)
	at org.apache.commons.lang3.builder.ToStringBuilderTest.testReflectionFloatArray(ToStringBuilderTest.java:223)

testLongArrayArray(org.apache.commons.lang3.builder.ToStringBuilderTest)  Time elapsed: 0 sec  <<< FAILURE!
org.junit.ComparisonFailure: expected:<...b[{{1,2},<null>,{5}}[]]> but was:<...b[{{1,2},<null>,{5}}[,]]>
	at org.junit.Assert.assertEquals(Assert.java:115)
	at org.junit.Assert.assertEquals(Assert.java:144)
	at org.apache.commons.lang3.builder.ToStringBuilderTest.testLongArrayArray(ToStringBuilderTest.java:807)

testBoolean(org.apache.commons.lang3.builder.ToStringBuilderTest)  Time elapsed: 0 sec  <<< FAILURE!
org.junit.ComparisonFailure: expected:<...Integer@dda4f7b[true[]]> but was:<...Integer@dda4f7b[true[,]]>
	at org.junit.Assert.assertEquals(Assert.java:115)
	at org.junit.Assert.assertEquals(Assert.java:144)
	at org.apache.commons.lang3.builder.ToStringBuilderTest.testBoolean(ToStringBuilderTest.java:708)

testReflectionDoubleArrayArray(org.apache.commons.lang3.builder.ToStringBuilderTest)  Time elapsed: 0 sec  <<< FAILURE!
org.junit.ComparisonFailure: expected:<....29686},<null>,{NaN}[}]]> but was:<....29686},<null>,{NaN}[]]>
	at org.junit.Assert.assertEquals(Assert.java:115)
	at org.junit.Assert.assertEquals(Assert.java:144)
	at org.apache.commons.lang3.builder.ToStringBuilderTest.testReflectionDoubleArrayArray(ToStringBuilderTest.java:298)

testReflectionBooleanArray(org.apache.commons.lang3.builder.ToStringBuilderTest)  Time elapsed: 0 sec  <<< FAILURE!
org.junit.ComparisonFailure: expected:<...d4[{true,false,false[}]]> but was:<...d4[{true,false,false[]]>
	at org.junit.Assert.assertEquals(Assert.java:115)
	at org.junit.Assert.assertEquals(Assert.java:144)
	at org.apache.commons.lang3.builder.ToStringBuilderTest.testReflectionBooleanArray(ToStringBuilderTest.java:232)

testReflectionInteger(org.apache.commons.lang3.builder.ToStringBuilderTest)  Time elapsed: 0 sec  <<< FAILURE!
org.junit.ComparisonFailure: expected:<...eger@dda4f7b[value=5[]]> but was:<...eger@dda4f7b[value=5[,]]>
	at org.junit.Assert.assertEquals(Assert.java:115)
	at org.junit.Assert.assertEquals(Assert.java:144)
	at org.apache.commons.lang3.builder.ToStringBuilderTest.testReflectionInteger(ToStringBuilderTest.java:97)

testBooleanArray(org.apache.commons.lang3.builder.ToStringBuilderTest)  Time elapsed: 0 sec  <<< FAILURE!
org.junit.ComparisonFailure: expected:<...b[{true,false,false}[]]> but was:<...b[{true,false,false}[,]]>
	at org.junit.Assert.assertEquals(Assert.java:115)
	at org.junit.Assert.assertEquals(Assert.java:144)
	at org.apache.commons.lang3.builder.ToStringBuilderTest.testBooleanArray(ToStringBuilderTest.java:797)

testFloatArrayArray(org.apache.commons.lang3.builder.ToStringBuilderTest)  Time elapsed: 0 sec  <<< FAILURE!
org.junit.ComparisonFailure: expected:<...29686},<null>,{NaN}}[]]> but was:<...29686},<null>,{NaN}}[,]]>
	at org.junit.Assert.assertEquals(Assert.java:115)
	at org.junit.Assert.assertEquals(Assert.java:144)
	at org.apache.commons.lang3.builder.ToStringBuilderTest.testFloatArrayArray(ToStringBuilderTest.java:867)

testReflectionyteArray(org.apache.commons.lang3.builder.ToStringBuilderTest)  Time elapsed: 0.001 sec  <<< FAILURE!
org.junit.ComparisonFailure: expected:<...B@422cac21[{1,2,-3,4[}]]> but was:<...B@422cac21[{1,2,-3,4[]]>
	at org.junit.Assert.assertEquals(Assert.java:115)
	at org.junit.Assert.assertEquals(Assert.java:144)
	at org.apache.commons.lang3.builder.ToStringBuilderTest.testReflectionyteArray(ToStringBuilderTest.java:196)

testReflectionDoubleArray(org.apache.commons.lang3.builder.ToStringBuilderTest)  Time elapsed: 0 sec  <<< FAILURE!
org.junit.ComparisonFailure: expected:<...,2.9876,-3.00001,4.3[}]]> but was:<...,2.9876,-3.00001,4.3[]]>
	at org.junit.Assert.assertEquals(Assert.java:115)
	at org.junit.Assert.assertEquals(Assert.java:144)
	at org.apache.commons.lang3.builder.ToStringBuilderTest.testReflectionDoubleArray(ToStringBuilderTest.java:214)

testReflectionIntArrayArray(org.apache.commons.lang3.builder.ToStringBuilderTest)  Time elapsed: 0.001 sec  <<< FAILURE!
org.junit.ComparisonFailure: expected:<...bd[{{1,2},<null>,{5}[}]]> but was:<...bd[{{1,2},<null>,{5}[]]>
	at org.junit.Assert.assertEquals(Assert.java:115)
	at org.junit.Assert.assertEquals(Assert.java:144)
	at org.apache.commons.lang3.builder.ToStringBuilderTest.testReflectionIntArrayArray(ToStringBuilderTest.java:262)

testSimpleReflectionStatics(org.apache.commons.lang3.builder.ToStringBuilderTest)  Time elapsed: 0.001 sec  <<< FAILURE!
org.junit.ComparisonFailure: expected:<...ring,staticInt=12345[]]> but was:<...ring,staticInt=12345[,]]>
	at org.junit.Assert.assertEquals(Assert.java:115)
	at org.junit.Assert.assertEquals(Assert.java:144)
	at org.apache.commons.lang3.builder.ToStringBuilderTest.testSimpleReflectionStatics(ToStringBuilderTest.java:907)

testReflectionStatics(org.apache.commons.lang3.builder.ToStringBuilderTest)  Time elapsed: 0.001 sec  <<< FAILURE!
org.junit.ComparisonFailure: expected:<...ng,instanceInt=67890[]]> but was:<...ng,instanceInt=67890[,]]>
	at org.junit.Assert.assertEquals(Assert.java:115)
	at org.junit.Assert.assertEquals(Assert.java:144)
	at org.apache.commons.lang3.builder.ToStringBuilderTest.testReflectionStatics(ToStringBuilderTest.java:927)

testReflectionLongArray(org.apache.commons.lang3.builder.ToStringBuilderTest)  Time elapsed: 0 sec  <<< FAILURE!
org.junit.ComparisonFailure: expected:<[J@275a83d[{1,2,-3,4[}]]> but was:<[J@275a83d[{1,2,-3,4[]]>
	at org.junit.Assert.assertEquals(Assert.java:115)
	at org.junit.Assert.assertEquals(Assert.java:144)
	at org.apache.commons.lang3.builder.ToStringBuilderTest.testReflectionLongArray(ToStringBuilderTest.java:169)

testReflectionhortArrayArray(org.apache.commons.lang3.builder.ToStringBuilderTest)  Time elapsed: 0.001 sec  <<< FAILURE!
org.junit.ComparisonFailure: expected:<...0d[{{1,2},<null>,{5}[}]]> but was:<...0d[{{1,2},<null>,{5}[]]>
	at org.junit.Assert.assertEquals(Assert.java:115)
	at org.junit.Assert.assertEquals(Assert.java:144)
	at org.apache.commons.lang3.builder.ToStringBuilderTest.testReflectionhortArrayArray(ToStringBuilderTest.java:271)

testReflectionObjectArray(org.apache.commons.lang3.builder.ToStringBuilderTest)  Time elapsed: 0.001 sec  <<< FAILURE!
org.junit.ComparisonFailure: expected:<...40d9[{<null>,5,{3,6}[}]]> but was:<...40d9[{<null>,5,{3,6}[]]>
	at org.junit.Assert.assertEquals(Assert.java:115)
	at org.junit.Assert.assertEquals(Assert.java:144)
	at org.apache.commons.lang3.builder.ToStringBuilderTest.testReflectionObjectArray(ToStringBuilderTest.java:160)

testReflectionObjectCycle(org.apache.commons.lang3.builder.ToStringBuilderTest)  Time elapsed: 0.003 sec  <<< FAILURE!
org.junit.ComparisonFailure: expected:<...nTestCycleA@3b27402d[]]]> but was:<...nTestCycleA@3b27402d[,],]]>
	at org.junit.Assert.assertEquals(Assert.java:115)
	at org.junit.Assert.assertEquals(Assert.java:144)
	at org.apache.commons.lang3.builder.ToStringBuilderTest.testReflectionObjectCycle(ToStringBuilderTest.java:562)

testReflectionBooleanArrayArray(org.apache.commons.lang3.builder.ToStringBuilderTest)  Time elapsed: 0 sec  <<< FAILURE!
org.junit.ComparisonFailure: expected:<...alse},<null>,{false}[}]]> but was:<...alse},<null>,{false}[]]>
	at org.junit.Assert.assertEquals(Assert.java:115)
	at org.junit.Assert.assertEquals(Assert.java:144)
	at org.apache.commons.lang3.builder.ToStringBuilderTest.testReflectionBooleanArrayArray(ToStringBuilderTest.java:307)

testLongArray(org.apache.commons.lang3.builder.ToStringBuilderTest)  Time elapsed: 0 sec  <<< FAILURE!
org.junit.ComparisonFailure: expected:<...r@dda4f7b[{1,2,-3,4}[]]> but was:<...r@dda4f7b[{1,2,-3,4}[,]]>
	at org.junit.Assert.assertEquals(Assert.java:115)
	at org.junit.Assert.assertEquals(Assert.java:144)
	at org.apache.commons.lang3.builder.ToStringBuilderTest.testLongArray(ToStringBuilderTest.java:727)

testSimpleReflectionObjectCycle(org.apache.commons.lang3.builder.ToStringBuilderTest)  Time elapsed: 0.001 sec  <<< FAILURE!
org.junit.ComparisonFailure: expected:<...onTestFixture@608486[]]> but was:<...onTestFixture@608486[,]]>
	at org.junit.Assert.assertEquals(Assert.java:115)
	at org.junit.Assert.assertEquals(Assert.java:144)
	at org.apache.commons.lang3.builder.ToStringBuilderTest.testSimpleReflectionObjectCycle(ToStringBuilderTest.java:530)

testShortArray(org.apache.commons.lang3.builder.ToStringBuilderTest)  Time elapsed: 0.001 sec  <<< FAILURE!
org.junit.ComparisonFailure: expected:<...r@dda4f7b[{1,2,-3,4}[]]> but was:<...r@dda4f7b[{1,2,-3,4}[,]]>
	at org.junit.Assert.assertEquals(Assert.java:115)
	at org.junit.Assert.assertEquals(Assert.java:144)
	at org.apache.commons.lang3.builder.ToStringBuilderTest.testShortArray(ToStringBuilderTest.java:747)

testIntArrayArray(org.apache.commons.lang3.builder.ToStringBuilderTest)  Time elapsed: 0 sec  <<< FAILURE!
org.junit.ComparisonFailure: expected:<...b[{{1,2},<null>,{5}}[]]> but was:<...b[{{1,2},<null>,{5}}[,]]>
	at org.junit.Assert.assertEquals(Assert.java:115)
	at org.junit.Assert.assertEquals(Assert.java:144)
	at org.apache.commons.lang3.builder.ToStringBuilderTest.testIntArrayArray(ToStringBuilderTest.java:817)

testInheritedReflectionStatics(org.apache.commons.lang3.builder.ToStringBuilderTest)  Time elapsed: 0.001 sec  <<< FAILURE!
org.junit.ComparisonFailure: expected:<...ng2,staticInt2=67890[]]> but was:<...ng2,staticInt2=67890[,]]>
	at org.junit.Assert.assertEquals(Assert.java:115)
	at org.junit.Assert.assertEquals(Assert.java:144)
	at org.apache.commons.lang3.builder.ToStringBuilderTest.testInheritedReflectionStatics(ToStringBuilderTest.java:947)

testReflectionByteArrayArray(org.apache.commons.lang3.builder.ToStringBuilderTest)  Time elapsed: 0 sec  <<< FAILURE!
org.junit.ComparisonFailure: expected:<...b2[{{1,2},<null>,{5}[}]]> but was:<...b2[{{1,2},<null>,{5}[]]>
	at org.junit.Assert.assertEquals(Assert.java:115)
	at org.junit.Assert.assertEquals(Assert.java:144)
	at org.apache.commons.lang3.builder.ToStringBuilderTest.testReflectionByteArrayArray(ToStringBuilderTest.java:280)

testReflectionArrayCycleLevel2(org.apache.commons.lang3.builder.ToStringBuilderTest)  Time elapsed: 0.001 sec  <<< FAILURE!
org.junit.ComparisonFailure: expected:<...ng.Object;@11a74355}[}]]> but was:<...ng.Object;@11a74355}[]]>
	at org.junit.Assert.assertEquals(Assert.java:115)
	at org.junit.Assert.assertEquals(Assert.java:144)
	at org.apache.commons.lang3.builder.ToStringBuilderTest.testReflectionArrayCycleLevel2(ToStringBuilderTest.java:416)

testAppendToString(org.apache.commons.lang3.builder.ToStringBuilderTest)  Time elapsed: 0 sec  <<< FAILURE!
org.junit.ComparisonFailure: expected:<...lang.Integer@dda4f7b[[]]> but was:<...lang.Integer@dda4f7b[]]>
	at org.junit.Assert.assertEquals(Assert.java:115)
	at org.junit.Assert.assertEquals(Assert.java:144)
	at org.apache.commons.lang3.builder.ToStringBuilderTest.testAppendToString(ToStringBuilderTest.java:611)

testReflectionArrayAndObjectCycle(org.apache.commons.lang3.builder.ToStringBuilderTest)  Time elapsed: 0 sec  <<< FAILURE!
org.junit.ComparisonFailure: expected:<...ang.Object;@1f181935[]}]]> but was:<...ang.Object;@1f181935[,]]]>
	at org.junit.Assert.assertEquals(Assert.java:115)
	at org.junit.Assert.assertEquals(Assert.java:144)
	at org.apache.commons.lang3.builder.ToStringBuilderTest.testReflectionArrayAndObjectCycle(ToStringBuilderTest.java:576)

testReflectionCharArrayArray(org.apache.commons.lang3.builder.ToStringBuilderTest)  Time elapsed: 0 sec  <<< FAILURE!
org.junit.ComparisonFailure: expected:<...a7[{{A,B},<null>,{p}[}]]> but was:<...a7[{{A,B},<null>,{p}[]]>
	at org.junit.Assert.assertEquals(Assert.java:115)
	at org.junit.Assert.assertEquals(Assert.java:144)
	at org.apache.commons.lang3.builder.ToStringBuilderTest.testReflectionCharArrayArray(ToStringBuilderTest.java:289)

testIntArray(org.apache.commons.lang3.builder.ToStringBuilderTest)  Time elapsed: 0 sec  <<< FAILURE!
org.junit.ComparisonFailure: expected:<...r@dda4f7b[{1,2,-3,4}[]]> but was:<...r@dda4f7b[{1,2,-3,4}[,]]>
	at org.junit.Assert.assertEquals(Assert.java:115)
	at org.junit.Assert.assertEquals(Assert.java:144)
	at org.apache.commons.lang3.builder.ToStringBuilderTest.testIntArray(ToStringBuilderTest.java:737)

testDouble(org.apache.commons.lang3.builder.ToStringBuilderTest)  Time elapsed: 0.001 sec  <<< FAILURE!
org.junit.ComparisonFailure: expected:<....Integer@dda4f7b[3.2[]]> but was:<....Integer@dda4f7b[3.2[,]]>
	at org.junit.Assert.assertEquals(Assert.java:115)
	at org.junit.Assert.assertEquals(Assert.java:144)
	at org.apache.commons.lang3.builder.ToStringBuilderTest.testDouble(ToStringBuilderTest.java:694)

testByteArrayArray(org.apache.commons.lang3.builder.ToStringBuilderTest)  Time elapsed: 0 sec  <<< FAILURE!
org.junit.ComparisonFailure: expected:<...b[{{1,2},<null>,{5}}[]]> but was:<...b[{{1,2},<null>,{5}}[,]]>
	at org.junit.Assert.assertEquals(Assert.java:115)
	at org.junit.Assert.assertEquals(Assert.java:144)
	at org.apache.commons.lang3.builder.ToStringBuilderTest.testByteArrayArray(ToStringBuilderTest.java:837)

testReflectionShortArray(org.apache.commons.lang3.builder.ToStringBuilderTest)  Time elapsed: 0.001 sec  <<< FAILURE!
org.junit.ComparisonFailure: expected:<...S@57d0258a[{1,2,-3,4[}]]> but was:<...S@57d0258a[{1,2,-3,4[]]>
	at org.junit.Assert.assertEquals(Assert.java:115)
	at org.junit.Assert.assertEquals(Assert.java:144)
	at org.apache.commons.lang3.builder.ToStringBuilderTest.testReflectionShortArray(ToStringBuilderTest.java:187)

testCharArrayArray(org.apache.commons.lang3.builder.ToStringBuilderTest)  Time elapsed: 0 sec  <<< FAILURE!
org.junit.ComparisonFailure: expected:<...b[{{A,B},<null>,{p}}[]]> but was:<...b[{{A,B},<null>,{p}}[,]]>
	at org.junit.Assert.assertEquals(Assert.java:115)
	at org.junit.Assert.assertEquals(Assert.java:144)
	at org.apache.commons.lang3.builder.ToStringBuilderTest.testCharArrayArray(ToStringBuilderTest.java:847)

testSelfInstanceVarReflectionObjectCycle(org.apache.commons.lang3.builder.ToStringBuilderTest)  Time elapsed: 0.001 sec  <<< FAILURE!
org.junit.ComparisonFailure: expected:<...TestFixture@20a8a84c[]]> but was:<...TestFixture@20a8a84c[,]]>
	at org.junit.Assert.assertEquals(Assert.java:115)
	at org.junit.Assert.assertEquals(Assert.java:144)
	at org.apache.commons.lang3.builder.ToStringBuilderTest.testSelfInstanceVarReflectionObjectCycle(ToStringBuilderTest.java:539)

testObject(org.apache.commons.lang3.builder.ToStringBuilderTest)  Time elapsed: 0 sec  <<< FAILURE!
org.junit.ComparisonFailure: expected:<...teger@dda4f7b[<null>[]]> but was:<...teger@dda4f7b[<null>[,]]>
	at org.junit.Assert.assertEquals(Assert.java:115)
	at org.junit.Assert.assertEquals(Assert.java:144)
	at org.apache.commons.lang3.builder.ToStringBuilderTest.testObject(ToStringBuilderTest.java:623)

testAppendSuper(org.apache.commons.lang3.builder.ToStringBuilderTest)  Time elapsed: 0 sec  <<< FAILURE!
org.junit.ComparisonFailure: expected:<...lang.Integer@dda4f7b[[]]> but was:<...lang.Integer@dda4f7b[]]>
	at org.junit.Assert.assertEquals(Assert.java:115)
	at org.junit.Assert.assertEquals(Assert.java:144)
	at org.apache.commons.lang3.builder.ToStringBuilderTest.testAppendSuper(ToStringBuilderTest.java:601)

testReflectionIntArray(org.apache.commons.lang3.builder.ToStringBuilderTest)  Time elapsed: 0.001 sec  <<< FAILURE!
org.junit.ComparisonFailure: expected:<...I@68bb6598[{1,2,-3,4[}]]> but was:<...I@68bb6598[{1,2,-3,4[]]>
	at org.junit.Assert.assertEquals(Assert.java:115)
	at org.junit.Assert.assertEquals(Assert.java:144)
	at org.apache.commons.lang3.builder.ToStringBuilderTest.testReflectionIntArray(ToStringBuilderTest.java:178)

testReflectionCharArray(org.apache.commons.lang3.builder.ToStringBuilderTest)  Time elapsed: 0 sec  <<< FAILURE!
org.junit.ComparisonFailure: expected:<[C@670b13df[{A,2,_,D[}]]> but was:<[C@670b13df[{A,2,_,D[]]>
	at org.junit.Assert.assertEquals(Assert.java:115)
	at org.junit.Assert.assertEquals(Assert.java:144)
	at org.apache.commons.lang3.builder.ToStringBuilderTest.testReflectionCharArray(ToStringBuilderTest.java:205)

testInnerClassReflection(org.apache.commons.lang3.builder.ToStringBuilderTest)  Time elapsed: 0 sec  <<< FAILURE!
org.junit.ComparisonFailure: expected:<...Outer$Inner@6c02d7ea[[]]]> but was:<...Outer$Inner@6c02d7ea[],]]>
	at org.junit.Assert.assertEquals(Assert.java:115)
	at org.junit.Assert.assertEquals(Assert.java:144)
	at org.apache.commons.lang3.builder.ToStringBuilderTest.testInnerClassReflection(ToStringBuilderTest.java:376)

testReflectionCharacter(org.apache.commons.lang3.builder.ToStringBuilderTest)  Time elapsed: 0 sec  <<< FAILURE!
org.junit.ComparisonFailure: expected:<...ter@615d5d35[value=A[]]> but was:<...ter@615d5d35[value=A[,]]>
	at org.junit.Assert.assertEquals(Assert.java:115)
	at org.junit.Assert.assertEquals(Assert.java:144)
	at org.apache.commons.lang3.builder.ToStringBuilderTest.testReflectionCharacter(ToStringBuilderTest.java:106)

testDoubleArray(org.apache.commons.lang3.builder.ToStringBuilderTest)  Time elapsed: 0 sec  <<< FAILURE!
org.junit.ComparisonFailure: expected:<...2.9876,-3.00001,4.3}[]]> but was:<...2.9876,-3.00001,4.3}[,]]>
	at org.junit.Assert.assertEquals(Assert.java:115)
	at org.junit.Assert.assertEquals(Assert.java:144)
	at org.apache.commons.lang3.builder.ToStringBuilderTest.testDoubleArray(ToStringBuilderTest.java:777)

testReflectionFloatArrayArray(org.apache.commons.lang3.builder.ToStringBuilderTest)  Time elapsed: 0 sec  <<< FAILURE!
org.junit.ComparisonFailure: expected:<....29686},<null>,{NaN}[}]]> but was:<....29686},<null>,{NaN}[]]>
	at org.junit.Assert.assertEquals(Assert.java:115)
	at org.junit.Assert.assertEquals(Assert.java:144)
	at org.apache.commons.lang3.builder.ToStringBuilderTest.testReflectionFloatArrayArray(ToStringBuilderTest.java:243)

Running org.apache.commons.lang3.builder.EqualsBuilderTest
Tests run: 48, Failures: 0, Errors: 0, Skipped: 0, Time elapsed: 0.014 sec - in org.apache.commons.lang3.builder.EqualsBuilderTest
Running org.apache.commons.lang3.builder.HashCodeBuilderAndEqualsBuilderTest
Tests run: 4, Failures: 0, Errors: 0, Skipped: 0, Time elapsed: 0.01 sec - in org.apache.commons.lang3.builder.HashCodeBuilderAndEqualsBuilderTest
Running org.apache.commons.lang3.builder.ReflectionToStringBuilderConcurrencyTest
Tests run: 3, Failures: 0, Errors: 0, Skipped: 3, Time elapsed: 0 sec - in org.apache.commons.lang3.builder.ReflectionToStringBuilderConcurrencyTest
Running org.apache.commons.lang3.builder.JsonToStringStyleTest
Tests run: 9, Failures: 5, Errors: 0, Skipped: 0, Time elapsed: 0.001 sec <<< FAILURE! - in org.apache.commons.lang3.builder.JsonToStringStyleTest
testBlank(org.apache.commons.lang3.builder.JsonToStringStyleTest)  Time elapsed: 0 sec  <<< FAILURE!
org.junit.ComparisonFailure: expected:<[{]}> but was:<[]}>
	at org.junit.Assert.assertEquals(Assert.java:115)
	at org.junit.Assert.assertEquals(Assert.java:144)
	at org.apache.commons.lang3.builder.JsonToStringStyleTest.testBlank(JsonToStringStyleTest.java:59)

testLong(org.apache.commons.lang3.builder.JsonToStringStyleTest)  Time elapsed: 0 sec  <<< FAILURE!
org.junit.ComparisonFailure: expected:<{"a":3[]}> but was:<{"a":3[,]}>
	at org.junit.Assert.assertEquals(Assert.java:115)
	at org.junit.Assert.assertEquals(Assert.java:144)
	at org.apache.commons.lang3.builder.JsonToStringStyleTest.testLong(JsonToStringStyleTest.java:208)

testObject(org.apache.commons.lang3.builder.JsonToStringStyleTest)  Time elapsed: 0 sec  <<< FAILURE!
org.junit.ComparisonFailure: expected:<{"a":null[]}> but was:<{"a":null[,]}>
	at org.junit.Assert.assertEquals(Assert.java:115)
	at org.junit.Assert.assertEquals(Assert.java:144)
	at org.apache.commons.lang3.builder.JsonToStringStyleTest.testObject(JsonToStringStyleTest.java:112)

testPerson(org.apache.commons.lang3.builder.JsonToStringStyleTest)  Time elapsed: 0 sec  <<< FAILURE!
org.junit.ComparisonFailure: expected:<...ge":25,"smoker":true[]}> but was:<...ge":25,"smoker":true[,]}>
	at org.junit.Assert.assertEquals(Assert.java:115)
	at org.junit.Assert.assertEquals(Assert.java:144)
	at org.apache.commons.lang3.builder.JsonToStringStyleTest.testPerson(JsonToStringStyleTest.java:192)

testAppendSuper(org.apache.commons.lang3.builder.JsonToStringStyleTest)  Time elapsed: 0 sec  <<< FAILURE!
org.junit.ComparisonFailure: expected:<[{]}> but was:<[]}>
	at org.junit.Assert.assertEquals(Assert.java:115)
	at org.junit.Assert.assertEquals(Assert.java:144)
	at org.apache.commons.lang3.builder.JsonToStringStyleTest.testAppendSuper(JsonToStringStyleTest.java:64)

Running org.apache.commons.lang3.builder.NoClassNameToStringStyleTest
Tests run: 8, Failures: 8, Errors: 0, Skipped: 0, Time elapsed: 0.005 sec <<< FAILURE! - in org.apache.commons.lang3.builder.NoClassNameToStringStyleTest
testObjectArray(org.apache.commons.lang3.builder.NoClassNameToStringStyleTest)  Time elapsed: 0 sec  <<< FAILURE!
org.junit.ComparisonFailure: expected:<[{<null>,5,{3,6}}[]]> but was:<[{<null>,5,{3,6}}[,]]>
	at org.junit.Assert.assertEquals(Assert.java:115)
	at org.junit.Assert.assertEquals(Assert.java:144)
	at org.apache.commons.lang3.builder.NoClassNameToStringStyleTest.testObjectArray(NoClassNameToStringStyleTest.java:102)

testBlank(org.apache.commons.lang3.builder.NoClassNameToStringStyleTest)  Time elapsed: 0 sec  <<< FAILURE!
org.junit.ComparisonFailure: expected:<[[]]> but was:<[]]>
	at org.junit.Assert.assertEquals(Assert.java:115)
	at org.junit.Assert.assertEquals(Assert.java:144)
	at org.apache.commons.lang3.builder.NoClassNameToStringStyleTest.testBlank(NoClassNameToStringStyleTest.java:52)

testLong(org.apache.commons.lang3.builder.NoClassNameToStringStyleTest)  Time elapsed: 0 sec  <<< FAILURE!
org.junit.ComparisonFailure: expected:<[3[]]> but was:<[3[,]]>
	at org.junit.Assert.assertEquals(Assert.java:115)
	at org.junit.Assert.assertEquals(Assert.java:144)
	at org.apache.commons.lang3.builder.NoClassNameToStringStyleTest.testLong(NoClassNameToStringStyleTest.java:94)

testLongArrayArray(org.apache.commons.lang3.builder.NoClassNameToStringStyleTest)  Time elapsed: 0 sec  <<< FAILURE!
org.junit.ComparisonFailure: expected:<[{{1,2},<null>,{5}}[]]> but was:<[{{1,2},<null>,{5}}[,]]>
	at org.junit.Assert.assertEquals(Assert.java:115)
	at org.junit.Assert.assertEquals(Assert.java:144)
	at org.apache.commons.lang3.builder.NoClassNameToStringStyleTest.testLongArrayArray(NoClassNameToStringStyleTest.java:122)

testLongArray(org.apache.commons.lang3.builder.NoClassNameToStringStyleTest)  Time elapsed: 0 sec  <<< FAILURE!
org.junit.ComparisonFailure: expected:<[{1,2,-3,4}[]]> but was:<[{1,2,-3,4}[,]]>
	at org.junit.Assert.assertEquals(Assert.java:115)
	at org.junit.Assert.assertEquals(Assert.java:144)
	at org.apache.commons.lang3.builder.NoClassNameToStringStyleTest.testLongArray(NoClassNameToStringStyleTest.java:112)

testObject(org.apache.commons.lang3.builder.NoClassNameToStringStyleTest)  Time elapsed: 0 sec  <<< FAILURE!
org.junit.ComparisonFailure: expected:<[<null>[]]> but was:<[<null>[,]]>
	at org.junit.Assert.assertEquals(Assert.java:115)
	at org.junit.Assert.assertEquals(Assert.java:144)
	at org.apache.commons.lang3.builder.NoClassNameToStringStyleTest.testObject(NoClassNameToStringStyleTest.java:69)

testPerson(org.apache.commons.lang3.builder.NoClassNameToStringStyleTest)  Time elapsed: 0 sec  <<< FAILURE!
org.junit.ComparisonFailure: expected:<...c,age=45,smoker=true[]]> but was:<...c,age=45,smoker=true[,]]>
	at org.junit.Assert.assertEquals(Assert.java:115)
	at org.junit.Assert.assertEquals(Assert.java:144)
	at org.apache.commons.lang3.builder.NoClassNameToStringStyleTest.testPerson(NoClassNameToStringStyleTest.java:89)

testAppendSuper(org.apache.commons.lang3.builder.NoClassNameToStringStyleTest)  Time elapsed: 0 sec  <<< FAILURE!
org.junit.ComparisonFailure: expected:<[[]]> but was:<[]]>
	at org.junit.Assert.assertEquals(Assert.java:115)
	at org.junit.Assert.assertEquals(Assert.java:144)
	at org.apache.commons.lang3.builder.NoClassNameToStringStyleTest.testAppendSuper(NoClassNameToStringStyleTest.java:57)

Running org.apache.commons.lang3.builder.DiffBuilderTest
Tests run: 30, Failures: 0, Errors: 0, Skipped: 0, Time elapsed: 0.017 sec - in org.apache.commons.lang3.builder.DiffBuilderTest
Running org.apache.commons.lang3.builder.HashCodeBuilderTest
Tests run: 44, Failures: 0, Errors: 0, Skipped: 0, Time elapsed: 0.011 sec - in org.apache.commons.lang3.builder.HashCodeBuilderTest
Running org.apache.commons.lang3.concurrent.AtomicInitializerTest
Tests run: 3, Failures: 0, Errors: 0, Skipped: 0, Time elapsed: 0.01 sec - in org.apache.commons.lang3.concurrent.AtomicInitializerTest
Running org.apache.commons.lang3.concurrent.CallableBackgroundInitializerTest
Tests run: 4, Failures: 0, Errors: 0, Skipped: 0, Time elapsed: 0.001 sec - in org.apache.commons.lang3.concurrent.CallableBackgroundInitializerTest
Running org.apache.commons.lang3.concurrent.BackgroundInitializerTest
Tests run: 15, Failures: 0, Errors: 0, Skipped: 0, Time elapsed: 0.014 sec - in org.apache.commons.lang3.concurrent.BackgroundInitializerTest
Running org.apache.commons.lang3.concurrent.LazyInitializerTest
Tests run: 3, Failures: 0, Errors: 0, Skipped: 0, Time elapsed: 0.012 sec - in org.apache.commons.lang3.concurrent.LazyInitializerTest
Running org.apache.commons.lang3.concurrent.BasicThreadFactoryTest
Tests run: 15, Failures: 0, Errors: 0, Skipped: 0, Time elapsed: 0.037 sec - in org.apache.commons.lang3.concurrent.BasicThreadFactoryTest
Running org.apache.commons.lang3.concurrent.ConstantInitializerTest
Tests run: 7, Failures: 0, Errors: 0, Skipped: 0, Time elapsed: 0.001 sec - in org.apache.commons.lang3.concurrent.ConstantInitializerTest
Running org.apache.commons.lang3.concurrent.MultiBackgroundInitializerTest
Tests run: 17, Failures: 0, Errors: 0, Skipped: 0, Time elapsed: 0.049 sec - in org.apache.commons.lang3.concurrent.MultiBackgroundInitializerTest
Running org.apache.commons.lang3.concurrent.AtomicSafeInitializerTest
Tests run: 4, Failures: 0, Errors: 0, Skipped: 0, Time elapsed: 0.005 sec - in org.apache.commons.lang3.concurrent.AtomicSafeInitializerTest
Running org.apache.commons.lang3.concurrent.ConcurrentUtilsTest
Tests run: 40, Failures: 0, Errors: 0, Skipped: 0, Time elapsed: 0.015 sec - in org.apache.commons.lang3.concurrent.ConcurrentUtilsTest
Running org.apache.commons.lang3.concurrent.TimedSemaphoreTest
Tests run: 15, Failures: 0, Errors: 0, Skipped: 0, Time elapsed: 1.181 sec - in org.apache.commons.lang3.concurrent.TimedSemaphoreTest
Running org.apache.commons.lang3.StringUtilsSubstringTest
Tests run: 14, Failures: 0, Errors: 0, Skipped: 0, Time elapsed: 0.006 sec - in org.apache.commons.lang3.StringUtilsSubstringTest
Running org.apache.commons.lang3.SystemUtilsTest
Tests run: 12, Failures: 0, Errors: 0, Skipped: 0, Time elapsed: 0.002 sec - in org.apache.commons.lang3.SystemUtilsTest
Running org.apache.commons.lang3.CharRangeTest
Tests run: 16, Failures: 0, Errors: 0, Skipped: 0, Time elapsed: 0.03 sec - in org.apache.commons.lang3.CharRangeTest
Running org.apache.commons.lang3.CharSetTest
Tests run: 14, Failures: 0, Errors: 0, Skipped: 0, Time elapsed: 0.008 sec - in org.apache.commons.lang3.CharSetTest
Running org.apache.commons.lang3.StringUtilsStartsEndsWithTest
Tests run: 6, Failures: 0, Errors: 0, Skipped: 0, Time elapsed: 0.002 sec - in org.apache.commons.lang3.StringUtilsStartsEndsWithTest
Running org.apache.commons.lang3.RandomStringUtilsTest
Tests run: 11, Failures: 0, Errors: 0, Skipped: 0, Time elapsed: 0.033 sec - in org.apache.commons.lang3.RandomStringUtilsTest
Running org.apache.commons.lang3.SerializationUtilsTest
Tests run: 26, Failures: 0, Errors: 0, Skipped: 0, Time elapsed: 0.04 sec - in org.apache.commons.lang3.SerializationUtilsTest
Running org.apache.commons.lang3.time.StopWatchTest
Tests run: 8, Failures: 0, Errors: 0, Skipped: 0, Time elapsed: 4.763 sec - in org.apache.commons.lang3.time.StopWatchTest
Running org.apache.commons.lang3.time.DateUtilsRoundingTest
Tests run: 22, Failures: 0, Errors: 0, Skipped: 0, Time elapsed: 0.168 sec - in org.apache.commons.lang3.time.DateUtilsRoundingTest
Running org.apache.commons.lang3.time.FastDateParserTest
Tests run: 33, Failures: 0, Errors: 0, Skipped: 0, Time elapsed: 2.154 sec - in org.apache.commons.lang3.time.FastDateParserTest
Running org.apache.commons.lang3.time.FastDateFormat_ParserTest
Tests run: 33, Failures: 0, Errors: 0, Skipped: 0, Time elapsed: 0.688 sec - in org.apache.commons.lang3.time.FastDateFormat_ParserTest
Running org.apache.commons.lang3.time.DurationFormatUtilsTest
Tests run: 25, Failures: 0, Errors: 0, Skipped: 0, Time elapsed: 0.788 sec - in org.apache.commons.lang3.time.DurationFormatUtilsTest
Running org.apache.commons.lang3.time.DateFormatUtilsTest
Tests run: 10, Failures: 0, Errors: 0, Skipped: 0, Time elapsed: 0.003 sec - in org.apache.commons.lang3.time.DateFormatUtilsTest
Running org.apache.commons.lang3.time.DateUtilsFragmentTest
Tests run: 57, Failures: 0, Errors: 0, Skipped: 0, Time elapsed: 0.011 sec - in org.apache.commons.lang3.time.DateUtilsFragmentTest
Running org.apache.commons.lang3.time.FastDatePrinterTimeZonesTest
Tests run: 617, Failures: 0, Errors: 0, Skipped: 0, Time elapsed: 0.196 sec - in org.apache.commons.lang3.time.FastDatePrinterTimeZonesTest
Running org.apache.commons.lang3.time.FastDateFormatTest
>>FastDateFormatTest: FastDateParser:32961  SimpleDateFormat:3636
Tests run: 14, Failures: 0, Errors: 0, Skipped: 0, Time elapsed: 3.925 sec - in org.apache.commons.lang3.time.FastDateFormatTest
Running org.apache.commons.lang3.time.FastDateFormat_PrinterTest
Tests run: 17, Failures: 0, Errors: 0, Skipped: 0, Time elapsed: 0.008 sec - in org.apache.commons.lang3.time.FastDateFormat_PrinterTest
Running org.apache.commons.lang3.time.FastDatePrinterTest
Tests run: 17, Failures: 0, Errors: 0, Skipped: 0, Time elapsed: 0.004 sec - in org.apache.commons.lang3.time.FastDatePrinterTest
Running org.apache.commons.lang3.time.FastDateParserSDFTest
Tests run: 276, Failures: 0, Errors: 0, Skipped: 92, Time elapsed: 0.067 sec - in org.apache.commons.lang3.time.FastDateParserSDFTest
Running org.apache.commons.lang3.time.DateUtilsTest
DateUtilsTest: Default Locale=en_US
Tests run: 38, Failures: 0, Errors: 0, Skipped: 0, Time elapsed: 0.018 sec - in org.apache.commons.lang3.time.DateUtilsTest
Running org.apache.commons.lang3.reflect.InheritanceUtilsTest
Tests run: 9, Failures: 0, Errors: 0, Skipped: 0, Time elapsed: 0.001 sec - in org.apache.commons.lang3.reflect.InheritanceUtilsTest
Running org.apache.commons.lang3.reflect.MethodUtilsTest
Tests run: 23, Failures: 0, Errors: 0, Skipped: 0, Time elapsed: 0.034 sec - in org.apache.commons.lang3.reflect.MethodUtilsTest
Running org.apache.commons.lang3.reflect.ConstructorUtilsTest
Tests run: 7, Failures: 0, Errors: 0, Skipped: 0, Time elapsed: 0.005 sec - in org.apache.commons.lang3.reflect.ConstructorUtilsTest
Running org.apache.commons.lang3.reflect.FieldUtilsTest
Tests run: 64, Failures: 0, Errors: 0, Skipped: 0, Time elapsed: 0.032 sec - in org.apache.commons.lang3.reflect.FieldUtilsTest
Running org.apache.commons.lang3.reflect.TypeLiteralTest
Tests run: 4, Failures: 0, Errors: 0, Skipped: 0, Time elapsed: 0.006 sec - in org.apache.commons.lang3.reflect.TypeLiteralTest
Running org.apache.commons.lang3.reflect.TypeUtilsTest
Tests run: 19, Failures: 0, Errors: 0, Skipped: 0, Time elapsed: 0.048 sec - in org.apache.commons.lang3.reflect.TypeUtilsTest
Running org.apache.commons.lang3.mutable.MutableByteTest
Tests run: 17, Failures: 0, Errors: 0, Skipped: 0, Time elapsed: 0.004 sec - in org.apache.commons.lang3.mutable.MutableByteTest
Running org.apache.commons.lang3.mutable.MutableShortTest
Tests run: 14, Failures: 0, Errors: 0, Skipped: 0, Time elapsed: 0.003 sec - in org.apache.commons.lang3.mutable.MutableShortTest
Running org.apache.commons.lang3.mutable.MutableIntTest
Tests run: 17, Failures: 0, Errors: 0, Skipped: 0, Time elapsed: 0.007 sec - in org.apache.commons.lang3.mutable.MutableIntTest
Running org.apache.commons.lang3.mutable.MutableDoubleTest
Tests run: 18, Failures: 0, Errors: 0, Skipped: 0, Time elapsed: 0.002 sec - in org.apache.commons.lang3.mutable.MutableDoubleTest
Running org.apache.commons.lang3.mutable.MutableFloatTest
Tests run: 18, Failures: 0, Errors: 0, Skipped: 0, Time elapsed: 0.005 sec - in org.apache.commons.lang3.mutable.MutableFloatTest
Running org.apache.commons.lang3.mutable.MutableLongTest
Tests run: 17, Failures: 0, Errors: 0, Skipped: 0, Time elapsed: 0.003 sec - in org.apache.commons.lang3.mutable.MutableLongTest
Running org.apache.commons.lang3.mutable.MutableBooleanTest
Tests run: 9, Failures: 0, Errors: 0, Skipped: 0, Time elapsed: 0.001 sec - in org.apache.commons.lang3.mutable.MutableBooleanTest
Running org.apache.commons.lang3.mutable.MutableObjectTest
Tests run: 5, Failures: 0, Errors: 0, Skipped: 0, Time elapsed: 0 sec - in org.apache.commons.lang3.mutable.MutableObjectTest
Running org.apache.commons.lang3.text.translate.UnicodeEscaperTest
Tests run: 3, Failures: 0, Errors: 0, Skipped: 0, Time elapsed: 0.001 sec - in org.apache.commons.lang3.text.translate.UnicodeEscaperTest
Running org.apache.commons.lang3.text.translate.EntityArraysTest
Tests run: 3, Failures: 0, Errors: 0, Skipped: 0, Time elapsed: 0.001 sec - in org.apache.commons.lang3.text.translate.EntityArraysTest
Running org.apache.commons.lang3.text.translate.UnicodeUnpairedSurrogateRemoverTest
Tests run: 2, Failures: 0, Errors: 0, Skipped: 0, Time elapsed: 0.001 sec - in org.apache.commons.lang3.text.translate.UnicodeUnpairedSurrogateRemoverTest
Running org.apache.commons.lang3.text.translate.NumericEntityUnescaperTest
Tests run: 3, Failures: 0, Errors: 0, Skipped: 0, Time elapsed: 0 sec - in org.apache.commons.lang3.text.translate.NumericEntityUnescaperTest
Running org.apache.commons.lang3.text.translate.NumericEntityEscaperTest
Tests run: 4, Failures: 0, Errors: 0, Skipped: 0, Time elapsed: 0.001 sec - in org.apache.commons.lang3.text.translate.NumericEntityEscaperTest
Running org.apache.commons.lang3.text.translate.LookupTranslatorTest
Tests run: 2, Failures: 0, Errors: 0, Skipped: 0, Time elapsed: 0 sec - in org.apache.commons.lang3.text.translate.LookupTranslatorTest
Running org.apache.commons.lang3.text.translate.UnicodeUnescaperTest
Tests run: 3, Failures: 0, Errors: 0, Skipped: 0, Time elapsed: 0 sec - in org.apache.commons.lang3.text.translate.UnicodeUnescaperTest
Running org.apache.commons.lang3.text.translate.OctalUnescaperTest
Tests run: 1, Failures: 0, Errors: 0, Skipped: 0, Time elapsed: 0 sec - in org.apache.commons.lang3.text.translate.OctalUnescaperTest
Running org.apache.commons.lang3.text.StrMatcherTest
Tests run: 14, Failures: 0, Errors: 0, Skipped: 0, Time elapsed: 0.002 sec - in org.apache.commons.lang3.text.StrMatcherTest
Running org.apache.commons.lang3.text.StrTokenizerTest
Tests run: 55, Failures: 0, Errors: 0, Skipped: 0, Time elapsed: 0.01 sec - in org.apache.commons.lang3.text.StrTokenizerTest
Running org.apache.commons.lang3.text.FormattableUtilsTest
Tests run: 5, Failures: 0, Errors: 0, Skipped: 0, Time elapsed: 0 sec - in org.apache.commons.lang3.text.FormattableUtilsTest
Running org.apache.commons.lang3.text.CompositeFormatTest
Tests run: 2, Failures: 0, Errors: 0, Skipped: 0, Time elapsed: 0 sec - in org.apache.commons.lang3.text.CompositeFormatTest
Running org.apache.commons.lang3.text.WordUtilsTest
Tests run: 12, Failures: 0, Errors: 0, Skipped: 0, Time elapsed: 0.002 sec - in org.apache.commons.lang3.text.WordUtilsTest
Running org.apache.commons.lang3.text.StrLookupTest
Tests run: 5, Failures: 0, Errors: 0, Skipped: 0, Time elapsed: 0.002 sec - in org.apache.commons.lang3.text.StrLookupTest
Running org.apache.commons.lang3.text.StrBuilderAppendInsertTest
Tests run: 51, Failures: 0, Errors: 0, Skipped: 0, Time elapsed: 0.01 sec - in org.apache.commons.lang3.text.StrBuilderAppendInsertTest
Running org.apache.commons.lang3.text.ExtendedMessageFormatTest
Tests run: 10, Failures: 0, Errors: 0, Skipped: 0, Time elapsed: 0.813 sec - in org.apache.commons.lang3.text.ExtendedMessageFormatTest
Running org.apache.commons.lang3.text.StrSubstitutorTest
Tests run: 40, Failures: 0, Errors: 0, Skipped: 0, Time elapsed: 0.024 sec - in org.apache.commons.lang3.text.StrSubstitutorTest
Running org.apache.commons.lang3.text.StrBuilderTest
Tests run: 90, Failures: 0, Errors: 0, Skipped: 0, Time elapsed: 0.044 sec - in org.apache.commons.lang3.text.StrBuilderTest
Running org.apache.commons.lang3.StringEscapeUtilsTest
Tests run: 28, Failures: 0, Errors: 0, Skipped: 0, Time elapsed: 0.289 sec - in org.apache.commons.lang3.StringEscapeUtilsTest
Running org.apache.commons.lang3.AnnotationUtilsTest
Tests run: 10, Failures: 0, Errors: 0, Skipped: 0, Time elapsed: 0.019 sec - in org.apache.commons.lang3.AnnotationUtilsTest
Running org.apache.commons.lang3.ConversionTest
Tests run: 42, Failures: 0, Errors: 0, Skipped: 0, Time elapsed: 0.017 sec - in org.apache.commons.lang3.ConversionTest
Running org.apache.commons.lang3.StringUtilsTrimEmptyTest
Tests run: 15, Failures: 0, Errors: 0, Skipped: 0, Time elapsed: 0.006 sec - in org.apache.commons.lang3.StringUtilsTrimEmptyTest
Running org.apache.commons.lang3.EnumUtilsTest
Tests run: 34, Failures: 0, Errors: 0, Skipped: 0, Time elapsed: 0.007 sec - in org.apache.commons.lang3.EnumUtilsTest
Running org.apache.commons.lang3.exception.ExceptionUtilsTest
Tests run: 28, Failures: 0, Errors: 0, Skipped: 0, Time elapsed: 0.025 sec - in org.apache.commons.lang3.exception.ExceptionUtilsTest
Running org.apache.commons.lang3.exception.DefaultExceptionContextTest
Tests run: 8, Failures: 0, Errors: 0, Skipped: 0, Time elapsed: 0.002 sec - in org.apache.commons.lang3.exception.DefaultExceptionContextTest
Running org.apache.commons.lang3.exception.ContextedExceptionTest
Tests run: 14, Failures: 0, Errors: 0, Skipped: 0, Time elapsed: 0.01 sec - in org.apache.commons.lang3.exception.ContextedExceptionTest
Running org.apache.commons.lang3.exception.ContextedRuntimeExceptionTest
Tests run: 14, Failures: 0, Errors: 0, Skipped: 0, Time elapsed: 0.01 sec - in org.apache.commons.lang3.exception.ContextedRuntimeExceptionTest
Running org.apache.commons.lang3.BitFieldTest
Tests run: 15, Failures: 0, Errors: 0, Skipped: 0, Time elapsed: 0.002 sec - in org.apache.commons.lang3.BitFieldTest
Running org.apache.commons.lang3.ArrayUtilsRemoveMultipleTest
Tests run: 55, Failures: 0, Errors: 0, Skipped: 0, Time elapsed: 0.011 sec - in org.apache.commons.lang3.ArrayUtilsRemoveMultipleTest
Running org.apache.commons.lang3.HashSetvBitSetTest
Ratio=9% array=100 count=1 extract=22131785 bitset=2067180
Ratio=11% array=100 count=10 extract=17423573 bitset=1988247
Ratio=9% array=100 count=50 extract=5928772 bitset=576555
Ratio=4% array=100 count=100 extract=9644098 bitset=440362
Ratio=82% array=1000 count=10 extract=5915246 bitset=4865042
Ratio=31% array=1000 count=100 extract=14647436 bitset=4600051
Ratio=7% array=1000 count=500 extract=41976687 bitset=3069165
Ratio=0% array=1000 count=1000 extract=78613390 bitset=722398
Ratio=3% count=0 hash=4011238 bits=147065
Ratio=32% count=5 hash=555585 bits=178767
Ratio=29% count=10 hash=870435 bits=253621
Ratio=23% count=200 hash=17665061 bits=4094979
Ratio=13% count=50 hash=8727967 bits=1179227
Ratio=28% count=100 hash=8142087 bits=2279950
Ratio=21% count=1000 hash=71929745 bits=15662967
Ratio=21% count=2000 hash=145206682 bits=30999345
Tests run: 2, Failures: 0, Errors: 0, Skipped: 0, Time elapsed: 0.628 sec - in org.apache.commons.lang3.HashSetvBitSetTest
Running org.apache.commons.lang3.StringUtilsTest
Tests run: 124, Failures: 0, Errors: 0, Skipped: 0, Time elapsed: 0.176 sec - in org.apache.commons.lang3.StringUtilsTest
Running org.apache.commons.lang3.ArrayUtilsRemoveTest
Tests run: 19, Failures: 0, Errors: 0, Skipped: 0, Time elapsed: 0.001 sec - in org.apache.commons.lang3.ArrayUtilsRemoveTest
Running org.apache.commons.lang3.ObjectUtilsTest
Tests run: 36, Failures: 0, Errors: 0, Skipped: 0, Time elapsed: 0.015 sec - in org.apache.commons.lang3.ObjectUtilsTest
Running org.apache.commons.lang3.ClassPathUtilsTest
Tests run: 13, Failures: 0, Errors: 0, Skipped: 0, Time elapsed: 0.003 sec - in org.apache.commons.lang3.ClassPathUtilsTest
Running org.apache.commons.lang3.math.NumberUtilsTest
Tests run: 91, Failures: 0, Errors: 0, Skipped: 0, Time elapsed: 0.035 sec - in org.apache.commons.lang3.math.NumberUtilsTest
Running org.apache.commons.lang3.math.IEEE754rUtilsTest
Tests run: 3, Failures: 0, Errors: 0, Skipped: 0, Time elapsed: 0 sec - in org.apache.commons.lang3.math.IEEE754rUtilsTest
Running org.apache.commons.lang3.math.FractionTest
Tests run: 25, Failures: 0, Errors: 0, Skipped: 0, Time elapsed: 0.287 sec - in org.apache.commons.lang3.math.FractionTest
Running org.apache.commons.lang3.BooleanUtilsTest
Tests run: 72, Failures: 0, Errors: 0, Skipped: 0, Time elapsed: 0.013 sec - in org.apache.commons.lang3.BooleanUtilsTest
Running org.apache.commons.lang3.CharSequenceUtilsTest
Tests run: 2, Failures: 0, Errors: 0, Skipped: 0, Time elapsed: 0 sec - in org.apache.commons.lang3.CharSequenceUtilsTest
Running org.apache.commons.lang3.CharSetUtilsTest
Tests run: 11, Failures: 0, Errors: 0, Skipped: 0, Time elapsed: 0.001 sec - in org.apache.commons.lang3.CharSetUtilsTest
Running org.apache.commons.lang3.ArrayUtilsAddTest
Tests run: 13, Failures: 0, Errors: 0, Skipped: 0, Time elapsed: 0.002 sec - in org.apache.commons.lang3.ArrayUtilsAddTest
Running org.apache.commons.lang3.CharEncodingTest
Tests run: 6, Failures: 0, Errors: 0, Skipped: 0, Time elapsed: 0.046 sec - in org.apache.commons.lang3.CharEncodingTest
Running org.apache.commons.lang3.ClassUtilsTest
Tests run: 57, Failures: 0, Errors: 0, Skipped: 0, Time elapsed: 0.028 sec - in org.apache.commons.lang3.ClassUtilsTest
Running org.apache.commons.lang3.RangeTest
Tests run: 24, Failures: 0, Errors: 0, Skipped: 0, Time elapsed: 0.008 sec - in org.apache.commons.lang3.RangeTest
Running org.apache.commons.lang3.event.EventUtilsTest
Tests run: 8, Failures: 0, Errors: 0, Skipped: 0, Time elapsed: 0.015 sec - in org.apache.commons.lang3.event.EventUtilsTest
Running org.apache.commons.lang3.event.EventListenerSupportTest
Tests run: 9, Failures: 0, Errors: 0, Skipped: 0, Time elapsed: 0.019 sec - in org.apache.commons.lang3.event.EventListenerSupportTest
Running org.apache.commons.lang3.ArrayUtilsTest
Tests run: 205, Failures: 1, Errors: 0, Skipped: 0, Time elapsed: 0.039 sec <<< FAILURE! - in org.apache.commons.lang3.ArrayUtilsTest
testToString(org.apache.commons.lang3.ArrayUtilsTest)  Time elapsed: 0.001 sec  <<< FAILURE!
org.junit.ComparisonFailure: expected:<{}[]> but was:<{}[,]>
	at org.junit.Assert.assertEquals(Assert.java:115)
	at org.junit.Assert.assertEquals(Assert.java:144)
	at org.apache.commons.lang3.ArrayUtilsTest.testToString(ArrayUtilsTest.java:53)

Running org.apache.commons.lang3.CharUtilsTest
Tests run: 24, Failures: 0, Errors: 0, Skipped: 0, Time elapsed: 0.001 sec - in org.apache.commons.lang3.CharUtilsTest
Running org.apache.commons.lang3.NotImplementedExceptionTest
Tests run: 1, Failures: 0, Errors: 0, Skipped: 0, Time elapsed: 0 sec - in org.apache.commons.lang3.NotImplementedExceptionTest
Running org.apache.commons.lang3.StringUtilsEqualsIndexOfTest
Tests run: 50, Failures: 0, Errors: 0, Skipped: 0, Time elapsed: 0.004 sec - in org.apache.commons.lang3.StringUtilsEqualsIndexOfTest
Running org.apache.commons.lang3.RandomUtilsTest
Tests run: 23, Failures: 0, Errors: 0, Skipped: 0, Time elapsed: 0 sec - in org.apache.commons.lang3.RandomUtilsTest

Results :

Failed tests: 
  ArrayUtilsTest.testToString:53 expected:<{}[]> but was:<{}[,]>
  DefaultToStringStyleTest.testAppendSuper:58 expected:<...lang.Integer@dda4f7b[[]]> but was:<...lang.Integer@dda4f7b[]]>
  DefaultToStringStyleTest.testBlank:53 expected:<...lang.Integer@dda4f7b[[]]> but was:<...lang.Integer@dda4f7b[]]>
  DefaultToStringStyleTest.testLong:96 expected:<...ng.Integer@dda4f7b[3[]]> but was:<...ng.Integer@dda4f7b[3[,]]>
  DefaultToStringStyleTest.testLongArray:114 expected:<...r@dda4f7b[{1,2,-3,4}[]]> but was:<...r@dda4f7b[{1,2,-3,4}[,]]>
  DefaultToStringStyleTest.testLongArrayArray:124 expected:<...b[{{1,2},<null>,{5}}[]]> but was:<...b[{{1,2},<null>,{5}}[,]]>
  DefaultToStringStyleTest.testObject:70 expected:<...teger@dda4f7b[<null>[]]> but was:<...teger@dda4f7b[<null>[,]]>
  DefaultToStringStyleTest.testObjectArray:104 expected:<...f7b[{<null>,5,{3,6}}[]]> but was:<...f7b[{<null>,5,{3,6}}[,]]>
  DefaultToStringStyleTest.testPerson:91 expected:<...,age=33,smoker=false[]]> but was:<...,age=33,smoker=false[,]]>
  DiffResultTest.testToStringOutput:95 expected:<...mptyClass[test=false[] differs from DiffResultTest.EmptyClass[test=true]]> but was:<...mptyClass[test=false[,] differs from DiffResultTest.EmptyClass[test=true,]]>
  JsonToStringStyleTest.testAppendSuper:64 expected:<[{]}> but was:<[]}>
  JsonToStringStyleTest.testBlank:59 expected:<[{]}> but was:<[]}>
  JsonToStringStyleTest.testLong:208 expected:<{"a":3[]}> but was:<{"a":3[,]}>
  JsonToStringStyleTest.testObject:112 expected:<{"a":null[]}> but was:<{"a":null[,]}>
  JsonToStringStyleTest.testPerson:192 expected:<...ge":25,"smoker":true[]}> but was:<...ge":25,"smoker":true[,]}>
  MultiLineToStringStyleTest.testAppendSuper:59 expected:<...ng.Integer@dda4f7b[
[]]> but was:<...ng.Integer@dda4f7b[
[  
]]>
  MultiLineToStringStyleTest.testBlank:54 expected:<...ng.Integer@dda4f7b[
[]]> but was:<...ng.Integer@dda4f7b[
[  
]]>
  MultiLineToStringStyleTest.testLong:97 expected:<...nteger@dda4f7b[
  3
[]]> but was:<...nteger@dda4f7b[
  3
[  
]]>
  MultiLineToStringStyleTest.testLongArray:115 expected:<...a4f7b[
  {1,2,-3,4}
[]]> but was:<...a4f7b[
  {1,2,-3,4}
[  
]]>
  MultiLineToStringStyleTest.testLongArrayArray:125 expected:<... {{1,2},<null>,{5}}
[]]> but was:<... {{1,2},<null>,{5}}
[  
]]>
  MultiLineToStringStyleTest.testObject:71 expected:<...r@dda4f7b[
  <null>
[]]> but was:<...r@dda4f7b[
  <null>
[  
]]>
  MultiLineToStringStyleTest.testObjectArray:105 expected:<...
  {<null>,5,{3,6}}
[]]> but was:<...
  {<null>,5,{3,6}}
[  
]]>
  MultiLineToStringStyleTest.testPerson:92 expected:<...ge=25
  smoker=true
[]]> but was:<...ge=25
  smoker=true
[  
]]>
  MultilineRecursiveToStringStyleTest.boolArray:113 expected:<...  stringArray=<null>[]
]> but was:<...  stringArray=<null>[,
  ]
]>
  MultilineRecursiveToStringStyleTest.charArray:131 expected:<...  stringArray=<null>[]
]> but was:<...  stringArray=<null>[,
  ]
]>
  MultilineRecursiveToStringStyleTest.doubleArray:167 expected:<...  stringArray=<null>[]
]> but was:<...  stringArray=<null>[,
  ]
]>
  MultilineRecursiveToStringStyleTest.intArray:149 expected:<...  stringArray=<null>[]
]> but was:<...  stringArray=<null>[,
  ]
]>
  MultilineRecursiveToStringStyleTest.longArray:185 expected:<...  stringArray=<null>[]
]> but was:<...  stringArray=<null>[,
  ]
]>
  MultilineRecursiveToStringStyleTest.nestedAndArray:80 expected:<...     date=2014.10.14[
    ],
    org.apache.commons.lang3.builder.MultilineRecursiveToStringStyleTest$Transaction@264b72a2[
      amount=50.0,
      date=2014.10.15
    ]
  }]
]> but was:<...     date=2014.10.14[,
      
    ],
    org.apache.commons.lang3.builder.MultilineRecursiveToStringStyleTest$Transaction@264b72a2[
      amount=50.0,
      date=2014.10.15,
      
    ]
  },
  ]
]>
  MultilineRecursiveToStringStyleTest.nestedElements:57 expected:<...e[
    name=ASF Bank[
  ],
  accounts=<null>]
]> but was:<...e[
    name=ASF Bank[,
    
  ],
  accounts=<null>,
  ]
]>
  MultilineRecursiveToStringStyleTest.noArray:94 expected:<...  stringArray=<null>[]
]> but was:<...  stringArray=<null>[,
  ]
]>
  MultilineRecursiveToStringStyleTest.simpleObject:42 expected:<...0,
  date=2014.10.15[]
]> but was:<...0,
  date=2014.10.15[,
  ]
]>
  MultilineRecursiveToStringStyleTest.stringArray:203 expected:<...y={
    a,
    A
  }[]
]> but was:<...y={
    a,
    A
  }[,
  ]
]>
  NoClassNameToStringStyleTest.testAppendSuper:57 expected:<[[]]> but was:<[]]>
  NoClassNameToStringStyleTest.testBlank:52 expected:<[[]]> but was:<[]]>
  NoClassNameToStringStyleTest.testLong:94 expected:<[3[]]> but was:<[3[,]]>
  NoClassNameToStringStyleTest.testLongArray:112 expected:<[{1,2,-3,4}[]]> but was:<[{1,2,-3,4}[,]]>
  NoClassNameToStringStyleTest.testLongArrayArray:122 expected:<[{{1,2},<null>,{5}}[]]> but was:<[{{1,2},<null>,{5}}[,]]>
  NoClassNameToStringStyleTest.testObject:69 expected:<[<null>[]]> but was:<[<null>[,]]>
  NoClassNameToStringStyleTest.testObjectArray:102 expected:<[{<null>,5,{3,6}}[]]> but was:<[{<null>,5,{3,6}}[,]]>
  NoClassNameToStringStyleTest.testPerson:89 expected:<...c,age=45,smoker=true[]]> but was:<...c,age=45,smoker=true[,]]>
  NoFieldNamesToStringStyleTest.testAppendSuper:58 expected:<...lang.Integer@dda4f7b[[]]> but was:<...lang.Integer@dda4f7b[]]>
  NoFieldNamesToStringStyleTest.testBlank:53 expected:<...lang.Integer@dda4f7b[[]]> but was:<...lang.Integer@dda4f7b[]]>
  NoFieldNamesToStringStyleTest.testLong:96 expected:<...ng.Integer@dda4f7b[3[]]> but was:<...ng.Integer@dda4f7b[3[,]]>
  NoFieldNamesToStringStyleTest.testLongArray:114 expected:<...r@dda4f7b[{1,2,-3,4}[]]> but was:<...r@dda4f7b[{1,2,-3,4}[,]]>
  NoFieldNamesToStringStyleTest.testLongArrayArray:124 expected:<...b[{{1,2},<null>,{5}}[]]> but was:<...b[{{1,2},<null>,{5}}[,]]>
  NoFieldNamesToStringStyleTest.testObject:70 expected:<...teger@dda4f7b[<null>[]]> but was:<...teger@dda4f7b[<null>[,]]>
  NoFieldNamesToStringStyleTest.testObjectArray:104 expected:<...f7b[{<null>,5,{3,6}}[]]> but was:<...f7b[{<null>,5,{3,6}}[,]]>
  NoFieldNamesToStringStyleTest.testPerson:91 expected:<...ae[Ron Paul,72,false[]]> but was:<...ae[Ron Paul,72,false[,]]>
  RecursiveToStringStyleTest.testAppendSuper:57 expected:<...lang.Integer@dda4f7b[[]]> but was:<...lang.Integer@dda4f7b[]]>
  RecursiveToStringStyleTest.testBlank:52 expected:<...lang.Integer@dda4f7b[[]]> but was:<...lang.Integer@dda4f7b[]]>
  RecursiveToStringStyleTest.testLong:99 expected:<...ng.Integer@dda4f7b[3[]]> but was:<...ng.Integer@dda4f7b[3[,]]>
  RecursiveToStringStyleTest.testLongArray:117 expected:<...r@dda4f7b[{1,2,-3,4}[]]> but was:<...r@dda4f7b[{1,2,-3,4}[,]]>
  RecursiveToStringStyleTest.testLongArrayArray:127 expected:<...b[{{1,2},<null>,{5}}[]]> but was:<...b[{{1,2},<null>,{5}}[,]]>
  RecursiveToStringStyleTest.testObject:69 expected:<...teger@dda4f7b[<null>[]]> but was:<...teger@dda4f7b[<null>[,]]>
  RecursiveToStringStyleTest.testObjectArray:107 expected:<...f7b[{<null>,5,{3,6}}[]]> but was:<...f7b[{<null>,5,{3,6}}[,]]>
  RecursiveToStringStyleTest.testPerson:93 expected:<...d0f282[title=Manager[]]]> but was:<...d0f282[title=Manager[,],]]>
  ShortPrefixToStringStyleTest.testAppendSuper:58 expected:<Integer[[]]> but was:<Integer[]]>
  ShortPrefixToStringStyleTest.testBlank:53 expected:<Integer[[]]> but was:<Integer[]]>
  ShortPrefixToStringStyleTest.testLong:96 expected:<Integer[3[]]> but was:<Integer[3[,]]>
  ShortPrefixToStringStyleTest.testLongArray:114 expected:<Integer[{1,2,-3,4}[]]> but was:<Integer[{1,2,-3,4}[,]]>
  ShortPrefixToStringStyleTest.testLongArrayArray:124 expected:<...r[{{1,2},<null>,{5}}[]]> but was:<...r[{{1,2},<null>,{5}}[,]]>
  ShortPrefixToStringStyleTest.testObject:70 expected:<Integer[<null>[]]> but was:<Integer[<null>[,]]>
  ShortPrefixToStringStyleTest.testObjectArray:104 expected:<...ger[{<null>,5,{3,6}}[]]> but was:<...ger[{<null>,5,{3,6}}[,]]>
  ShortPrefixToStringStyleTest.testPerson:91 expected:<...c,age=45,smoker=true[]]> but was:<...c,age=45,smoker=true[,]]>
  SimpleToStringStyleTest.testAppendSuper:58 expected:<<null>[]> but was:<<null>[,]>
  SimpleToStringStyleTest.testLong:94 expected:<3[]> but was:<3[,]>
  SimpleToStringStyleTest.testLongArray:112 expected:<{1,2,-3,4}[]> but was:<{1,2,-3,4}[,]>
  SimpleToStringStyleTest.testLongArrayArray:122 expected:<{{1,2},<null>,{5}}[]> but was:<{{1,2},<null>,{5}}[,]>
  SimpleToStringStyleTest.testObject:69 expected:<<null>[]> but was:<<null>[,]>
  SimpleToStringStyleTest.testObjectArray:102 expected:<{<null>,5,{3,6}}[]> but was:<{<null>,5,{3,6}}[,]>
  SimpleToStringStyleTest.testPerson:89 expected:<...e Q. Public,47,false[]> but was:<...e Q. Public,47,false[,]>
  StandardToStringStyleTest.testAppendSuper:73 expected:<Integer[[]]> but was:<Integer[]]>
  StandardToStringStyleTest.testBlank:68 expected:<Integer[[]]> but was:<Integer[]]>
  StandardToStringStyleTest.testLong:111 expected:<Integer[3[]]> but was:<Integer[3[,]]>
  StandardToStringStyleTest.testLongArray:129 expected:<...nteger[[1, 2, -3, 4][]]> but was:<...nteger[[1, 2, -3, 4][,]]>
  StandardToStringStyleTest.testLongArrayArray:139 expected:<...[1, 2], %NULL%, [5]][]]> but was:<...[1, 2], %NULL%, [5]][,]]>
  StandardToStringStyleTest.testObject:85 expected:<Integer[%NULL%[]]> but was:<Integer[%NULL%[,]]>
  StandardToStringStyleTest.testObjectArray:119 expected:<...[[%NULL%, 5, [3, 6]][]]> but was:<...[[%NULL%, 5, [3, 6]][,]]>
  StandardToStringStyleTest.testPerson:106 expected:<...,age=19,smoker=false[]]> but was:<...,age=19,smoker=false[,]]>
  ToStringBuilderTest.testAppendSuper:601 expected:<...lang.Integer@dda4f7b[[]]> but was:<...lang.Integer@dda4f7b[]]>
  ToStringBuilderTest.testAppendToString:611 expected:<...lang.Integer@dda4f7b[[]]> but was:<...lang.Integer@dda4f7b[]]>
  ToStringBuilderTest.testBlank:89 expected:<...lang.Integer@dda4f7b[[]]> but was:<...lang.Integer@dda4f7b[]]>
  ToStringBuilderTest.testBoolean:708 expected:<...Integer@dda4f7b[true[]]> but was:<...Integer@dda4f7b[true[,]]>
  ToStringBuilderTest.testBooleanArray:797 expected:<...b[{true,false,false}[]]> but was:<...b[{true,false,false}[,]]>
  ToStringBuilderTest.testBooleanArrayArray:877 expected:<...lse},<null>,{false}}[]]> but was:<...lse},<null>,{false}}[,]]>
  ToStringBuilderTest.testByte:686 expected:<...ng.Integer@dda4f7b[3[]]> but was:<...ng.Integer@dda4f7b[3[,]]>
  ToStringBuilderTest.testByteArray:757 expected:<...r@dda4f7b[{1,2,-3,4}[]]> but was:<...r@dda4f7b[{1,2,-3,4}[,]]>
  ToStringBuilderTest.testByteArrayArray:837 expected:<...b[{{1,2},<null>,{5}}[]]> but was:<...b[{{1,2},<null>,{5}}[,]]>
  ToStringBuilderTest.testChar:679 expected:<...ng.Integer@dda4f7b[A[]]> but was:<...ng.Integer@dda4f7b[A[,]]>
  ToStringBuilderTest.testCharArray:767 expected:<...er@dda4f7b[{A,2,_,D}[]]> but was:<...er@dda4f7b[{A,2,_,D}[,]]>
  ToStringBuilderTest.testCharArrayArray:847 expected:<...b[{{A,B},<null>,{p}}[]]> but was:<...b[{{A,B},<null>,{p}}[,]]>
  ToStringBuilderTest.testDouble:694 expected:<....Integer@dda4f7b[3.2[]]> but was:<....Integer@dda4f7b[3.2[,]]>
  ToStringBuilderTest.testDoubleArray:777 expected:<...2.9876,-3.00001,4.3}[]]> but was:<...2.9876,-3.00001,4.3}[,]]>
  ToStringBuilderTest.testDoubleArrayArray:857 expected:<...29686},<null>,{NaN}}[]]> but was:<...29686},<null>,{NaN}}[,]]>
  ToStringBuilderTest.testFloat:701 expected:<....Integer@dda4f7b[3.2[]]> but was:<....Integer@dda4f7b[3.2[,]]>
  ToStringBuilderTest.testFloatArray:787 expected:<...2.9876,-3.00001,4.3}[]]> but was:<...2.9876,-3.00001,4.3}[,]]>
  ToStringBuilderTest.testFloatArrayArray:867 expected:<...29686},<null>,{NaN}}[]]> but was:<...29686},<null>,{NaN}}[,]]>
  ToStringBuilderTest.testInheritedReflectionStatics:947 expected:<...ng2,staticInt2=67890[]]> but was:<...ng2,staticInt2=67890[,]]>
  ToStringBuilderTest.testInnerClassReflection:376 expected:<...Outer$Inner@6c02d7ea[[]]]> but was:<...Outer$Inner@6c02d7ea[],]]>
  ToStringBuilderTest.testInt:665 expected:<...ng.Integer@dda4f7b[3[]]> but was:<...ng.Integer@dda4f7b[3[,]]>
  ToStringBuilderTest.testIntArray:737 expected:<...r@dda4f7b[{1,2,-3,4}[]]> but was:<...r@dda4f7b[{1,2,-3,4}[,]]>
  ToStringBuilderTest.testIntArrayArray:817 expected:<...b[{{1,2},<null>,{5}}[]]> but was:<...b[{{1,2},<null>,{5}}[,]]>
  ToStringBuilderTest.testLong:657 expected:<...ng.Integer@dda4f7b[3[]]> but was:<...ng.Integer@dda4f7b[3[,]]>
  ToStringBuilderTest.testLongArray:727 expected:<...r@dda4f7b[{1,2,-3,4}[]]> but was:<...r@dda4f7b[{1,2,-3,4}[,]]>
  ToStringBuilderTest.testLongArrayArray:807 expected:<...b[{{1,2},<null>,{5}}[]]> but was:<...b[{{1,2},<null>,{5}}[,]]>
  ToStringBuilderTest.testObject:623 expected:<...teger@dda4f7b[<null>[]]> but was:<...teger@dda4f7b[<null>[,]]>
  ToStringBuilderTest.testObjectArray:717 expected:<...f7b[{<null>,5,{3,6}}[]]> but was:<...f7b[{<null>,5,{3,6}}[,]]>
  ToStringBuilderTest.testObjectBuild:641 expected:<...teger@dda4f7b[<null>[]]> but was:<...teger@dda4f7b[<null>[,]]>
  ToStringBuilderTest.testObjectCycle:892 expected:<...$ObjectCycle@9343bd5[]]]> but was:<...$ObjectCycle@9343bd5[,],]]>
  ToStringBuilderTest.testReflectionArrayAndObjectCycle:576 expected:<...ang.Object;@1f181935[]}]]> but was:<...ang.Object;@1f181935[,]]]>
  ToStringBuilderTest.testReflectionArrayArrayCycle:432 expected:<...ng.Object;@3828ef8f}[}]]> but was:<...ng.Object;@3828ef8f}[]]>
  ToStringBuilderTest.testReflectionArrayCycle:402 expected:<...ang.Object;@5d5ef3e7[}]]> but was:<...ang.Object;@5d5ef3e7[]]>
  ToStringBuilderTest.testReflectionArrayCycleLevel2:416 expected:<...ng.Object;@11a74355}[}]]> but was:<...ng.Object;@11a74355}[]]>
  ToStringBuilderTest.testReflectionBoolean:116 expected:<...n@f684bc0[value=true[]]> but was:<...n@f684bc0[value=true[,]]>
  ToStringBuilderTest.testReflectionBooleanArray:232 expected:<...d4[{true,false,false[}]]> but was:<...d4[{true,false,false[]]>
  ToStringBuilderTest.testReflectionBooleanArrayArray:307 expected:<...alse},<null>,{false}[}]]> but was:<...alse},<null>,{false}[]]>
  ToStringBuilderTest.testReflectionByteArrayArray:280 expected:<...b2[{{1,2},<null>,{5}[}]]> but was:<...b2[{{1,2},<null>,{5}[]]>
  ToStringBuilderTest.testReflectionCharArray:205 expected:<[C@670b13df[{A,2,_,D[}]]> but was:<[C@670b13df[{A,2,_,D[]]>
  ToStringBuilderTest.testReflectionCharArrayArray:289 expected:<...a7[{{A,B},<null>,{p}[}]]> but was:<...a7[{{A,B},<null>,{p}[]]>
  ToStringBuilderTest.testReflectionCharacter:106 expected:<...ter@615d5d35[value=A[]]> but was:<...ter@615d5d35[value=A[,]]>
  ToStringBuilderTest.testReflectionDoubleArray:214 expected:<...,2.9876,-3.00001,4.3[}]]> but was:<...,2.9876,-3.00001,4.3[]]>
  ToStringBuilderTest.testReflectionDoubleArrayArray:298 expected:<....29686},<null>,{NaN}[}]]> but was:<....29686},<null>,{NaN}[]]>
  ToStringBuilderTest.testReflectionFloatArray:223 expected:<...,2.9876,-3.00001,4.3[}]]> but was:<...,2.9876,-3.00001,4.3[]]>
  ToStringBuilderTest.testReflectionFloatArrayArray:243 expected:<....29686},<null>,{NaN}[}]]> but was:<....29686},<null>,{NaN}[]]>
  ToStringBuilderTest.testReflectionHierarchy:338 expected:<...ixtureA@11b13588[a=a[]]> but was:<...ixtureA@11b13588[a=a[,]]>
  ToStringBuilderTest.testReflectionIntArray:178 expected:<...I@68bb6598[{1,2,-3,4[}]]> but was:<...I@68bb6598[{1,2,-3,4[]]>
  ToStringBuilderTest.testReflectionIntArrayArray:262 expected:<...bd[{{1,2},<null>,{5}[}]]> but was:<...bd[{{1,2},<null>,{5}[]]>
  ToStringBuilderTest.testReflectionInteger:97 expected:<...eger@dda4f7b[value=5[]]> but was:<...eger@dda4f7b[value=5[,]]>
  ToStringBuilderTest.testReflectionLongArray:169 expected:<[J@275a83d[{1,2,-3,4[}]]> but was:<[J@275a83d[{1,2,-3,4[]]>
  ToStringBuilderTest.testReflectionLongArrayArray:253 expected:<...95[{{1,2},<null>,{5}[}]]> but was:<...95[{{1,2},<null>,{5}[]]>
  ToStringBuilderTest.testReflectionObjectArray:160 expected:<...40d9[{<null>,5,{3,6}[}]]> but was:<...40d9[{<null>,5,{3,6}[]]>
  ToStringBuilderTest.testReflectionObjectCycle:562 expected:<...nTestCycleA@3b27402d[]]]> but was:<...nTestCycleA@3b27402d[,],]]>
  ToStringBuilderTest.testReflectionShortArray:187 expected:<...S@57d0258a[{1,2,-3,4[}]]> but was:<...S@57d0258a[{1,2,-3,4[]]>
  ToStringBuilderTest.testReflectionStatics:927 expected:<...ng,instanceInt=67890[]]> but was:<...ng,instanceInt=67890[,]]>
  ToStringBuilderTest.testReflectionhortArrayArray:271 expected:<...0d[{{1,2},<null>,{5}[}]]> but was:<...0d[{{1,2},<null>,{5}[]]>
  ToStringBuilderTest.testReflectionyteArray:196 expected:<...B@422cac21[{1,2,-3,4[}]]> but was:<...B@422cac21[{1,2,-3,4[]]>
  ToStringBuilderTest.testSelfInstanceTwoVarsReflectionObjectCycle:549 expected:<...rType=The Other Type[]]> but was:<...rType=The Other Type[,]]>
  ToStringBuilderTest.testSelfInstanceVarReflectionObjectCycle:539 expected:<...TestFixture@20a8a84c[]]> but was:<...TestFixture@20a8a84c[,]]>
  ToStringBuilderTest.testShort:672 expected:<...ng.Integer@dda4f7b[3[]]> but was:<...ng.Integer@dda4f7b[3[,]]>
  ToStringBuilderTest.testShortArray:747 expected:<...r@dda4f7b[{1,2,-3,4}[]]> but was:<...r@dda4f7b[{1,2,-3,4}[,]]>
  ToStringBuilderTest.testShortArrayArray:827 expected:<...b[{{1,2},<null>,{5}}[]]> but was:<...b[{{1,2},<null>,{5}}[,]]>
  ToStringBuilderTest.testSimpleReflectionObjectCycle:530 expected:<...onTestFixture@608486[]]> but was:<...onTestFixture@608486[,]]>
  ToStringBuilderTest.testSimpleReflectionStatics:907 expected:<...ring,staticInt=12345[]]> but was:<...ring,staticInt=12345[,]]>



Tests run: 3526, Failures: 144, Errors: 0, Skipped: 97

[INFO] ------------------------------------------------------------------------
[INFO] BUILD FAILURE
[INFO] ------------------------------------------------------------------------
[INFO] Total time: 34.273s
[INFO] Finished at: Tue Aug 04 09:05:35 BST 2015
[INFO] Final Memory: 23M/411M
[INFO] ------------------------------------------------------------------------
[ERROR] Failed to execute goal org.apache.maven.plugins:maven-surefire-plugin:2.18:test (default-test) on project commons-lang3: There are test failures.
[ERROR] 
[ERROR] Please refer to /home/perham/Study/LittleDarwin/Cases/commons-lang3-3.4-src/target/surefire-reports for the individual test results.
[ERROR] -> [Help 1]
[ERROR] 
[ERROR] To see the full stack trace of the errors, re-run Maven with the -e switch.
[ERROR] Re-run Maven using the -X switch to enable full debug logging.
[ERROR] 
[ERROR] For more information about the errors and possible solutions, please read the following articles:
[ERROR] [Help 1] http://cwiki.apache.org/confluence/display/MAVEN/MojoFailureException
