[INFO] Scanning for projects...
[INFO]                                                                         
[INFO] ------------------------------------------------------------------------
[INFO] Building Apache Commons Lang 3.4
[INFO] ------------------------------------------------------------------------
[INFO] 
[INFO] --- maven-enforcer-plugin:1.3.1:enforce (enforce-maven-3) @ commons-lang3 ---
[INFO] 
[INFO] --- build-helper-maven-plugin:1.8:parse-version (parse-version) @ commons-lang3 ---
[INFO] 
[INFO] --- maven-antrun-plugin:1.8:run (javadoc.resources) @ commons-lang3 ---
[INFO] Executing tasks

main:
[INFO] Executed tasks
[INFO] 
[INFO] --- maven-remote-resources-plugin:1.5:process (default) @ commons-lang3 ---
[INFO] 
[INFO] --- buildnumber-maven-plugin:1.3:create (default) @ commons-lang3 ---
[INFO] Executing: /bin/sh -c cd /home/perham/Study/LittleDarwin/Cases/commons-lang3-3.4-src && svn --non-interactive info
[INFO] Working directory: /home/perham/Study/LittleDarwin/Cases/commons-lang3-3.4-src
[INFO] Storing buildNumber: ?????? at timestamp: 1438675471520
[INFO] Executing: /bin/sh -c cd /home/perham/Study/LittleDarwin/Cases/commons-lang3-3.4-src && svn --non-interactive info
[INFO] Working directory: /home/perham/Study/LittleDarwin/Cases/commons-lang3-3.4-src
[INFO] Storing buildScmBranch: UNKNOWN_BRANCH
[INFO] 
[INFO] --- maven-resources-plugin:2.7:resources (default-resources) @ commons-lang3 ---
[INFO] Using 'ISO-8859-1' encoding to copy filtered resources.
[INFO] Copying 0 resource
[INFO] Copying 2 resources to META-INF
[INFO] 
[INFO] --- maven-compiler-plugin:3.2:compile (default-compile) @ commons-lang3 ---
[INFO] Changes detected - recompiling the module!
[INFO] Compiling 133 source files to /home/perham/Study/LittleDarwin/Cases/commons-lang3-3.4-src/target/classes
[INFO] /home/perham/Study/LittleDarwin/Cases/commons-lang3-3.4-src/src/main/java/org/apache/commons/lang3/SerializationUtils.java: /home/perham/Study/LittleDarwin/Cases/commons-lang3-3.4-src/src/main/java/org/apache/commons/lang3/SerializationUtils.java uses unchecked or unsafe operations.
[INFO] /home/perham/Study/LittleDarwin/Cases/commons-lang3-3.4-src/src/main/java/org/apache/commons/lang3/SerializationUtils.java: Recompile with -Xlint:unchecked for details.
[INFO] 
[INFO] --- maven-bundle-plugin:2.5.3:manifest (bundle-manifest) @ commons-lang3 ---
[INFO] 
[INFO] --- animal-sniffer-maven-plugin:1.13:check (checkAPIcompatibility) @ commons-lang3 ---
[INFO] Checking unresolved references to org.codehaus.mojo.signature:java16:1.0
[INFO] 
[INFO] --- maven-resources-plugin:2.7:testResources (default-testResources) @ commons-lang3 ---
[INFO] Using 'ISO-8859-1' encoding to copy filtered resources.
[INFO] Copying 2 resources
[INFO] Copying 2 resources to META-INF
[INFO] 
[INFO] --- maven-compiler-plugin:3.2:testCompile (default-testCompile) @ commons-lang3 ---
[INFO] Nothing to compile - all classes are up to date
[INFO] 
[INFO] --- maven-surefire-plugin:2.18:test (default-test) @ commons-lang3 ---
[INFO] Surefire report directory: /home/perham/Study/LittleDarwin/Cases/commons-lang3-3.4-src/target/surefire-reports

-------------------------------------------------------
 T E S T S
-------------------------------------------------------
Running org.apache.commons.lang3.ValidateTest
Tests run: 63, Failures: 0, Errors: 0, Skipped: 0, Time elapsed: 0.042 sec - in org.apache.commons.lang3.ValidateTest
Running org.apache.commons.lang3.LocaleUtilsTest
Tests run: 15, Failures: 0, Errors: 0, Skipped: 0, Time elapsed: 0.018 sec - in org.apache.commons.lang3.LocaleUtilsTest
Running org.apache.commons.lang3.tuple.MutableTripleTest
Tests run: 8, Failures: 0, Errors: 0, Skipped: 0, Time elapsed: 0.01 sec - in org.apache.commons.lang3.tuple.MutableTripleTest
Running org.apache.commons.lang3.tuple.TripleTest
Tests run: 10, Failures: 0, Errors: 0, Skipped: 0, Time elapsed: 0.007 sec - in org.apache.commons.lang3.tuple.TripleTest
Running org.apache.commons.lang3.tuple.ImmutablePairTest
Tests run: 6, Failures: 0, Errors: 0, Skipped: 0, Time elapsed: 0 sec - in org.apache.commons.lang3.tuple.ImmutablePairTest
Running org.apache.commons.lang3.tuple.MutablePairTest
Tests run: 8, Failures: 0, Errors: 0, Skipped: 0, Time elapsed: 0.001 sec - in org.apache.commons.lang3.tuple.MutablePairTest
Running org.apache.commons.lang3.tuple.ImmutableTripleTest
Tests run: 6, Failures: 0, Errors: 0, Skipped: 0, Time elapsed: 0 sec - in org.apache.commons.lang3.tuple.ImmutableTripleTest
Running org.apache.commons.lang3.tuple.PairTest
Tests run: 9, Failures: 0, Errors: 0, Skipped: 0, Time elapsed: 0.001 sec - in org.apache.commons.lang3.tuple.PairTest
Running org.apache.commons.lang3.StringUtilsIsTest
Tests run: 8, Failures: 0, Errors: 0, Skipped: 0, Time elapsed: 0.007 sec - in org.apache.commons.lang3.StringUtilsIsTest
Running org.apache.commons.lang3.JavaVersionTest
Tests run: 3, Failures: 0, Errors: 0, Skipped: 0, Time elapsed: 0.001 sec - in org.apache.commons.lang3.JavaVersionTest
Running org.apache.commons.lang3.builder.NoFieldNamesToStringStyleTest
Tests run: 8, Failures: 5, Errors: 1, Skipped: 0, Time elapsed: 0.01 sec <<< FAILURE! - in org.apache.commons.lang3.builder.NoFieldNamesToStringStyleTest
testObjectArray(org.apache.commons.lang3.builder.NoFieldNamesToStringStyleTest)  Time elapsed: 0.001 sec  <<< FAILURE!
org.junit.ComparisonFailure: expected:<...ng.Integer@66d89fb1[[{<null>,5,{3,6}}]]> but was:<...ng.Integer@66d89fb1[[<null>]]>
	at org.junit.Assert.assertEquals(Assert.java:115)
	at org.junit.Assert.assertEquals(Assert.java:144)
	at org.apache.commons.lang3.builder.NoFieldNamesToStringStyleTest.testObjectArray(NoFieldNamesToStringStyleTest.java:105)

testLongArrayArray(org.apache.commons.lang3.builder.NoFieldNamesToStringStyleTest)  Time elapsed: 0 sec  <<< FAILURE!
org.junit.ComparisonFailure: expected:<...ng.Integer@66d89fb1[[{{1,2},<null>,{5}}]]> but was:<...ng.Integer@66d89fb1[[<null>]]>
	at org.junit.Assert.assertEquals(Assert.java:115)
	at org.junit.Assert.assertEquals(Assert.java:144)
	at org.apache.commons.lang3.builder.NoFieldNamesToStringStyleTest.testLongArrayArray(NoFieldNamesToStringStyleTest.java:125)

testLongArray(org.apache.commons.lang3.builder.NoFieldNamesToStringStyleTest)  Time elapsed: 0.001 sec  <<< FAILURE!
org.junit.ComparisonFailure: expected:<...ng.Integer@66d89fb1[[{1,2,-3,4}]]> but was:<...ng.Integer@66d89fb1[[<null>]]>
	at org.junit.Assert.assertEquals(Assert.java:115)
	at org.junit.Assert.assertEquals(Assert.java:144)
	at org.apache.commons.lang3.builder.NoFieldNamesToStringStyleTest.testLongArray(NoFieldNamesToStringStyleTest.java:115)

testObject(org.apache.commons.lang3.builder.NoFieldNamesToStringStyleTest)  Time elapsed: 0.006 sec  <<< ERROR!
java.lang.NullPointerException: null
	at org.apache.commons.lang3.builder.ToStringStyle.appendInternal(ToStringStyle.java:105)
	at org.apache.commons.lang3.builder.ToStringStyle.append(ToStringStyle.java:80)
	at org.apache.commons.lang3.builder.ToStringBuilder.append(ToStringBuilder.java:472)
	at org.apache.commons.lang3.builder.NoFieldNamesToStringStyleTest.testObject(NoFieldNamesToStringStyleTest.java:70)

testPerson(org.apache.commons.lang3.builder.NoFieldNamesToStringStyleTest)  Time elapsed: 0 sec  <<< FAILURE!
org.junit.ComparisonFailure: expected:<...est$Person@2f6d549e[[Ron Paul],72,false]> but was:<...est$Person@2f6d549e[[<null>],72,false]>
	at org.junit.Assert.assertEquals(Assert.java:115)
	at org.junit.Assert.assertEquals(Assert.java:144)
	at org.apache.commons.lang3.builder.NoFieldNamesToStringStyleTest.testPerson(NoFieldNamesToStringStyleTest.java:91)

testAppendSuper(org.apache.commons.lang3.builder.NoFieldNamesToStringStyleTest)  Time elapsed: 0 sec  <<< FAILURE!
org.junit.ComparisonFailure: expected:<...ng.Integer@66d89fb1[[hello]]> but was:<...ng.Integer@66d89fb1[[<null>]]>
	at org.junit.Assert.assertEquals(Assert.java:115)
	at org.junit.Assert.assertEquals(Assert.java:144)
	at org.apache.commons.lang3.builder.NoFieldNamesToStringStyleTest.testAppendSuper(NoFieldNamesToStringStyleTest.java:61)

Running org.apache.commons.lang3.builder.ShortPrefixToStringStyleTest
Tests run: 8, Failures: 5, Errors: 1, Skipped: 0, Time elapsed: 0.004 sec <<< FAILURE! - in org.apache.commons.lang3.builder.ShortPrefixToStringStyleTest
testObjectArray(org.apache.commons.lang3.builder.ShortPrefixToStringStyleTest)  Time elapsed: 0 sec  <<< FAILURE!
org.junit.ComparisonFailure: expected:<Integer[[{<null>,5,{3,6}}]]> but was:<Integer[[<null>]]>
	at org.junit.Assert.assertEquals(Assert.java:115)
	at org.junit.Assert.assertEquals(Assert.java:144)
	at org.apache.commons.lang3.builder.ShortPrefixToStringStyleTest.testObjectArray(ShortPrefixToStringStyleTest.java:105)

testLongArrayArray(org.apache.commons.lang3.builder.ShortPrefixToStringStyleTest)  Time elapsed: 0.001 sec  <<< FAILURE!
org.junit.ComparisonFailure: expected:<Integer[[{{1,2},<null>,{5}}]]> but was:<Integer[[<null>]]>
	at org.junit.Assert.assertEquals(Assert.java:115)
	at org.junit.Assert.assertEquals(Assert.java:144)
	at org.apache.commons.lang3.builder.ShortPrefixToStringStyleTest.testLongArrayArray(ShortPrefixToStringStyleTest.java:125)

testLongArray(org.apache.commons.lang3.builder.ShortPrefixToStringStyleTest)  Time elapsed: 0 sec  <<< FAILURE!
org.junit.ComparisonFailure: expected:<Integer[[{1,2,-3,4}]]> but was:<Integer[[<null>]]>
	at org.junit.Assert.assertEquals(Assert.java:115)
	at org.junit.Assert.assertEquals(Assert.java:144)
	at org.apache.commons.lang3.builder.ShortPrefixToStringStyleTest.testLongArray(ShortPrefixToStringStyleTest.java:115)

testObject(org.apache.commons.lang3.builder.ShortPrefixToStringStyleTest)  Time elapsed: 0.001 sec  <<< ERROR!
java.lang.NullPointerException: null
	at org.apache.commons.lang3.builder.ToStringStyle.appendInternal(ToStringStyle.java:105)
	at org.apache.commons.lang3.builder.ToStringStyle.append(ToStringStyle.java:80)
	at org.apache.commons.lang3.builder.ToStringBuilder.append(ToStringBuilder.java:472)
	at org.apache.commons.lang3.builder.ShortPrefixToStringStyleTest.testObject(ShortPrefixToStringStyleTest.java:70)

testPerson(org.apache.commons.lang3.builder.ShortPrefixToStringStyleTest)  Time elapsed: 0 sec  <<< FAILURE!
org.junit.ComparisonFailure: expected:<...yleTest.Person[name=[John Q. Public],age=45,smoker=true]> but was:<...yleTest.Person[name=[<null>],age=45,smoker=true]>
	at org.junit.Assert.assertEquals(Assert.java:115)
	at org.junit.Assert.assertEquals(Assert.java:144)
	at org.apache.commons.lang3.builder.ShortPrefixToStringStyleTest.testPerson(ShortPrefixToStringStyleTest.java:91)

testAppendSuper(org.apache.commons.lang3.builder.ShortPrefixToStringStyleTest)  Time elapsed: 0.001 sec  <<< FAILURE!
org.junit.ComparisonFailure: expected:<Integer[a=[hello]]> but was:<Integer[a=[<null>]]>
	at org.junit.Assert.assertEquals(Assert.java:115)
	at org.junit.Assert.assertEquals(Assert.java:144)
	at org.apache.commons.lang3.builder.ShortPrefixToStringStyleTest.testAppendSuper(ShortPrefixToStringStyleTest.java:61)

Running org.apache.commons.lang3.builder.DiffResultTest
Tests run: 9, Failures: 2, Errors: 0, Skipped: 0, Time elapsed: 0.008 sec <<< FAILURE! - in org.apache.commons.lang3.builder.DiffResultTest
testToStringOutput(org.apache.commons.lang3.builder.DiffResultTest)  Time elapsed: 0.005 sec  <<< FAILURE!
org.junit.ComparisonFailure: expected:<...est.EmptyClass[test=[false] differs from DiffResultTest.EmptyClass[test=true]]> but was:<...est.EmptyClass[test=[<null>] differs from DiffResultTest.EmptyClass[test=<null>]]>
	at org.junit.Assert.assertEquals(Assert.java:115)
	at org.junit.Assert.assertEquals(Assert.java:144)
	at org.apache.commons.lang3.builder.DiffResultTest.testToStringOutput(DiffResultTest.java:95)

testToStringSpecifyStyleOutput(org.apache.commons.lang3.builder.DiffResultTest)  Time elapsed: 0.001 sec  <<< FAILURE!
org.junit.ComparisonFailure: expected:<...13f[
  booleanField=[false
] differs from org.apache.commons.lang3.builder.DiffResultTest$SimpleClass@174ed6a7[
  booleanField=true]
]> but was:<...13f[
  booleanField=[<null>
] differs from org.apache.commons.lang3.builder.DiffResultTest$SimpleClass@174ed6a7[
  booleanField=<null>]
]>
	at org.junit.Assert.assertEquals(Assert.java:115)
	at org.junit.Assert.assertEquals(Assert.java:144)
	at org.apache.commons.lang3.builder.DiffResultTest.testToStringSpecifyStyleOutput(DiffResultTest.java:115)

Running org.apache.commons.lang3.builder.CompareToBuilderTest
Tests run: 48, Failures: 0, Errors: 0, Skipped: 0, Time elapsed: 0.019 sec - in org.apache.commons.lang3.builder.CompareToBuilderTest
Running org.apache.commons.lang3.builder.MultilineRecursiveToStringStyleTest
Tests run: 10, Failures: 1, Errors: 9, Skipped: 0, Time elapsed: 0.007 sec <<< FAILURE! - in org.apache.commons.lang3.builder.MultilineRecursiveToStringStyleTest
doubleArray(org.apache.commons.lang3.builder.MultilineRecursiveToStringStyleTest)  Time elapsed: 0 sec  <<< ERROR!
java.lang.NullPointerException: null
	at org.apache.commons.lang3.builder.ToStringStyle.appendInternal(ToStringStyle.java:105)
	at org.apache.commons.lang3.builder.ToStringStyle.append(ToStringStyle.java:80)
	at org.apache.commons.lang3.builder.ToStringBuilder.append(ToStringBuilder.java:848)
	at org.apache.commons.lang3.builder.ReflectionToStringBuilder.appendFieldsIn(ReflectionToStringBuilder.java:527)
	at org.apache.commons.lang3.builder.ReflectionToStringBuilder.toString(ReflectionToStringBuilder.java:688)
	at org.apache.commons.lang3.builder.MultilineRecursiveToStringStyleTest.toString(MultilineRecursiveToStringStyleTest.java:211)
	at org.apache.commons.lang3.builder.MultilineRecursiveToStringStyleTest.doubleArray(MultilineRecursiveToStringStyleTest.java:167)

stringArray(org.apache.commons.lang3.builder.MultilineRecursiveToStringStyleTest)  Time elapsed: 0 sec  <<< ERROR!
java.lang.NullPointerException: null
	at org.apache.commons.lang3.builder.ToStringStyle.appendInternal(ToStringStyle.java:105)
	at org.apache.commons.lang3.builder.ToStringStyle.append(ToStringStyle.java:80)
	at org.apache.commons.lang3.builder.ToStringBuilder.append(ToStringBuilder.java:848)
	at org.apache.commons.lang3.builder.ReflectionToStringBuilder.appendFieldsIn(ReflectionToStringBuilder.java:527)
	at org.apache.commons.lang3.builder.ReflectionToStringBuilder.toString(ReflectionToStringBuilder.java:688)
	at org.apache.commons.lang3.builder.MultilineRecursiveToStringStyleTest.toString(MultilineRecursiveToStringStyleTest.java:211)
	at org.apache.commons.lang3.builder.MultilineRecursiveToStringStyleTest.stringArray(MultilineRecursiveToStringStyleTest.java:203)

simpleObject(org.apache.commons.lang3.builder.MultilineRecursiveToStringStyleTest)  Time elapsed: 0.001 sec  <<< FAILURE!
org.junit.ComparisonFailure: expected:<...@112a39aa[
  amount=[100.0,
  date=2014.10.15]
]> but was:<...@112a39aa[
  amount=[<null>,
  date=<null>]
]>
	at org.junit.Assert.assertEquals(Assert.java:115)
	at org.junit.Assert.assertEquals(Assert.java:144)
	at org.apache.commons.lang3.builder.MultilineRecursiveToStringStyleTest.simpleObject(MultilineRecursiveToStringStyleTest.java:42)

longArray(org.apache.commons.lang3.builder.MultilineRecursiveToStringStyleTest)  Time elapsed: 0.001 sec  <<< ERROR!
java.lang.NullPointerException: null
	at org.apache.commons.lang3.builder.ToStringStyle.appendInternal(ToStringStyle.java:105)
	at org.apache.commons.lang3.builder.ToStringStyle.append(ToStringStyle.java:80)
	at org.apache.commons.lang3.builder.ToStringBuilder.append(ToStringBuilder.java:848)
	at org.apache.commons.lang3.builder.ReflectionToStringBuilder.appendFieldsIn(ReflectionToStringBuilder.java:527)
	at org.apache.commons.lang3.builder.ReflectionToStringBuilder.toString(ReflectionToStringBuilder.java:688)
	at org.apache.commons.lang3.builder.MultilineRecursiveToStringStyleTest.toString(MultilineRecursiveToStringStyleTest.java:211)
	at org.apache.commons.lang3.builder.MultilineRecursiveToStringStyleTest.longArray(MultilineRecursiveToStringStyleTest.java:185)

intArray(org.apache.commons.lang3.builder.MultilineRecursiveToStringStyleTest)  Time elapsed: 0 sec  <<< ERROR!
java.lang.NullPointerException: null
	at org.apache.commons.lang3.builder.ToStringStyle.appendInternal(ToStringStyle.java:105)
	at org.apache.commons.lang3.builder.ToStringStyle.append(ToStringStyle.java:80)
	at org.apache.commons.lang3.builder.ToStringBuilder.append(ToStringBuilder.java:848)
	at org.apache.commons.lang3.builder.ReflectionToStringBuilder.appendFieldsIn(ReflectionToStringBuilder.java:527)
	at org.apache.commons.lang3.builder.ReflectionToStringBuilder.toString(ReflectionToStringBuilder.java:688)
	at org.apache.commons.lang3.builder.MultilineRecursiveToStringStyleTest.toString(MultilineRecursiveToStringStyleTest.java:211)
	at org.apache.commons.lang3.builder.MultilineRecursiveToStringStyleTest.intArray(MultilineRecursiveToStringStyleTest.java:149)

nestedAndArray(org.apache.commons.lang3.builder.MultilineRecursiveToStringStyleTest)  Time elapsed: 0.001 sec  <<< ERROR!
java.lang.NullPointerException: null
	at org.apache.commons.lang3.builder.ToStringStyle.appendInternal(ToStringStyle.java:105)
	at org.apache.commons.lang3.builder.ToStringStyle.append(ToStringStyle.java:80)
	at org.apache.commons.lang3.builder.ToStringBuilder.append(ToStringBuilder.java:848)
	at org.apache.commons.lang3.builder.ReflectionToStringBuilder.appendFieldsIn(ReflectionToStringBuilder.java:527)
	at org.apache.commons.lang3.builder.ReflectionToStringBuilder.toString(ReflectionToStringBuilder.java:688)
	at org.apache.commons.lang3.builder.MultilineRecursiveToStringStyleTest.toString(MultilineRecursiveToStringStyleTest.java:211)
	at org.apache.commons.lang3.builder.MultilineRecursiveToStringStyleTest.nestedAndArray(MultilineRecursiveToStringStyleTest.java:80)

charArray(org.apache.commons.lang3.builder.MultilineRecursiveToStringStyleTest)  Time elapsed: 0 sec  <<< ERROR!
java.lang.NullPointerException: null
	at org.apache.commons.lang3.builder.ToStringStyle.appendInternal(ToStringStyle.java:105)
	at org.apache.commons.lang3.builder.ToStringStyle.append(ToStringStyle.java:80)
	at org.apache.commons.lang3.builder.ToStringBuilder.append(ToStringBuilder.java:848)
	at org.apache.commons.lang3.builder.ReflectionToStringBuilder.appendFieldsIn(ReflectionToStringBuilder.java:527)
	at org.apache.commons.lang3.builder.ReflectionToStringBuilder.toString(ReflectionToStringBuilder.java:688)
	at org.apache.commons.lang3.builder.MultilineRecursiveToStringStyleTest.toString(MultilineRecursiveToStringStyleTest.java:211)
	at org.apache.commons.lang3.builder.MultilineRecursiveToStringStyleTest.charArray(MultilineRecursiveToStringStyleTest.java:131)

nestedElements(org.apache.commons.lang3.builder.MultilineRecursiveToStringStyleTest)  Time elapsed: 0.001 sec  <<< ERROR!
java.lang.NullPointerException: null
	at org.apache.commons.lang3.builder.ToStringStyle.appendInternal(ToStringStyle.java:105)
	at org.apache.commons.lang3.builder.ToStringStyle.append(ToStringStyle.java:80)
	at org.apache.commons.lang3.builder.ToStringBuilder.append(ToStringBuilder.java:848)
	at org.apache.commons.lang3.builder.ReflectionToStringBuilder.appendFieldsIn(ReflectionToStringBuilder.java:527)
	at org.apache.commons.lang3.builder.ReflectionToStringBuilder.toString(ReflectionToStringBuilder.java:688)
	at org.apache.commons.lang3.builder.MultilineRecursiveToStringStyleTest.toString(MultilineRecursiveToStringStyleTest.java:211)
	at org.apache.commons.lang3.builder.MultilineRecursiveToStringStyleTest.nestedElements(MultilineRecursiveToStringStyleTest.java:57)

boolArray(org.apache.commons.lang3.builder.MultilineRecursiveToStringStyleTest)  Time elapsed: 0 sec  <<< ERROR!
java.lang.NullPointerException: null
	at org.apache.commons.lang3.builder.ToStringStyle.appendInternal(ToStringStyle.java:105)
	at org.apache.commons.lang3.builder.ToStringStyle.append(ToStringStyle.java:80)
	at org.apache.commons.lang3.builder.ToStringBuilder.append(ToStringBuilder.java:848)
	at org.apache.commons.lang3.builder.ReflectionToStringBuilder.appendFieldsIn(ReflectionToStringBuilder.java:527)
	at org.apache.commons.lang3.builder.ReflectionToStringBuilder.toString(ReflectionToStringBuilder.java:688)
	at org.apache.commons.lang3.builder.MultilineRecursiveToStringStyleTest.toString(MultilineRecursiveToStringStyleTest.java:211)
	at org.apache.commons.lang3.builder.MultilineRecursiveToStringStyleTest.boolArray(MultilineRecursiveToStringStyleTest.java:113)

noArray(org.apache.commons.lang3.builder.MultilineRecursiveToStringStyleTest)  Time elapsed: 0 sec  <<< ERROR!
java.lang.NullPointerException: null
	at org.apache.commons.lang3.builder.ToStringStyle.appendInternal(ToStringStyle.java:105)
	at org.apache.commons.lang3.builder.ToStringStyle.append(ToStringStyle.java:80)
	at org.apache.commons.lang3.builder.ToStringBuilder.append(ToStringBuilder.java:848)
	at org.apache.commons.lang3.builder.ReflectionToStringBuilder.appendFieldsIn(ReflectionToStringBuilder.java:527)
	at org.apache.commons.lang3.builder.ReflectionToStringBuilder.toString(ReflectionToStringBuilder.java:688)
	at org.apache.commons.lang3.builder.MultilineRecursiveToStringStyleTest.toString(MultilineRecursiveToStringStyleTest.java:211)
	at org.apache.commons.lang3.builder.MultilineRecursiveToStringStyleTest.noArray(MultilineRecursiveToStringStyleTest.java:94)

Running org.apache.commons.lang3.builder.RecursiveToStringStyleTest
Tests run: 8, Failures: 5, Errors: 1, Skipped: 0, Time elapsed: 0.005 sec <<< FAILURE! - in org.apache.commons.lang3.builder.RecursiveToStringStyleTest
testObjectArray(org.apache.commons.lang3.builder.RecursiveToStringStyleTest)  Time elapsed: 0 sec  <<< FAILURE!
org.junit.ComparisonFailure: expected:<...ng.Integer@66d89fb1[[{<null>,5,{3,6}}]]> but was:<...ng.Integer@66d89fb1[[<null>]]>
	at org.junit.Assert.assertEquals(Assert.java:115)
	at org.junit.Assert.assertEquals(Assert.java:144)
	at org.apache.commons.lang3.builder.RecursiveToStringStyleTest.testObjectArray(RecursiveToStringStyleTest.java:108)

testLongArrayArray(org.apache.commons.lang3.builder.RecursiveToStringStyleTest)  Time elapsed: 0.005 sec  <<< FAILURE!
org.junit.ComparisonFailure: expected:<...ng.Integer@66d89fb1[[{{1,2},<null>,{5}}]]> but was:<...ng.Integer@66d89fb1[[<null>]]>
	at org.junit.Assert.assertEquals(Assert.java:115)
	at org.junit.Assert.assertEquals(Assert.java:144)
	at org.apache.commons.lang3.builder.RecursiveToStringStyleTest.testLongArrayArray(RecursiveToStringStyleTest.java:128)

testLongArray(org.apache.commons.lang3.builder.RecursiveToStringStyleTest)  Time elapsed: 0 sec  <<< FAILURE!
org.junit.ComparisonFailure: expected:<...ng.Integer@66d89fb1[[{1,2,-3,4}]]> but was:<...ng.Integer@66d89fb1[[<null>]]>
	at org.junit.Assert.assertEquals(Assert.java:115)
	at org.junit.Assert.assertEquals(Assert.java:144)
	at org.apache.commons.lang3.builder.RecursiveToStringStyleTest.testLongArray(RecursiveToStringStyleTest.java:118)

testObject(org.apache.commons.lang3.builder.RecursiveToStringStyleTest)  Time elapsed: 0 sec  <<< ERROR!
java.lang.NullPointerException: null
	at org.apache.commons.lang3.builder.ToStringStyle.appendInternal(ToStringStyle.java:105)
	at org.apache.commons.lang3.builder.ToStringStyle.append(ToStringStyle.java:80)
	at org.apache.commons.lang3.builder.ToStringBuilder.append(ToStringBuilder.java:472)
	at org.apache.commons.lang3.builder.RecursiveToStringStyleTest.testObject(RecursiveToStringStyleTest.java:69)

testPerson(org.apache.commons.lang3.builder.RecursiveToStringStyleTest)  Time elapsed: 0 sec  <<< FAILURE!
org.junit.ComparisonFailure: expected:<...erson@37c345e7[name=[John Doe,age=33,smoker=false,job=org.apache.commons.lang3.builder.RecursiveToStringStyleTest$Job@75225d4a[title=Manager]]]> but was:<...erson@37c345e7[name=[<null>,age=<null>,smoker=<null>,job=<null>]]>
	at org.junit.Assert.assertEquals(Assert.java:115)
	at org.junit.Assert.assertEquals(Assert.java:144)
	at org.apache.commons.lang3.builder.RecursiveToStringStyleTest.testPerson(RecursiveToStringStyleTest.java:93)

testAppendSuper(org.apache.commons.lang3.builder.RecursiveToStringStyleTest)  Time elapsed: 0 sec  <<< FAILURE!
org.junit.ComparisonFailure: expected:<....Integer@66d89fb1[a=[hello]]> but was:<....Integer@66d89fb1[a=[<null>]]>
	at org.junit.Assert.assertEquals(Assert.java:115)
	at org.junit.Assert.assertEquals(Assert.java:144)
	at org.apache.commons.lang3.builder.RecursiveToStringStyleTest.testAppendSuper(RecursiveToStringStyleTest.java:60)

Running org.apache.commons.lang3.builder.DefaultToStringStyleTest
Tests run: 8, Failures: 5, Errors: 1, Skipped: 0, Time elapsed: 0 sec <<< FAILURE! - in org.apache.commons.lang3.builder.DefaultToStringStyleTest
testObjectArray(org.apache.commons.lang3.builder.DefaultToStringStyleTest)  Time elapsed: 0 sec  <<< FAILURE!
org.junit.ComparisonFailure: expected:<...ng.Integer@66d89fb1[[{<null>,5,{3,6}}]]> but was:<...ng.Integer@66d89fb1[[<null>]]>
	at org.junit.Assert.assertEquals(Assert.java:115)
	at org.junit.Assert.assertEquals(Assert.java:144)
	at org.apache.commons.lang3.builder.DefaultToStringStyleTest.testObjectArray(DefaultToStringStyleTest.java:105)

testLongArrayArray(org.apache.commons.lang3.builder.DefaultToStringStyleTest)  Time elapsed: 0 sec  <<< FAILURE!
org.junit.ComparisonFailure: expected:<...ng.Integer@66d89fb1[[{{1,2},<null>,{5}}]]> but was:<...ng.Integer@66d89fb1[[<null>]]>
	at org.junit.Assert.assertEquals(Assert.java:115)
	at org.junit.Assert.assertEquals(Assert.java:144)
	at org.apache.commons.lang3.builder.DefaultToStringStyleTest.testLongArrayArray(DefaultToStringStyleTest.java:125)

testLongArray(org.apache.commons.lang3.builder.DefaultToStringStyleTest)  Time elapsed: 0 sec  <<< FAILURE!
org.junit.ComparisonFailure: expected:<...ng.Integer@66d89fb1[[{1,2,-3,4}]]> but was:<...ng.Integer@66d89fb1[[<null>]]>
	at org.junit.Assert.assertEquals(Assert.java:115)
	at org.junit.Assert.assertEquals(Assert.java:144)
	at org.apache.commons.lang3.builder.DefaultToStringStyleTest.testLongArray(DefaultToStringStyleTest.java:115)

testObject(org.apache.commons.lang3.builder.DefaultToStringStyleTest)  Time elapsed: 0 sec  <<< ERROR!
java.lang.NullPointerException: null
	at org.apache.commons.lang3.builder.ToStringStyle.appendInternal(ToStringStyle.java:105)
	at org.apache.commons.lang3.builder.ToStringStyle.append(ToStringStyle.java:80)
	at org.apache.commons.lang3.builder.ToStringBuilder.append(ToStringBuilder.java:472)
	at org.apache.commons.lang3.builder.DefaultToStringStyleTest.testObject(DefaultToStringStyleTest.java:70)

testPerson(org.apache.commons.lang3.builder.DefaultToStringStyleTest)  Time elapsed: 0 sec  <<< FAILURE!
org.junit.ComparisonFailure: expected:<...erson@78b274de[name=[John Doe],age=33,smoker=false...> but was:<...erson@78b274de[name=[<null>],age=33,smoker=false...>
	at org.junit.Assert.assertEquals(Assert.java:115)
	at org.junit.Assert.assertEquals(Assert.java:144)
	at org.apache.commons.lang3.builder.DefaultToStringStyleTest.testPerson(DefaultToStringStyleTest.java:91)

testAppendSuper(org.apache.commons.lang3.builder.DefaultToStringStyleTest)  Time elapsed: 0 sec  <<< FAILURE!
org.junit.ComparisonFailure: expected:<....Integer@66d89fb1[a=[hello]]> but was:<....Integer@66d89fb1[a=[<null>]]>
	at org.junit.Assert.assertEquals(Assert.java:115)
	at org.junit.Assert.assertEquals(Assert.java:144)
	at org.apache.commons.lang3.builder.DefaultToStringStyleTest.testAppendSuper(DefaultToStringStyleTest.java:61)

Running org.apache.commons.lang3.builder.ReflectionToStringBuilderExcludeTest
Tests run: 11, Failures: 11, Errors: 0, Skipped: 0, Time elapsed: 0.001 sec <<< FAILURE! - in org.apache.commons.lang3.builder.ReflectionToStringBuilderExcludeTest
test_toStringExcludeEmptyCollection(org.apache.commons.lang3.builder.ReflectionToStringBuilderExcludeTest)  Time elapsed: 0 sec  <<< FAILURE!
java.lang.AssertionError: null
	at org.junit.Assert.fail(Assert.java:86)
	at org.junit.Assert.assertTrue(Assert.java:41)
	at org.junit.Assert.assertTrue(Assert.java:52)
	at org.apache.commons.lang3.builder.ReflectionToStringBuilderExcludeTest.validateSecretFieldPresent(ReflectionToStringBuilderExcludeTest.java:134)
	at org.apache.commons.lang3.builder.ReflectionToStringBuilderExcludeTest.test_toStringExcludeEmptyCollection(ReflectionToStringBuilderExcludeTest.java:108)

test_toStringExcludeArrayWithNull(org.apache.commons.lang3.builder.ReflectionToStringBuilderExcludeTest)  Time elapsed: 0 sec  <<< FAILURE!
java.lang.AssertionError: null
	at org.junit.Assert.fail(Assert.java:86)
	at org.junit.Assert.assertTrue(Assert.java:41)
	at org.junit.Assert.assertTrue(Assert.java:52)
	at org.apache.commons.lang3.builder.ReflectionToStringBuilderExcludeTest.validateSecretFieldPresent(ReflectionToStringBuilderExcludeTest.java:134)
	at org.apache.commons.lang3.builder.ReflectionToStringBuilderExcludeTest.test_toStringExcludeArrayWithNull(ReflectionToStringBuilderExcludeTest.java:65)

test_toStringExcludeArray(org.apache.commons.lang3.builder.ReflectionToStringBuilderExcludeTest)  Time elapsed: 0 sec  <<< FAILURE!
java.lang.AssertionError: null
	at org.junit.Assert.fail(Assert.java:86)
	at org.junit.Assert.assertTrue(Assert.java:41)
	at org.junit.Assert.assertTrue(Assert.java:52)
	at org.apache.commons.lang3.builder.ReflectionToStringBuilderExcludeTest.validateNonSecretField(ReflectionToStringBuilderExcludeTest.java:125)
	at org.apache.commons.lang3.builder.ReflectionToStringBuilderExcludeTest.validateSecretFieldAbsent(ReflectionToStringBuilderExcludeTest.java:130)
	at org.apache.commons.lang3.builder.ReflectionToStringBuilderExcludeTest.test_toStringExcludeArray(ReflectionToStringBuilderExcludeTest.java:59)

test_toStringExcludeNullCollection(org.apache.commons.lang3.builder.ReflectionToStringBuilderExcludeTest)  Time elapsed: 0 sec  <<< FAILURE!
java.lang.AssertionError: null
	at org.junit.Assert.fail(Assert.java:86)
	at org.junit.Assert.assertTrue(Assert.java:41)
	at org.junit.Assert.assertTrue(Assert.java:52)
	at org.apache.commons.lang3.builder.ReflectionToStringBuilderExcludeTest.validateSecretFieldPresent(ReflectionToStringBuilderExcludeTest.java:134)
	at org.apache.commons.lang3.builder.ReflectionToStringBuilderExcludeTest.test_toStringExcludeNullCollection(ReflectionToStringBuilderExcludeTest.java:120)

test_toStringExcludeCollection(org.apache.commons.lang3.builder.ReflectionToStringBuilderExcludeTest)  Time elapsed: 0 sec  <<< FAILURE!
java.lang.AssertionError: null
	at org.junit.Assert.fail(Assert.java:86)
	at org.junit.Assert.assertTrue(Assert.java:41)
	at org.junit.Assert.assertTrue(Assert.java:52)
	at org.apache.commons.lang3.builder.ReflectionToStringBuilderExcludeTest.validateNonSecretField(ReflectionToStringBuilderExcludeTest.java:125)
	at org.apache.commons.lang3.builder.ReflectionToStringBuilderExcludeTest.validateSecretFieldAbsent(ReflectionToStringBuilderExcludeTest.java:130)
	at org.apache.commons.lang3.builder.ReflectionToStringBuilderExcludeTest.test_toStringExcludeCollection(ReflectionToStringBuilderExcludeTest.java:79)

test_toStringExcludeNullArray(org.apache.commons.lang3.builder.ReflectionToStringBuilderExcludeTest)  Time elapsed: 0 sec  <<< FAILURE!
java.lang.AssertionError: null
	at org.junit.Assert.fail(Assert.java:86)
	at org.junit.Assert.assertTrue(Assert.java:41)
	at org.junit.Assert.assertTrue(Assert.java:52)
	at org.apache.commons.lang3.builder.ReflectionToStringBuilderExcludeTest.validateSecretFieldPresent(ReflectionToStringBuilderExcludeTest.java:134)
	at org.apache.commons.lang3.builder.ReflectionToStringBuilderExcludeTest.test_toStringExcludeNullArray(ReflectionToStringBuilderExcludeTest.java:114)

test_toStringExcludeEmptyArray(org.apache.commons.lang3.builder.ReflectionToStringBuilderExcludeTest)  Time elapsed: 0 sec  <<< FAILURE!
java.lang.AssertionError: null
	at org.junit.Assert.fail(Assert.java:86)
	at org.junit.Assert.assertTrue(Assert.java:41)
	at org.junit.Assert.assertTrue(Assert.java:52)
	at org.apache.commons.lang3.builder.ReflectionToStringBuilderExcludeTest.validateSecretFieldPresent(ReflectionToStringBuilderExcludeTest.java:134)
	at org.apache.commons.lang3.builder.ReflectionToStringBuilderExcludeTest.test_toStringExcludeEmptyArray(ReflectionToStringBuilderExcludeTest.java:102)

test_toStringExclude(org.apache.commons.lang3.builder.ReflectionToStringBuilderExcludeTest)  Time elapsed: 0 sec  <<< FAILURE!
java.lang.AssertionError: null
	at org.junit.Assert.fail(Assert.java:86)
	at org.junit.Assert.assertTrue(Assert.java:41)
	at org.junit.Assert.assertTrue(Assert.java:52)
	at org.apache.commons.lang3.builder.ReflectionToStringBuilderExcludeTest.validateNonSecretField(ReflectionToStringBuilderExcludeTest.java:125)
	at org.apache.commons.lang3.builder.ReflectionToStringBuilderExcludeTest.validateSecretFieldAbsent(ReflectionToStringBuilderExcludeTest.java:130)
	at org.apache.commons.lang3.builder.ReflectionToStringBuilderExcludeTest.test_toStringExclude(ReflectionToStringBuilderExcludeTest.java:53)

test_toStringExcludeCollectionWithNulls(org.apache.commons.lang3.builder.ReflectionToStringBuilderExcludeTest)  Time elapsed: 0 sec  <<< FAILURE!
java.lang.AssertionError: null
	at org.junit.Assert.fail(Assert.java:86)
	at org.junit.Assert.assertTrue(Assert.java:41)
	at org.junit.Assert.assertTrue(Assert.java:52)
	at org.apache.commons.lang3.builder.ReflectionToStringBuilderExcludeTest.validateSecretFieldPresent(ReflectionToStringBuilderExcludeTest.java:134)
	at org.apache.commons.lang3.builder.ReflectionToStringBuilderExcludeTest.test_toStringExcludeCollectionWithNulls(ReflectionToStringBuilderExcludeTest.java:96)

test_toStringExcludeArrayWithNulls(org.apache.commons.lang3.builder.ReflectionToStringBuilderExcludeTest)  Time elapsed: 0 sec  <<< FAILURE!
java.lang.AssertionError: null
	at org.junit.Assert.fail(Assert.java:86)
	at org.junit.Assert.assertTrue(Assert.java:41)
	at org.junit.Assert.assertTrue(Assert.java:52)
	at org.apache.commons.lang3.builder.ReflectionToStringBuilderExcludeTest.validateSecretFieldPresent(ReflectionToStringBuilderExcludeTest.java:134)
	at org.apache.commons.lang3.builder.ReflectionToStringBuilderExcludeTest.test_toStringExcludeArrayWithNulls(ReflectionToStringBuilderExcludeTest.java:71)

test_toStringExcludeCollectionWithNull(org.apache.commons.lang3.builder.ReflectionToStringBuilderExcludeTest)  Time elapsed: 0 sec  <<< FAILURE!
java.lang.AssertionError: null
	at org.junit.Assert.fail(Assert.java:86)
	at org.junit.Assert.assertTrue(Assert.java:41)
	at org.junit.Assert.assertTrue(Assert.java:52)
	at org.apache.commons.lang3.builder.ReflectionToStringBuilderExcludeTest.validateSecretFieldPresent(ReflectionToStringBuilderExcludeTest.java:134)
	at org.apache.commons.lang3.builder.ReflectionToStringBuilderExcludeTest.test_toStringExcludeCollectionWithNull(ReflectionToStringBuilderExcludeTest.java:87)

Running org.apache.commons.lang3.builder.StandardToStringStyleTest
Tests run: 8, Failures: 5, Errors: 1, Skipped: 0, Time elapsed: 0.001 sec <<< FAILURE! - in org.apache.commons.lang3.builder.StandardToStringStyleTest
testObjectArray(org.apache.commons.lang3.builder.StandardToStringStyleTest)  Time elapsed: 0 sec  <<< FAILURE!
org.junit.ComparisonFailure: expected:<Integer[[[%NULL%, 5, [3, 6]]]]> but was:<Integer[[%NULL%]]>
	at org.junit.Assert.assertEquals(Assert.java:115)
	at org.junit.Assert.assertEquals(Assert.java:144)
	at org.apache.commons.lang3.builder.StandardToStringStyleTest.testObjectArray(StandardToStringStyleTest.java:120)

testLongArrayArray(org.apache.commons.lang3.builder.StandardToStringStyleTest)  Time elapsed: 0 sec  <<< FAILURE!
org.junit.ComparisonFailure: expected:<Integer[[[[1, 2], %NULL%, [5]]]]> but was:<Integer[[%NULL%]]>
	at org.junit.Assert.assertEquals(Assert.java:115)
	at org.junit.Assert.assertEquals(Assert.java:144)
	at org.apache.commons.lang3.builder.StandardToStringStyleTest.testLongArrayArray(StandardToStringStyleTest.java:140)

testLongArray(org.apache.commons.lang3.builder.StandardToStringStyleTest)  Time elapsed: 0 sec  <<< FAILURE!
org.junit.ComparisonFailure: expected:<Integer[[[1, 2, -3, 4]]]> but was:<Integer[[%NULL%]]>
	at org.junit.Assert.assertEquals(Assert.java:115)
	at org.junit.Assert.assertEquals(Assert.java:144)
	at org.apache.commons.lang3.builder.StandardToStringStyleTest.testLongArray(StandardToStringStyleTest.java:130)

testObject(org.apache.commons.lang3.builder.StandardToStringStyleTest)  Time elapsed: 0 sec  <<< ERROR!
java.lang.NullPointerException: null
	at org.apache.commons.lang3.builder.ToStringStyle.appendInternal(ToStringStyle.java:105)
	at org.apache.commons.lang3.builder.ToStringStyle.append(ToStringStyle.java:80)
	at org.apache.commons.lang3.builder.ToStringBuilder.append(ToStringBuilder.java:472)
	at org.apache.commons.lang3.builder.StandardToStringStyleTest.testObject(StandardToStringStyleTest.java:85)

testPerson(org.apache.commons.lang3.builder.StandardToStringStyleTest)  Time elapsed: 0 sec  <<< FAILURE!
org.junit.ComparisonFailure: expected:<...yleTest.Person[name=[Suzy Queue],age=19,smoker=false...> but was:<...yleTest.Person[name=[%NULL%],age=19,smoker=false...>
	at org.junit.Assert.assertEquals(Assert.java:115)
	at org.junit.Assert.assertEquals(Assert.java:144)
	at org.apache.commons.lang3.builder.StandardToStringStyleTest.testPerson(StandardToStringStyleTest.java:106)

testAppendSuper(org.apache.commons.lang3.builder.StandardToStringStyleTest)  Time elapsed: 0 sec  <<< FAILURE!
org.junit.ComparisonFailure: expected:<Integer[a=[hello]]> but was:<Integer[a=[%NULL%]]>
	at org.junit.Assert.assertEquals(Assert.java:115)
	at org.junit.Assert.assertEquals(Assert.java:144)
	at org.apache.commons.lang3.builder.StandardToStringStyleTest.testAppendSuper(StandardToStringStyleTest.java:76)

Running org.apache.commons.lang3.builder.ToStringStyleTest
Tests run: 12, Failures: 0, Errors: 0, Skipped: 0, Time elapsed: 0.001 sec - in org.apache.commons.lang3.builder.ToStringStyleTest
Running org.apache.commons.lang3.builder.DiffTest
Tests run: 4, Failures: 0, Errors: 0, Skipped: 0, Time elapsed: 0 sec - in org.apache.commons.lang3.builder.DiffTest
Running org.apache.commons.lang3.builder.SimpleToStringStyleTest
Tests run: 8, Failures: 5, Errors: 1, Skipped: 0, Time elapsed: 0.011 sec <<< FAILURE! - in org.apache.commons.lang3.builder.SimpleToStringStyleTest
testObjectArray(org.apache.commons.lang3.builder.SimpleToStringStyleTest)  Time elapsed: 0 sec  <<< FAILURE!
org.junit.ComparisonFailure: expected:<[{<null>,5,{3,6}}]> but was:<[<null>]>
	at org.junit.Assert.assertEquals(Assert.java:115)
	at org.junit.Assert.assertEquals(Assert.java:144)
	at org.apache.commons.lang3.builder.SimpleToStringStyleTest.testObjectArray(SimpleToStringStyleTest.java:103)

testLongArrayArray(org.apache.commons.lang3.builder.SimpleToStringStyleTest)  Time elapsed: 0 sec  <<< FAILURE!
org.junit.ComparisonFailure: expected:<[{{1,2},<null>,{5}}]> but was:<[<null>]>
	at org.junit.Assert.assertEquals(Assert.java:115)
	at org.junit.Assert.assertEquals(Assert.java:144)
	at org.apache.commons.lang3.builder.SimpleToStringStyleTest.testLongArrayArray(SimpleToStringStyleTest.java:123)

testLongArray(org.apache.commons.lang3.builder.SimpleToStringStyleTest)  Time elapsed: 0 sec  <<< FAILURE!
org.junit.ComparisonFailure: expected:<[{1,2,-3,4}]> but was:<[<null>]>
	at org.junit.Assert.assertEquals(Assert.java:115)
	at org.junit.Assert.assertEquals(Assert.java:144)
	at org.apache.commons.lang3.builder.SimpleToStringStyleTest.testLongArray(SimpleToStringStyleTest.java:113)

testObject(org.apache.commons.lang3.builder.SimpleToStringStyleTest)  Time elapsed: 0.005 sec  <<< ERROR!
java.lang.NullPointerException: null
	at org.apache.commons.lang3.builder.ToStringStyle.appendInternal(ToStringStyle.java:105)
	at org.apache.commons.lang3.builder.ToStringStyle.append(ToStringStyle.java:80)
	at org.apache.commons.lang3.builder.ToStringBuilder.append(ToStringBuilder.java:472)
	at org.apache.commons.lang3.builder.SimpleToStringStyleTest.testObject(SimpleToStringStyleTest.java:69)

testPerson(org.apache.commons.lang3.builder.SimpleToStringStyleTest)  Time elapsed: 0 sec  <<< FAILURE!
org.junit.ComparisonFailure: expected:<[Jane Q. Public],47,false> but was:<[<null>],47,false>
	at org.junit.Assert.assertEquals(Assert.java:115)
	at org.junit.Assert.assertEquals(Assert.java:144)
	at org.apache.commons.lang3.builder.SimpleToStringStyleTest.testPerson(SimpleToStringStyleTest.java:89)

testAppendSuper(org.apache.commons.lang3.builder.SimpleToStringStyleTest)  Time elapsed: 0 sec  <<< FAILURE!
org.junit.ComparisonFailure: expected:<[hello]> but was:<[<null>]>
	at org.junit.Assert.assertEquals(Assert.java:115)
	at org.junit.Assert.assertEquals(Assert.java:144)
	at org.apache.commons.lang3.builder.SimpleToStringStyleTest.testAppendSuper(SimpleToStringStyleTest.java:60)

Running org.apache.commons.lang3.builder.MultiLineToStringStyleTest
Tests run: 8, Failures: 5, Errors: 1, Skipped: 0, Time elapsed: 0.002 sec <<< FAILURE! - in org.apache.commons.lang3.builder.MultiLineToStringStyleTest
testObjectArray(org.apache.commons.lang3.builder.MultiLineToStringStyleTest)  Time elapsed: 0.001 sec  <<< FAILURE!
org.junit.ComparisonFailure: expected:<...Integer@66d89fb1[
  [{<null>,5,{3,6}}]
]> but was:<...Integer@66d89fb1[
  [<null>]
]>
	at org.junit.Assert.assertEquals(Assert.java:115)
	at org.junit.Assert.assertEquals(Assert.java:144)
	at org.apache.commons.lang3.builder.MultiLineToStringStyleTest.testObjectArray(MultiLineToStringStyleTest.java:106)

testLongArrayArray(org.apache.commons.lang3.builder.MultiLineToStringStyleTest)  Time elapsed: 0 sec  <<< FAILURE!
org.junit.ComparisonFailure: expected:<...Integer@66d89fb1[
  [{{1,2},<null>,{5}}]
]> but was:<...Integer@66d89fb1[
  [<null>]
]>
	at org.junit.Assert.assertEquals(Assert.java:115)
	at org.junit.Assert.assertEquals(Assert.java:144)
	at org.apache.commons.lang3.builder.MultiLineToStringStyleTest.testLongArrayArray(MultiLineToStringStyleTest.java:126)

testLongArray(org.apache.commons.lang3.builder.MultiLineToStringStyleTest)  Time elapsed: 0 sec  <<< FAILURE!
org.junit.ComparisonFailure: expected:<...Integer@66d89fb1[
  [{1,2,-3,4}]
]> but was:<...Integer@66d89fb1[
  [<null>]
]>
	at org.junit.Assert.assertEquals(Assert.java:115)
	at org.junit.Assert.assertEquals(Assert.java:144)
	at org.apache.commons.lang3.builder.MultiLineToStringStyleTest.testLongArray(MultiLineToStringStyleTest.java:116)

testObject(org.apache.commons.lang3.builder.MultiLineToStringStyleTest)  Time elapsed: 0 sec  <<< ERROR!
java.lang.NullPointerException: null
	at org.apache.commons.lang3.builder.ToStringStyle.appendInternal(ToStringStyle.java:105)
	at org.apache.commons.lang3.builder.ToStringStyle.append(ToStringStyle.java:80)
	at org.apache.commons.lang3.builder.ToStringBuilder.append(ToStringBuilder.java:472)
	at org.apache.commons.lang3.builder.MultiLineToStringStyleTest.testObject(MultiLineToStringStyleTest.java:71)

testPerson(org.apache.commons.lang3.builder.MultiLineToStringStyleTest)  Time elapsed: 0 sec  <<< FAILURE!
org.junit.ComparisonFailure: expected:<...on@76cec888[
  name=[Jane Doe]
  age=25
  smoker=t...> but was:<...on@76cec888[
  name=[<null>]
  age=25
  smoker=t...>
	at org.junit.Assert.assertEquals(Assert.java:115)
	at org.junit.Assert.assertEquals(Assert.java:144)
	at org.apache.commons.lang3.builder.MultiLineToStringStyleTest.testPerson(MultiLineToStringStyleTest.java:92)

testAppendSuper(org.apache.commons.lang3.builder.MultiLineToStringStyleTest)  Time elapsed: 0.001 sec  <<< FAILURE!
org.junit.ComparisonFailure: expected:<...teger@66d89fb1[
  a=[hello]
]> but was:<...teger@66d89fb1[
  a=[<null>]
]>
	at org.junit.Assert.assertEquals(Assert.java:115)
	at org.junit.Assert.assertEquals(Assert.java:144)
	at org.apache.commons.lang3.builder.MultiLineToStringStyleTest.testAppendSuper(MultiLineToStringStyleTest.java:62)

Running org.apache.commons.lang3.builder.ToStringStyleConcurrencyTest
Tests run: 3, Failures: 0, Errors: 0, Skipped: 0, Time elapsed: 0.056 sec - in org.apache.commons.lang3.builder.ToStringStyleConcurrencyTest
Running org.apache.commons.lang3.builder.ReflectionToStringBuilderMutateInspectConcurrencyTest
Tests run: 1, Failures: 0, Errors: 0, Skipped: 1, Time elapsed: 0 sec - in org.apache.commons.lang3.builder.ReflectionToStringBuilderMutateInspectConcurrencyTest
Running org.apache.commons.lang3.builder.ToStringBuilderTest
Tests run: 79, Failures: 39, Errors: 2, Skipped: 1, Time elapsed: 0.063 sec <<< FAILURE! - in org.apache.commons.lang3.builder.ToStringBuilderTest
testCharArray(org.apache.commons.lang3.builder.ToStringBuilderTest)  Time elapsed: 0 sec  <<< FAILURE!
org.junit.ComparisonFailure: expected:<...ng.Integer@66d89fb1[[{A,2,_,D}]]> but was:<...ng.Integer@66d89fb1[[<null>]]>
	at org.junit.Assert.assertEquals(Assert.java:115)
	at org.junit.Assert.assertEquals(Assert.java:144)
	at org.apache.commons.lang3.builder.ToStringBuilderTest.testCharArray(ToStringBuilderTest.java:768)

testDoubleArrayArray(org.apache.commons.lang3.builder.ToStringBuilderTest)  Time elapsed: 0 sec  <<< FAILURE!
org.junit.ComparisonFailure: expected:<...ng.Integer@66d89fb1[[{{1.0,2.29686},<null>,{NaN}}]]> but was:<...ng.Integer@66d89fb1[[<null>]]>
	at org.junit.Assert.assertEquals(Assert.java:115)
	at org.junit.Assert.assertEquals(Assert.java:144)
	at org.apache.commons.lang3.builder.ToStringBuilderTest.testDoubleArrayArray(ToStringBuilderTest.java:858)

testReflectionBoolean(org.apache.commons.lang3.builder.ToStringBuilderTest)  Time elapsed: 0.001 sec  <<< FAILURE!
org.junit.ComparisonFailure: expected:<...lean@54318a7a[value=[true]]> but was:<...lean@54318a7a[value=[<null>]]>
	at org.junit.Assert.assertEquals(Assert.java:115)
	at org.junit.Assert.assertEquals(Assert.java:144)
	at org.apache.commons.lang3.builder.ToStringBuilderTest.testReflectionBoolean(ToStringBuilderTest.java:116)

testObjectArray(org.apache.commons.lang3.builder.ToStringBuilderTest)  Time elapsed: 0 sec  <<< FAILURE!
org.junit.ComparisonFailure: expected:<...ng.Integer@66d89fb1[[{<null>,5,{3,6}}]]> but was:<...ng.Integer@66d89fb1[[<null>]]>
	at org.junit.Assert.assertEquals(Assert.java:115)
	at org.junit.Assert.assertEquals(Assert.java:144)
	at org.apache.commons.lang3.builder.ToStringBuilderTest.testObjectArray(ToStringBuilderTest.java:718)

testObjectBuild(org.apache.commons.lang3.builder.ToStringBuilderTest)  Time elapsed: 0.001 sec  <<< ERROR!
java.lang.NullPointerException: null
	at org.apache.commons.lang3.builder.ToStringStyle.appendInternal(ToStringStyle.java:105)
	at org.apache.commons.lang3.builder.ToStringStyle.append(ToStringStyle.java:80)
	at org.apache.commons.lang3.builder.ToStringBuilder.append(ToStringBuilder.java:472)
	at org.apache.commons.lang3.builder.ToStringBuilderTest.testObjectBuild(ToStringBuilderTest.java:641)

testObjectBuild(org.apache.commons.lang3.builder.ToStringBuilderTest)  Time elapsed: 0.001 sec  <<< FAILURE!
java.lang.AssertionError: Expected null, actual: {5=null} expected null, but was:<{5=null}>
	at org.junit.Assert.fail(Assert.java:88)
	at org.junit.Assert.failNotNull(Assert.java:755)
	at org.junit.Assert.assertNull(Assert.java:737)
	at org.apache.commons.lang3.builder.ToStringBuilderTest.validateNullToStringStyleRegistry(ToStringBuilderTest.java:595)
	at org.apache.commons.lang3.builder.ToStringBuilderTest.after(ToStringBuilderTest.java:48)

testObjectCycle(org.apache.commons.lang3.builder.ToStringBuilderTest)  Time elapsed: 0.001 sec  <<< FAILURE!
org.junit.ComparisonFailure: expected:<...ObjectCycle@787b217[[org.apache.commons.lang3.builder.ToStringBuilderTest$ObjectCycle@5dbd07dd[org.apache.commons.lang3.builder.ToStringBuilderTest$ObjectCycle@787b217]]]> but was:<...ObjectCycle@787b217[[<null>]]>
	at org.junit.Assert.assertEquals(Assert.java:115)
	at org.junit.Assert.assertEquals(Assert.java:144)
	at org.apache.commons.lang3.builder.ToStringBuilderTest.testObjectCycle(ToStringBuilderTest.java:892)

testObjectCycle(org.apache.commons.lang3.builder.ToStringBuilderTest)  Time elapsed: 0.001 sec  <<< FAILURE!
java.lang.AssertionError: Expected null, actual: {5=null} expected null, but was:<{5=null}>
	at org.junit.Assert.fail(Assert.java:88)
	at org.junit.Assert.failNotNull(Assert.java:755)
	at org.junit.Assert.assertNull(Assert.java:737)
	at org.apache.commons.lang3.builder.ToStringBuilderTest.validateNullToStringStyleRegistry(ToStringBuilderTest.java:595)
	at org.apache.commons.lang3.builder.ToStringBuilderTest.after(ToStringBuilderTest.java:48)

testReflectionHierarchy(org.apache.commons.lang3.builder.ToStringBuilderTest)  Time elapsed: 0.001 sec  <<< FAILURE!
org.junit.ComparisonFailure: expected:<...tFixtureA@1cefd3c[a=[a]]> but was:<...tFixtureA@1cefd3c[a=[<null>]]>
	at org.junit.Assert.assertEquals(Assert.java:115)
	at org.junit.Assert.assertEquals(Assert.java:144)
	at org.apache.commons.lang3.builder.ToStringBuilderTest.testReflectionHierarchy(ToStringBuilderTest.java:338)

testReflectionHierarchy(org.apache.commons.lang3.builder.ToStringBuilderTest)  Time elapsed: 0.002 sec  <<< FAILURE!
java.lang.AssertionError: Expected null, actual: {5=null} expected null, but was:<{5=null}>
	at org.junit.Assert.fail(Assert.java:88)
	at org.junit.Assert.failNotNull(Assert.java:755)
	at org.junit.Assert.assertNull(Assert.java:737)
	at org.apache.commons.lang3.builder.ToStringBuilderTest.validateNullToStringStyleRegistry(ToStringBuilderTest.java:595)
	at org.apache.commons.lang3.builder.ToStringBuilderTest.after(ToStringBuilderTest.java:48)

testSelfInstanceTwoVarsReflectionObjectCycle(org.apache.commons.lang3.builder.ToStringBuilderTest)  Time elapsed: 0.001 sec  <<< FAILURE!
org.junit.ComparisonFailure: expected:<...2d284f10[typeIsSelf=[org.apache.commons.lang3.builder.ToStringBuilderTest$SelfInstanceTwoVarsReflectionTestFixture@2d284f10,otherType=The Other Type]]> but was:<...2d284f10[typeIsSelf=[<null>,otherType=<null>]]>
	at org.junit.Assert.assertEquals(Assert.java:115)
	at org.junit.Assert.assertEquals(Assert.java:144)
	at org.apache.commons.lang3.builder.ToStringBuilderTest.testSelfInstanceTwoVarsReflectionObjectCycle(ToStringBuilderTest.java:549)

testSelfInstanceTwoVarsReflectionObjectCycle(org.apache.commons.lang3.builder.ToStringBuilderTest)  Time elapsed: 0.001 sec  <<< FAILURE!
java.lang.AssertionError: Expected null, actual: {5=null} expected null, but was:<{5=null}>
	at org.junit.Assert.fail(Assert.java:88)
	at org.junit.Assert.failNotNull(Assert.java:755)
	at org.junit.Assert.assertNull(Assert.java:737)
	at org.apache.commons.lang3.builder.ToStringBuilderTest.validateNullToStringStyleRegistry(ToStringBuilderTest.java:595)
	at org.apache.commons.lang3.builder.ToStringBuilderTest.after(ToStringBuilderTest.java:48)

testAppendToStringUsingMultiLineStyle(org.apache.commons.lang3.builder.ToStringBuilderTest)  Time elapsed: 0.002 sec  <<< FAILURE!
java.lang.AssertionError: Expected null, actual: {5=null} expected null, but was:<{5=null}>
	at org.junit.Assert.fail(Assert.java:88)
	at org.junit.Assert.failNotNull(Assert.java:755)
	at org.junit.Assert.assertNull(Assert.java:737)
	at org.apache.commons.lang3.builder.ToStringBuilderTest.validateNullToStringStyleRegistry(ToStringBuilderTest.java:595)
	at org.apache.commons.lang3.builder.ToStringBuilderTest.after(ToStringBuilderTest.java:48)

testShortArrayArray(org.apache.commons.lang3.builder.ToStringBuilderTest)  Time elapsed: 0 sec  <<< FAILURE!
org.junit.ComparisonFailure: expected:<...ng.Integer@66d89fb1[[{{1,2},<null>,{5}}]]> but was:<...ng.Integer@66d89fb1[[<null>]]>
	at org.junit.Assert.assertEquals(Assert.java:115)
	at org.junit.Assert.assertEquals(Assert.java:144)
	at org.apache.commons.lang3.builder.ToStringBuilderTest.testShortArrayArray(ToStringBuilderTest.java:828)

testBooleanArrayArray(org.apache.commons.lang3.builder.ToStringBuilderTest)  Time elapsed: 0.001 sec  <<< FAILURE!
org.junit.ComparisonFailure: expected:<...ng.Integer@66d89fb1[[{{true,false},<null>,{false}}]]> but was:<...ng.Integer@66d89fb1[[<null>]]>
	at org.junit.Assert.assertEquals(Assert.java:115)
	at org.junit.Assert.assertEquals(Assert.java:144)
	at org.apache.commons.lang3.builder.ToStringBuilderTest.testBooleanArrayArray(ToStringBuilderTest.java:878)

testFloatArray(org.apache.commons.lang3.builder.ToStringBuilderTest)  Time elapsed: 0.001 sec  <<< FAILURE!
org.junit.ComparisonFailure: expected:<...ng.Integer@66d89fb1[[{1.0,2.9876,-3.00001,4.3}]]> but was:<...ng.Integer@66d89fb1[[<null>]]>
	at org.junit.Assert.assertEquals(Assert.java:115)
	at org.junit.Assert.assertEquals(Assert.java:144)
	at org.apache.commons.lang3.builder.ToStringBuilderTest.testFloatArray(ToStringBuilderTest.java:788)

testByteArray(org.apache.commons.lang3.builder.ToStringBuilderTest)  Time elapsed: 0 sec  <<< FAILURE!
org.junit.ComparisonFailure: expected:<...ng.Integer@66d89fb1[[{1,2,-3,4}]]> but was:<...ng.Integer@66d89fb1[[<null>]]>
	at org.junit.Assert.assertEquals(Assert.java:115)
	at org.junit.Assert.assertEquals(Assert.java:144)
	at org.apache.commons.lang3.builder.ToStringBuilderTest.testByteArray(ToStringBuilderTest.java:758)

testLongArrayArray(org.apache.commons.lang3.builder.ToStringBuilderTest)  Time elapsed: 0.001 sec  <<< FAILURE!
org.junit.ComparisonFailure: expected:<...ng.Integer@66d89fb1[[{{1,2},<null>,{5}}]]> but was:<...ng.Integer@66d89fb1[[<null>]]>
	at org.junit.Assert.assertEquals(Assert.java:115)
	at org.junit.Assert.assertEquals(Assert.java:144)
	at org.apache.commons.lang3.builder.ToStringBuilderTest.testLongArrayArray(ToStringBuilderTest.java:808)

testReflectionInteger(org.apache.commons.lang3.builder.ToStringBuilderTest)  Time elapsed: 0 sec  <<< FAILURE!
org.junit.ComparisonFailure: expected:<...eger@66d89fb1[value=[5]]> but was:<...eger@66d89fb1[value=[<null>]]>
	at org.junit.Assert.assertEquals(Assert.java:115)
	at org.junit.Assert.assertEquals(Assert.java:144)
	at org.apache.commons.lang3.builder.ToStringBuilderTest.testReflectionInteger(ToStringBuilderTest.java:97)

testBooleanArray(org.apache.commons.lang3.builder.ToStringBuilderTest)  Time elapsed: 0.001 sec  <<< FAILURE!
org.junit.ComparisonFailure: expected:<...ng.Integer@66d89fb1[[{true,false,false}]]> but was:<...ng.Integer@66d89fb1[[<null>]]>
	at org.junit.Assert.assertEquals(Assert.java:115)
	at org.junit.Assert.assertEquals(Assert.java:144)
	at org.apache.commons.lang3.builder.ToStringBuilderTest.testBooleanArray(ToStringBuilderTest.java:798)

testFloatArrayArray(org.apache.commons.lang3.builder.ToStringBuilderTest)  Time elapsed: 0.001 sec  <<< FAILURE!
org.junit.ComparisonFailure: expected:<...ng.Integer@66d89fb1[[{{1.0,2.29686},<null>,{NaN}}]]> but was:<...ng.Integer@66d89fb1[[<null>]]>
	at org.junit.Assert.assertEquals(Assert.java:115)
	at org.junit.Assert.assertEquals(Assert.java:144)
	at org.apache.commons.lang3.builder.ToStringBuilderTest.testFloatArrayArray(ToStringBuilderTest.java:868)

testSimpleReflectionStatics(org.apache.commons.lang3.builder.ToStringBuilderTest)  Time elapsed: 0.001 sec  <<< FAILURE!
org.junit.ComparisonFailure: expected:<...9c799b[staticString=[staticString,staticInt=12345]]> but was:<...9c799b[staticString=[<null>,staticInt=<null>]]>
	at org.junit.Assert.assertEquals(Assert.java:115)
	at org.junit.Assert.assertEquals(Assert.java:144)
	at org.apache.commons.lang3.builder.ToStringBuilderTest.testSimpleReflectionStatics(ToStringBuilderTest.java:907)

testReflectionStatics(org.apache.commons.lang3.builder.ToStringBuilderTest)  Time elapsed: 0.001 sec  <<< FAILURE!
org.junit.ComparisonFailure: expected:<...a74355[staticString=[staticString,staticInt=12345,instanceString=instanceString,instanceInt=67890]]> but was:<...a74355[staticString=[<null>,staticInt=<null>,instanceString=<null>,instanceInt=<null>]]>
	at org.junit.Assert.assertEquals(Assert.java:115)
	at org.junit.Assert.assertEquals(Assert.java:144)
	at org.apache.commons.lang3.builder.ToStringBuilderTest.testReflectionStatics(ToStringBuilderTest.java:927)

testReflectionObjectCycle(org.apache.commons.lang3.builder.ToStringBuilderTest)  Time elapsed: 0.001 sec  <<< FAILURE!
org.junit.ComparisonFailure: expected:<...stCycleA@3a57c332[b=[org.apache.commons.lang3.builder.ToStringBuilderTest$ReflectionTestCycleB@57d0258a[a=org.apache.commons.lang3.builder.ToStringBuilderTest$ReflectionTestCycleA@3a57c332]]]> but was:<...stCycleA@3a57c332[b=[<null>]]>
	at org.junit.Assert.assertEquals(Assert.java:115)
	at org.junit.Assert.assertEquals(Assert.java:144)
	at org.apache.commons.lang3.builder.ToStringBuilderTest.testReflectionObjectCycle(ToStringBuilderTest.java:562)

testLongArray(org.apache.commons.lang3.builder.ToStringBuilderTest)  Time elapsed: 0 sec  <<< FAILURE!
org.junit.ComparisonFailure: expected:<...ng.Integer@66d89fb1[[{1,2,-3,4}]]> but was:<...ng.Integer@66d89fb1[[<null>]]>
	at org.junit.Assert.assertEquals(Assert.java:115)
	at org.junit.Assert.assertEquals(Assert.java:144)
	at org.apache.commons.lang3.builder.ToStringBuilderTest.testLongArray(ToStringBuilderTest.java:728)

testSimpleReflectionObjectCycle(org.apache.commons.lang3.builder.ToStringBuilderTest)  Time elapsed: 0.001 sec  <<< FAILURE!
org.junit.ComparisonFailure: expected:<...tFixture@68bb6598[o=[org.apache.commons.lang3.builder.ToStringBuilderTest$SimpleReflectionTestFixture@68bb6598]]> but was:<...tFixture@68bb6598[o=[<null>]]>
	at org.junit.Assert.assertEquals(Assert.java:115)
	at org.junit.Assert.assertEquals(Assert.java:144)
	at org.apache.commons.lang3.builder.ToStringBuilderTest.testSimpleReflectionObjectCycle(ToStringBuilderTest.java:530)

testShortArray(org.apache.commons.lang3.builder.ToStringBuilderTest)  Time elapsed: 0 sec  <<< FAILURE!
org.junit.ComparisonFailure: expected:<...ng.Integer@66d89fb1[[{1,2,-3,4}]]> but was:<...ng.Integer@66d89fb1[[<null>]]>
	at org.junit.Assert.assertEquals(Assert.java:115)
	at org.junit.Assert.assertEquals(Assert.java:144)
	at org.apache.commons.lang3.builder.ToStringBuilderTest.testShortArray(ToStringBuilderTest.java:748)

testIntArrayArray(org.apache.commons.lang3.builder.ToStringBuilderTest)  Time elapsed: 0.001 sec  <<< FAILURE!
org.junit.ComparisonFailure: expected:<...ng.Integer@66d89fb1[[{{1,2},<null>,{5}}]]> but was:<...ng.Integer@66d89fb1[[<null>]]>
	at org.junit.Assert.assertEquals(Assert.java:115)
	at org.junit.Assert.assertEquals(Assert.java:144)
	at org.apache.commons.lang3.builder.ToStringBuilderTest.testIntArrayArray(ToStringBuilderTest.java:818)

testInheritedReflectionStatics(org.apache.commons.lang3.builder.ToStringBuilderTest)  Time elapsed: 0.001 sec  <<< FAILURE!
org.junit.ComparisonFailure: expected:<...968c4[staticString2=[staticString2,staticInt2=67890]]> but was:<...968c4[staticString2=[<null>,staticInt2=<null>]]>
	at org.junit.Assert.assertEquals(Assert.java:115)
	at org.junit.Assert.assertEquals(Assert.java:144)
	at org.apache.commons.lang3.builder.ToStringBuilderTest.testInheritedReflectionStatics(ToStringBuilderTest.java:947)

testAppendToString(org.apache.commons.lang3.builder.ToStringBuilderTest)  Time elapsed: 0.001 sec  <<< FAILURE!
org.junit.ComparisonFailure: expected:<....Integer@66d89fb1[a=[hello]]> but was:<....Integer@66d89fb1[a=[<null>]]>
	at org.junit.Assert.assertEquals(Assert.java:115)
	at org.junit.Assert.assertEquals(Assert.java:144)
	at org.apache.commons.lang3.builder.ToStringBuilderTest.testAppendToString(ToStringBuilderTest.java:614)

testReflectionArrayAndObjectCycle(org.apache.commons.lang3.builder.ToStringBuilderTest)  Time elapsed: 0 sec  <<< FAILURE!
org.junit.ComparisonFailure: expected:<...stFixture@517a564[o=[[Ljava.lang.Object;@22df9697]]}]> but was:<...stFixture@517a564[o=[<null>]]}]>
	at org.junit.Assert.assertEquals(Assert.java:115)
	at org.junit.Assert.assertEquals(Assert.java:144)
	at org.apache.commons.lang3.builder.ToStringBuilderTest.testReflectionArrayAndObjectCycle(ToStringBuilderTest.java:576)

testIntArray(org.apache.commons.lang3.builder.ToStringBuilderTest)  Time elapsed: 0 sec  <<< FAILURE!
org.junit.ComparisonFailure: expected:<...ng.Integer@66d89fb1[[{1,2,-3,4}]]> but was:<...ng.Integer@66d89fb1[[<null>]]>
	at org.junit.Assert.assertEquals(Assert.java:115)
	at org.junit.Assert.assertEquals(Assert.java:144)
	at org.apache.commons.lang3.builder.ToStringBuilderTest.testIntArray(ToStringBuilderTest.java:738)

testByteArrayArray(org.apache.commons.lang3.builder.ToStringBuilderTest)  Time elapsed: 0 sec  <<< FAILURE!
org.junit.ComparisonFailure: expected:<...ng.Integer@66d89fb1[[{{1,2},<null>,{5}}]]> but was:<...ng.Integer@66d89fb1[[<null>]]>
	at org.junit.Assert.assertEquals(Assert.java:115)
	at org.junit.Assert.assertEquals(Assert.java:144)
	at org.apache.commons.lang3.builder.ToStringBuilderTest.testByteArrayArray(ToStringBuilderTest.java:838)

testCharArrayArray(org.apache.commons.lang3.builder.ToStringBuilderTest)  Time elapsed: 0 sec  <<< FAILURE!
org.junit.ComparisonFailure: expected:<...ng.Integer@66d89fb1[[{{A,B},<null>,{p}}]]> but was:<...ng.Integer@66d89fb1[[<null>]]>
	at org.junit.Assert.assertEquals(Assert.java:115)
	at org.junit.Assert.assertEquals(Assert.java:144)
	at org.apache.commons.lang3.builder.ToStringBuilderTest.testCharArrayArray(ToStringBuilderTest.java:848)

testSelfInstanceVarReflectionObjectCycle(org.apache.commons.lang3.builder.ToStringBuilderTest)  Time elapsed: 0 sec  <<< FAILURE!
org.junit.ComparisonFailure: expected:<...45ef3510[typeIsSelf=[org.apache.commons.lang3.builder.ToStringBuilderTest$SelfInstanceVarReflectionTestFixture@45ef3510]]> but was:<...45ef3510[typeIsSelf=[<null>]]>
	at org.junit.Assert.assertEquals(Assert.java:115)
	at org.junit.Assert.assertEquals(Assert.java:144)
	at org.apache.commons.lang3.builder.ToStringBuilderTest.testSelfInstanceVarReflectionObjectCycle(ToStringBuilderTest.java:539)

testObject(org.apache.commons.lang3.builder.ToStringBuilderTest)  Time elapsed: 0 sec  <<< ERROR!
java.lang.NullPointerException: null
	at org.apache.commons.lang3.builder.ToStringStyle.appendInternal(ToStringStyle.java:105)
	at org.apache.commons.lang3.builder.ToStringStyle.append(ToStringStyle.java:80)
	at org.apache.commons.lang3.builder.ToStringBuilder.append(ToStringBuilder.java:472)
	at org.apache.commons.lang3.builder.ToStringBuilderTest.testObject(ToStringBuilderTest.java:623)

testObject(org.apache.commons.lang3.builder.ToStringBuilderTest)  Time elapsed: 0 sec  <<< FAILURE!
java.lang.AssertionError: Expected null, actual: {5=null} expected null, but was:<{5=null}>
	at org.junit.Assert.fail(Assert.java:88)
	at org.junit.Assert.failNotNull(Assert.java:755)
	at org.junit.Assert.assertNull(Assert.java:737)
	at org.apache.commons.lang3.builder.ToStringBuilderTest.validateNullToStringStyleRegistry(ToStringBuilderTest.java:595)
	at org.apache.commons.lang3.builder.ToStringBuilderTest.after(ToStringBuilderTest.java:48)

testAppendSuper(org.apache.commons.lang3.builder.ToStringBuilderTest)  Time elapsed: 0 sec  <<< FAILURE!
org.junit.ComparisonFailure: expected:<....Integer@66d89fb1[a=[hello]]> but was:<....Integer@66d89fb1[a=[<null>]]>
	at org.junit.Assert.assertEquals(Assert.java:115)
	at org.junit.Assert.assertEquals(Assert.java:144)
	at org.apache.commons.lang3.builder.ToStringBuilderTest.testAppendSuper(ToStringBuilderTest.java:604)

testInnerClassReflection(org.apache.commons.lang3.builder.ToStringBuilderTest)  Time elapsed: 0 sec  <<< FAILURE!
org.junit.ComparisonFailure: expected:<...Outer@fb9a026[inner=[org.apache.commons.lang3.builder.ToStringBuilderTest$Outer$Inner@63c126da[]]]> but was:<...Outer@fb9a026[inner=[<null>]]>
	at org.junit.Assert.assertEquals(Assert.java:115)
	at org.junit.Assert.assertEquals(Assert.java:144)
	at org.apache.commons.lang3.builder.ToStringBuilderTest.testInnerClassReflection(ToStringBuilderTest.java:376)

testReflectionCharacter(org.apache.commons.lang3.builder.ToStringBuilderTest)  Time elapsed: 0 sec  <<< FAILURE!
org.junit.ComparisonFailure: expected:<...cter@52fe10f1[value=[A]]> but was:<...cter@52fe10f1[value=[<null>]]>
	at org.junit.Assert.assertEquals(Assert.java:115)
	at org.junit.Assert.assertEquals(Assert.java:144)
	at org.apache.commons.lang3.builder.ToStringBuilderTest.testReflectionCharacter(ToStringBuilderTest.java:106)

testDoubleArray(org.apache.commons.lang3.builder.ToStringBuilderTest)  Time elapsed: 0 sec  <<< FAILURE!
org.junit.ComparisonFailure: expected:<...ng.Integer@66d89fb1[[{1.0,2.9876,-3.00001,4.3}]]> but was:<...ng.Integer@66d89fb1[[<null>]]>
	at org.junit.Assert.assertEquals(Assert.java:115)
	at org.junit.Assert.assertEquals(Assert.java:144)
	at org.apache.commons.lang3.builder.ToStringBuilderTest.testDoubleArray(ToStringBuilderTest.java:778)

Running org.apache.commons.lang3.builder.EqualsBuilderTest
Tests run: 48, Failures: 0, Errors: 0, Skipped: 0, Time elapsed: 0.003 sec - in org.apache.commons.lang3.builder.EqualsBuilderTest
Running org.apache.commons.lang3.builder.HashCodeBuilderAndEqualsBuilderTest
Tests run: 4, Failures: 0, Errors: 0, Skipped: 0, Time elapsed: 0 sec - in org.apache.commons.lang3.builder.HashCodeBuilderAndEqualsBuilderTest
Running org.apache.commons.lang3.builder.ReflectionToStringBuilderConcurrencyTest
Tests run: 3, Failures: 0, Errors: 0, Skipped: 3, Time elapsed: 0 sec - in org.apache.commons.lang3.builder.ReflectionToStringBuilderConcurrencyTest
Running org.apache.commons.lang3.builder.JsonToStringStyleTest
Tests run: 9, Failures: 2, Errors: 1, Skipped: 0, Time elapsed: 0.001 sec <<< FAILURE! - in org.apache.commons.lang3.builder.JsonToStringStyleTest
testObject(org.apache.commons.lang3.builder.JsonToStringStyleTest)  Time elapsed: 0 sec  <<< ERROR!
java.lang.NullPointerException: null
	at org.apache.commons.lang3.builder.ToStringStyle.appendInternal(ToStringStyle.java:105)
	at org.apache.commons.lang3.builder.ToStringStyle.append(ToStringStyle.java:80)
	at org.apache.commons.lang3.builder.ToStringStyle$JsonToStringStyle.append(ToStringStyle.java:416)
	at org.apache.commons.lang3.builder.ToStringBuilder.append(ToStringBuilder.java:848)
	at org.apache.commons.lang3.builder.JsonToStringStyleTest.testObject(JsonToStringStyleTest.java:112)

testPerson(org.apache.commons.lang3.builder.JsonToStringStyleTest)  Time elapsed: 0 sec  <<< FAILURE!
org.junit.ComparisonFailure: expected:<{"name":["Jane Doe"],"age":25,"smoker":t...> but was:<{"name":[null],"age":25,"smoker":t...>
	at org.junit.Assert.assertEquals(Assert.java:115)
	at org.junit.Assert.assertEquals(Assert.java:144)
	at org.apache.commons.lang3.builder.JsonToStringStyleTest.testPerson(JsonToStringStyleTest.java:192)

testAppendSuper(org.apache.commons.lang3.builder.JsonToStringStyleTest)  Time elapsed: 0 sec  <<< FAILURE!
org.junit.ComparisonFailure: expected:<{"a":["hello"]}> but was:<{"a":[null]}>
	at org.junit.Assert.assertEquals(Assert.java:115)
	at org.junit.Assert.assertEquals(Assert.java:144)
	at org.apache.commons.lang3.builder.JsonToStringStyleTest.testAppendSuper(JsonToStringStyleTest.java:74)

Running org.apache.commons.lang3.builder.NoClassNameToStringStyleTest
Tests run: 8, Failures: 5, Errors: 1, Skipped: 0, Time elapsed: 0.001 sec <<< FAILURE! - in org.apache.commons.lang3.builder.NoClassNameToStringStyleTest
testObjectArray(org.apache.commons.lang3.builder.NoClassNameToStringStyleTest)  Time elapsed: 0 sec  <<< FAILURE!
org.junit.ComparisonFailure: expected:<[[{<null>,5,{3,6}}]]> but was:<[[<null>]]>
	at org.junit.Assert.assertEquals(Assert.java:115)
	at org.junit.Assert.assertEquals(Assert.java:144)
	at org.apache.commons.lang3.builder.NoClassNameToStringStyleTest.testObjectArray(NoClassNameToStringStyleTest.java:103)

testLongArrayArray(org.apache.commons.lang3.builder.NoClassNameToStringStyleTest)  Time elapsed: 0 sec  <<< FAILURE!
org.junit.ComparisonFailure: expected:<[[{{1,2},<null>,{5}}]]> but was:<[[<null>]]>
	at org.junit.Assert.assertEquals(Assert.java:115)
	at org.junit.Assert.assertEquals(Assert.java:144)
	at org.apache.commons.lang3.builder.NoClassNameToStringStyleTest.testLongArrayArray(NoClassNameToStringStyleTest.java:123)

testLongArray(org.apache.commons.lang3.builder.NoClassNameToStringStyleTest)  Time elapsed: 0 sec  <<< FAILURE!
org.junit.ComparisonFailure: expected:<[[{1,2,-3,4}]]> but was:<[[<null>]]>
	at org.junit.Assert.assertEquals(Assert.java:115)
	at org.junit.Assert.assertEquals(Assert.java:144)
	at org.apache.commons.lang3.builder.NoClassNameToStringStyleTest.testLongArray(NoClassNameToStringStyleTest.java:113)

testObject(org.apache.commons.lang3.builder.NoClassNameToStringStyleTest)  Time elapsed: 0 sec  <<< ERROR!
java.lang.NullPointerException: null
	at org.apache.commons.lang3.builder.ToStringStyle.appendInternal(ToStringStyle.java:105)
	at org.apache.commons.lang3.builder.ToStringStyle.append(ToStringStyle.java:80)
	at org.apache.commons.lang3.builder.ToStringBuilder.append(ToStringBuilder.java:472)
	at org.apache.commons.lang3.builder.NoClassNameToStringStyleTest.testObject(NoClassNameToStringStyleTest.java:69)

testPerson(org.apache.commons.lang3.builder.NoClassNameToStringStyleTest)  Time elapsed: 0 sec  <<< FAILURE!
org.junit.ComparisonFailure: expected:<[name=[John Q. Public],age=45,smoker=true]> but was:<[name=[<null>],age=45,smoker=true]>
	at org.junit.Assert.assertEquals(Assert.java:115)
	at org.junit.Assert.assertEquals(Assert.java:144)
	at org.apache.commons.lang3.builder.NoClassNameToStringStyleTest.testPerson(NoClassNameToStringStyleTest.java:89)

testAppendSuper(org.apache.commons.lang3.builder.NoClassNameToStringStyleTest)  Time elapsed: 0 sec  <<< FAILURE!
org.junit.ComparisonFailure: expected:<[a=[hello]]> but was:<[a=[<null>]]>
	at org.junit.Assert.assertEquals(Assert.java:115)
	at org.junit.Assert.assertEquals(Assert.java:144)
	at org.apache.commons.lang3.builder.NoClassNameToStringStyleTest.testAppendSuper(NoClassNameToStringStyleTest.java:60)

Running org.apache.commons.lang3.builder.DiffBuilderTest
Tests run: 30, Failures: 0, Errors: 0, Skipped: 0, Time elapsed: 0.027 sec - in org.apache.commons.lang3.builder.DiffBuilderTest
Running org.apache.commons.lang3.builder.HashCodeBuilderTest
Tests run: 44, Failures: 0, Errors: 0, Skipped: 0, Time elapsed: 0.014 sec - in org.apache.commons.lang3.builder.HashCodeBuilderTest
Running org.apache.commons.lang3.concurrent.AtomicInitializerTest
Tests run: 3, Failures: 0, Errors: 0, Skipped: 0, Time elapsed: 0.01 sec - in org.apache.commons.lang3.concurrent.AtomicInitializerTest
Running org.apache.commons.lang3.concurrent.CallableBackgroundInitializerTest
Tests run: 4, Failures: 0, Errors: 0, Skipped: 0, Time elapsed: 0 sec - in org.apache.commons.lang3.concurrent.CallableBackgroundInitializerTest
Running org.apache.commons.lang3.concurrent.BackgroundInitializerTest
Tests run: 15, Failures: 0, Errors: 0, Skipped: 0, Time elapsed: 0.014 sec - in org.apache.commons.lang3.concurrent.BackgroundInitializerTest
Running org.apache.commons.lang3.concurrent.LazyInitializerTest
Tests run: 3, Failures: 0, Errors: 0, Skipped: 0, Time elapsed: 0.005 sec - in org.apache.commons.lang3.concurrent.LazyInitializerTest
Running org.apache.commons.lang3.concurrent.BasicThreadFactoryTest
Tests run: 15, Failures: 0, Errors: 0, Skipped: 0, Time elapsed: 0.034 sec - in org.apache.commons.lang3.concurrent.BasicThreadFactoryTest
Running org.apache.commons.lang3.concurrent.ConstantInitializerTest
Tests run: 7, Failures: 0, Errors: 0, Skipped: 0, Time elapsed: 0.001 sec - in org.apache.commons.lang3.concurrent.ConstantInitializerTest
Running org.apache.commons.lang3.concurrent.MultiBackgroundInitializerTest
Tests run: 17, Failures: 0, Errors: 0, Skipped: 0, Time elapsed: 0.016 sec - in org.apache.commons.lang3.concurrent.MultiBackgroundInitializerTest
Running org.apache.commons.lang3.concurrent.AtomicSafeInitializerTest
Tests run: 4, Failures: 0, Errors: 0, Skipped: 0, Time elapsed: 0.011 sec - in org.apache.commons.lang3.concurrent.AtomicSafeInitializerTest
Running org.apache.commons.lang3.concurrent.ConcurrentUtilsTest
Tests run: 40, Failures: 0, Errors: 0, Skipped: 0, Time elapsed: 0.014 sec - in org.apache.commons.lang3.concurrent.ConcurrentUtilsTest
Running org.apache.commons.lang3.concurrent.TimedSemaphoreTest
Tests run: 15, Failures: 0, Errors: 0, Skipped: 0, Time elapsed: 1.186 sec - in org.apache.commons.lang3.concurrent.TimedSemaphoreTest
Running org.apache.commons.lang3.StringUtilsSubstringTest
Tests run: 14, Failures: 0, Errors: 0, Skipped: 0, Time elapsed: 0.004 sec - in org.apache.commons.lang3.StringUtilsSubstringTest
Running org.apache.commons.lang3.SystemUtilsTest
Tests run: 12, Failures: 0, Errors: 0, Skipped: 0, Time elapsed: 0.003 sec - in org.apache.commons.lang3.SystemUtilsTest
Running org.apache.commons.lang3.CharRangeTest
Tests run: 16, Failures: 0, Errors: 0, Skipped: 0, Time elapsed: 0.031 sec - in org.apache.commons.lang3.CharRangeTest
Running org.apache.commons.lang3.CharSetTest
Tests run: 14, Failures: 0, Errors: 0, Skipped: 0, Time elapsed: 0.008 sec - in org.apache.commons.lang3.CharSetTest
Running org.apache.commons.lang3.StringUtilsStartsEndsWithTest
Tests run: 6, Failures: 0, Errors: 0, Skipped: 0, Time elapsed: 0.003 sec - in org.apache.commons.lang3.StringUtilsStartsEndsWithTest
Running org.apache.commons.lang3.RandomStringUtilsTest
Tests run: 11, Failures: 0, Errors: 0, Skipped: 0, Time elapsed: 0.038 sec - in org.apache.commons.lang3.RandomStringUtilsTest
Running org.apache.commons.lang3.SerializationUtilsTest
Tests run: 26, Failures: 0, Errors: 0, Skipped: 0, Time elapsed: 0.05 sec - in org.apache.commons.lang3.SerializationUtilsTest
Running org.apache.commons.lang3.time.StopWatchTest
Tests run: 8, Failures: 0, Errors: 0, Skipped: 0, Time elapsed: 4.769 sec - in org.apache.commons.lang3.time.StopWatchTest
Running org.apache.commons.lang3.time.DateUtilsRoundingTest
Tests run: 22, Failures: 0, Errors: 0, Skipped: 0, Time elapsed: 0.17 sec - in org.apache.commons.lang3.time.DateUtilsRoundingTest
Running org.apache.commons.lang3.time.FastDateParserTest
Tests run: 33, Failures: 0, Errors: 0, Skipped: 0, Time elapsed: 2.167 sec - in org.apache.commons.lang3.time.FastDateParserTest
Running org.apache.commons.lang3.time.FastDateFormat_ParserTest
Tests run: 33, Failures: 0, Errors: 0, Skipped: 0, Time elapsed: 0.767 sec - in org.apache.commons.lang3.time.FastDateFormat_ParserTest
Running org.apache.commons.lang3.time.DurationFormatUtilsTest
Tests run: 25, Failures: 0, Errors: 0, Skipped: 0, Time elapsed: 0.801 sec - in org.apache.commons.lang3.time.DurationFormatUtilsTest
Running org.apache.commons.lang3.time.DateFormatUtilsTest
Tests run: 10, Failures: 0, Errors: 0, Skipped: 0, Time elapsed: 0.001 sec - in org.apache.commons.lang3.time.DateFormatUtilsTest
Running org.apache.commons.lang3.time.DateUtilsFragmentTest
Tests run: 57, Failures: 0, Errors: 0, Skipped: 0, Time elapsed: 0.01 sec - in org.apache.commons.lang3.time.DateUtilsFragmentTest
Running org.apache.commons.lang3.time.FastDatePrinterTimeZonesTest
Tests run: 617, Failures: 0, Errors: 0, Skipped: 0, Time elapsed: 0.216 sec - in org.apache.commons.lang3.time.FastDatePrinterTimeZonesTest
Running org.apache.commons.lang3.time.FastDateFormatTest
>>FastDateFormatTest: FastDateParser:35375  SimpleDateFormat:3441
Tests run: 14, Failures: 0, Errors: 0, Skipped: 0, Time elapsed: 4.29 sec - in org.apache.commons.lang3.time.FastDateFormatTest
Running org.apache.commons.lang3.time.FastDateFormat_PrinterTest
Tests run: 17, Failures: 0, Errors: 0, Skipped: 0, Time elapsed: 0.007 sec - in org.apache.commons.lang3.time.FastDateFormat_PrinterTest
Running org.apache.commons.lang3.time.FastDatePrinterTest
Tests run: 17, Failures: 0, Errors: 0, Skipped: 0, Time elapsed: 0.004 sec - in org.apache.commons.lang3.time.FastDatePrinterTest
Running org.apache.commons.lang3.time.FastDateParserSDFTest
Tests run: 276, Failures: 0, Errors: 0, Skipped: 92, Time elapsed: 0.06 sec - in org.apache.commons.lang3.time.FastDateParserSDFTest
Running org.apache.commons.lang3.time.DateUtilsTest
DateUtilsTest: Default Locale=en_US
Tests run: 38, Failures: 0, Errors: 0, Skipped: 0, Time elapsed: 0.012 sec - in org.apache.commons.lang3.time.DateUtilsTest
Running org.apache.commons.lang3.reflect.InheritanceUtilsTest
Tests run: 9, Failures: 0, Errors: 0, Skipped: 0, Time elapsed: 0.001 sec - in org.apache.commons.lang3.reflect.InheritanceUtilsTest
Running org.apache.commons.lang3.reflect.MethodUtilsTest
Tests run: 23, Failures: 0, Errors: 0, Skipped: 0, Time elapsed: 0.027 sec - in org.apache.commons.lang3.reflect.MethodUtilsTest
Running org.apache.commons.lang3.reflect.ConstructorUtilsTest
Tests run: 7, Failures: 0, Errors: 0, Skipped: 0, Time elapsed: 0.004 sec - in org.apache.commons.lang3.reflect.ConstructorUtilsTest
Running org.apache.commons.lang3.reflect.FieldUtilsTest
Tests run: 64, Failures: 0, Errors: 0, Skipped: 0, Time elapsed: 0.026 sec - in org.apache.commons.lang3.reflect.FieldUtilsTest
Running org.apache.commons.lang3.reflect.TypeLiteralTest
Tests run: 4, Failures: 0, Errors: 0, Skipped: 0, Time elapsed: 0.004 sec - in org.apache.commons.lang3.reflect.TypeLiteralTest
Running org.apache.commons.lang3.reflect.TypeUtilsTest
Tests run: 19, Failures: 0, Errors: 0, Skipped: 0, Time elapsed: 0.039 sec - in org.apache.commons.lang3.reflect.TypeUtilsTest
Running org.apache.commons.lang3.mutable.MutableByteTest
Tests run: 17, Failures: 0, Errors: 0, Skipped: 0, Time elapsed: 0.005 sec - in org.apache.commons.lang3.mutable.MutableByteTest
Running org.apache.commons.lang3.mutable.MutableShortTest
Tests run: 14, Failures: 0, Errors: 0, Skipped: 0, Time elapsed: 0.002 sec - in org.apache.commons.lang3.mutable.MutableShortTest
Running org.apache.commons.lang3.mutable.MutableIntTest
Tests run: 17, Failures: 0, Errors: 0, Skipped: 0, Time elapsed: 0.003 sec - in org.apache.commons.lang3.mutable.MutableIntTest
Running org.apache.commons.lang3.mutable.MutableDoubleTest
Tests run: 18, Failures: 0, Errors: 0, Skipped: 0, Time elapsed: 0.004 sec - in org.apache.commons.lang3.mutable.MutableDoubleTest
Running org.apache.commons.lang3.mutable.MutableFloatTest
Tests run: 18, Failures: 0, Errors: 0, Skipped: 0, Time elapsed: 0.003 sec - in org.apache.commons.lang3.mutable.MutableFloatTest
Running org.apache.commons.lang3.mutable.MutableLongTest
Tests run: 17, Failures: 0, Errors: 0, Skipped: 0, Time elapsed: 0.004 sec - in org.apache.commons.lang3.mutable.MutableLongTest
Running org.apache.commons.lang3.mutable.MutableBooleanTest
Tests run: 9, Failures: 0, Errors: 0, Skipped: 0, Time elapsed: 0.001 sec - in org.apache.commons.lang3.mutable.MutableBooleanTest
Running org.apache.commons.lang3.mutable.MutableObjectTest
Tests run: 5, Failures: 0, Errors: 0, Skipped: 0, Time elapsed: 0 sec - in org.apache.commons.lang3.mutable.MutableObjectTest
Running org.apache.commons.lang3.text.translate.UnicodeEscaperTest
Tests run: 3, Failures: 0, Errors: 0, Skipped: 0, Time elapsed: 0 sec - in org.apache.commons.lang3.text.translate.UnicodeEscaperTest
Running org.apache.commons.lang3.text.translate.EntityArraysTest
Tests run: 3, Failures: 0, Errors: 0, Skipped: 0, Time elapsed: 0 sec - in org.apache.commons.lang3.text.translate.EntityArraysTest
Running org.apache.commons.lang3.text.translate.UnicodeUnpairedSurrogateRemoverTest
Tests run: 2, Failures: 0, Errors: 0, Skipped: 0, Time elapsed: 0 sec - in org.apache.commons.lang3.text.translate.UnicodeUnpairedSurrogateRemoverTest
Running org.apache.commons.lang3.text.translate.NumericEntityUnescaperTest
Tests run: 3, Failures: 0, Errors: 0, Skipped: 0, Time elapsed: 0 sec - in org.apache.commons.lang3.text.translate.NumericEntityUnescaperTest
Running org.apache.commons.lang3.text.translate.NumericEntityEscaperTest
Tests run: 4, Failures: 0, Errors: 0, Skipped: 0, Time elapsed: 0 sec - in org.apache.commons.lang3.text.translate.NumericEntityEscaperTest
Running org.apache.commons.lang3.text.translate.LookupTranslatorTest
Tests run: 2, Failures: 0, Errors: 0, Skipped: 0, Time elapsed: 0.001 sec - in org.apache.commons.lang3.text.translate.LookupTranslatorTest
Running org.apache.commons.lang3.text.translate.UnicodeUnescaperTest
Tests run: 3, Failures: 0, Errors: 0, Skipped: 0, Time elapsed: 0 sec - in org.apache.commons.lang3.text.translate.UnicodeUnescaperTest
Running org.apache.commons.lang3.text.translate.OctalUnescaperTest
Tests run: 1, Failures: 0, Errors: 0, Skipped: 0, Time elapsed: 0 sec - in org.apache.commons.lang3.text.translate.OctalUnescaperTest
Running org.apache.commons.lang3.text.StrMatcherTest
Tests run: 14, Failures: 0, Errors: 0, Skipped: 0, Time elapsed: 0.003 sec - in org.apache.commons.lang3.text.StrMatcherTest
Running org.apache.commons.lang3.text.StrTokenizerTest
Tests run: 55, Failures: 0, Errors: 0, Skipped: 0, Time elapsed: 0.013 sec - in org.apache.commons.lang3.text.StrTokenizerTest
Running org.apache.commons.lang3.text.FormattableUtilsTest
Tests run: 5, Failures: 0, Errors: 0, Skipped: 0, Time elapsed: 0.001 sec - in org.apache.commons.lang3.text.FormattableUtilsTest
Running org.apache.commons.lang3.text.CompositeFormatTest
Tests run: 2, Failures: 0, Errors: 0, Skipped: 0, Time elapsed: 0 sec - in org.apache.commons.lang3.text.CompositeFormatTest
Running org.apache.commons.lang3.text.WordUtilsTest
Tests run: 12, Failures: 0, Errors: 0, Skipped: 0, Time elapsed: 0.001 sec - in org.apache.commons.lang3.text.WordUtilsTest
Running org.apache.commons.lang3.text.StrLookupTest
Tests run: 5, Failures: 0, Errors: 0, Skipped: 0, Time elapsed: 0.002 sec - in org.apache.commons.lang3.text.StrLookupTest
Running org.apache.commons.lang3.text.StrBuilderAppendInsertTest
Tests run: 51, Failures: 0, Errors: 0, Skipped: 0, Time elapsed: 0.008 sec - in org.apache.commons.lang3.text.StrBuilderAppendInsertTest
Running org.apache.commons.lang3.text.ExtendedMessageFormatTest
Tests run: 10, Failures: 0, Errors: 0, Skipped: 0, Time elapsed: 0.727 sec - in org.apache.commons.lang3.text.ExtendedMessageFormatTest
Running org.apache.commons.lang3.text.StrSubstitutorTest
Tests run: 40, Failures: 0, Errors: 0, Skipped: 0, Time elapsed: 0.034 sec - in org.apache.commons.lang3.text.StrSubstitutorTest
Running org.apache.commons.lang3.text.StrBuilderTest
Tests run: 90, Failures: 0, Errors: 0, Skipped: 0, Time elapsed: 0.042 sec - in org.apache.commons.lang3.text.StrBuilderTest
Running org.apache.commons.lang3.StringEscapeUtilsTest
Tests run: 28, Failures: 0, Errors: 0, Skipped: 0, Time elapsed: 0.344 sec - in org.apache.commons.lang3.StringEscapeUtilsTest
Running org.apache.commons.lang3.AnnotationUtilsTest
Tests run: 10, Failures: 1, Errors: 0, Skipped: 0, Time elapsed: 0.018 sec <<< FAILURE! - in org.apache.commons.lang3.AnnotationUtilsTest
testToString(org.apache.commons.lang3.AnnotationUtilsTest)  Time elapsed: 0.002 sec  <<< FAILURE!
java.lang.AssertionError: null
	at org.junit.Assert.fail(Assert.java:86)
	at org.junit.Assert.assertTrue(Assert.java:41)
	at org.junit.Assert.assertTrue(Assert.java:52)
	at org.apache.commons.lang3.AnnotationUtilsTest.testToString(AnnotationUtilsTest.java:503)

Running org.apache.commons.lang3.ConversionTest
Tests run: 42, Failures: 0, Errors: 0, Skipped: 0, Time elapsed: 0.014 sec - in org.apache.commons.lang3.ConversionTest
Running org.apache.commons.lang3.StringUtilsTrimEmptyTest
Tests run: 15, Failures: 0, Errors: 0, Skipped: 0, Time elapsed: 0.006 sec - in org.apache.commons.lang3.StringUtilsTrimEmptyTest
Running org.apache.commons.lang3.EnumUtilsTest
Tests run: 34, Failures: 0, Errors: 0, Skipped: 0, Time elapsed: 0.009 sec - in org.apache.commons.lang3.EnumUtilsTest
Running org.apache.commons.lang3.exception.ExceptionUtilsTest
Tests run: 28, Failures: 0, Errors: 0, Skipped: 0, Time elapsed: 0.023 sec - in org.apache.commons.lang3.exception.ExceptionUtilsTest
Running org.apache.commons.lang3.exception.DefaultExceptionContextTest
Tests run: 8, Failures: 0, Errors: 0, Skipped: 0, Time elapsed: 0.004 sec - in org.apache.commons.lang3.exception.DefaultExceptionContextTest
Running org.apache.commons.lang3.exception.ContextedExceptionTest
Tests run: 14, Failures: 0, Errors: 0, Skipped: 0, Time elapsed: 0.009 sec - in org.apache.commons.lang3.exception.ContextedExceptionTest
Running org.apache.commons.lang3.exception.ContextedRuntimeExceptionTest
Tests run: 14, Failures: 0, Errors: 0, Skipped: 0, Time elapsed: 0.01 sec - in org.apache.commons.lang3.exception.ContextedRuntimeExceptionTest
Running org.apache.commons.lang3.BitFieldTest
Tests run: 15, Failures: 0, Errors: 0, Skipped: 0, Time elapsed: 0.001 sec - in org.apache.commons.lang3.BitFieldTest
Running org.apache.commons.lang3.ArrayUtilsRemoveMultipleTest
Tests run: 55, Failures: 0, Errors: 0, Skipped: 0, Time elapsed: 0.01 sec - in org.apache.commons.lang3.ArrayUtilsRemoveMultipleTest
Running org.apache.commons.lang3.HashSetvBitSetTest
Ratio=9% array=100 count=1 extract=11959052 bitset=1185762
Ratio=7% array=100 count=10 extract=16158794 bitset=1168360
Ratio=5% array=100 count=50 extract=21668898 bitset=1099729
Ratio=4% array=100 count=100 extract=10406988 bitset=437112
Ratio=88% array=1000 count=10 extract=5203034 bitset=4618591
Ratio=31% array=1000 count=100 extract=14237317 bitset=4543212
Ratio=6% array=1000 count=500 extract=42095920 bitset=2884570
Ratio=0% array=1000 count=1000 extract=78723109 bitset=740877
Ratio=101% count=0 hash=2509134 bits=2535324
Ratio=6% count=5 hash=3168683 bits=208002
Ratio=22% count=10 hash=1342112 bits=296690
Ratio=23% count=200 hash=19287056 bits=4486761
Ratio=21% count=50 hash=6170914 bits=1320394
Ratio=20% count=100 hash=15757414 bits=3253784
Ratio=22% count=1000 hash=73737511 bits=16299762
Ratio=22% count=2000 hash=144188238 bits=32530243
Tests run: 2, Failures: 0, Errors: 0, Skipped: 0, Time elapsed: 0.642 sec - in org.apache.commons.lang3.HashSetvBitSetTest
Running org.apache.commons.lang3.StringUtilsTest
Tests run: 124, Failures: 0, Errors: 0, Skipped: 0, Time elapsed: 0.148 sec - in org.apache.commons.lang3.StringUtilsTest
Running org.apache.commons.lang3.ArrayUtilsRemoveTest
Tests run: 19, Failures: 0, Errors: 0, Skipped: 0, Time elapsed: 0.001 sec - in org.apache.commons.lang3.ArrayUtilsRemoveTest
Running org.apache.commons.lang3.ObjectUtilsTest
Tests run: 36, Failures: 0, Errors: 0, Skipped: 0, Time elapsed: 0.008 sec - in org.apache.commons.lang3.ObjectUtilsTest
Running org.apache.commons.lang3.ClassPathUtilsTest
Tests run: 13, Failures: 0, Errors: 0, Skipped: 0, Time elapsed: 0.001 sec - in org.apache.commons.lang3.ClassPathUtilsTest
Running org.apache.commons.lang3.math.NumberUtilsTest
Tests run: 91, Failures: 0, Errors: 0, Skipped: 0, Time elapsed: 0.032 sec - in org.apache.commons.lang3.math.NumberUtilsTest
Running org.apache.commons.lang3.math.IEEE754rUtilsTest
Tests run: 3, Failures: 0, Errors: 0, Skipped: 0, Time elapsed: 0 sec - in org.apache.commons.lang3.math.IEEE754rUtilsTest
Running org.apache.commons.lang3.math.FractionTest
Tests run: 25, Failures: 0, Errors: 0, Skipped: 0, Time elapsed: 0.085 sec - in org.apache.commons.lang3.math.FractionTest
Running org.apache.commons.lang3.BooleanUtilsTest
Tests run: 72, Failures: 0, Errors: 0, Skipped: 0, Time elapsed: 0.025 sec - in org.apache.commons.lang3.BooleanUtilsTest
Running org.apache.commons.lang3.CharSequenceUtilsTest
Tests run: 2, Failures: 0, Errors: 0, Skipped: 0, Time elapsed: 0.001 sec - in org.apache.commons.lang3.CharSequenceUtilsTest
Running org.apache.commons.lang3.CharSetUtilsTest
Tests run: 11, Failures: 0, Errors: 0, Skipped: 0, Time elapsed: 0.005 sec - in org.apache.commons.lang3.CharSetUtilsTest
Running org.apache.commons.lang3.ArrayUtilsAddTest
Tests run: 13, Failures: 0, Errors: 0, Skipped: 0, Time elapsed: 0.004 sec - in org.apache.commons.lang3.ArrayUtilsAddTest
Running org.apache.commons.lang3.CharEncodingTest
Tests run: 6, Failures: 0, Errors: 0, Skipped: 0, Time elapsed: 0.021 sec - in org.apache.commons.lang3.CharEncodingTest
Running org.apache.commons.lang3.ClassUtilsTest
Tests run: 57, Failures: 0, Errors: 0, Skipped: 0, Time elapsed: 0.033 sec - in org.apache.commons.lang3.ClassUtilsTest
Running org.apache.commons.lang3.RangeTest
Tests run: 24, Failures: 0, Errors: 0, Skipped: 0, Time elapsed: 0.007 sec - in org.apache.commons.lang3.RangeTest
Running org.apache.commons.lang3.event.EventUtilsTest
Tests run: 8, Failures: 0, Errors: 0, Skipped: 0, Time elapsed: 0.016 sec - in org.apache.commons.lang3.event.EventUtilsTest
Running org.apache.commons.lang3.event.EventListenerSupportTest
Tests run: 9, Failures: 0, Errors: 0, Skipped: 0, Time elapsed: 0.022 sec - in org.apache.commons.lang3.event.EventListenerSupportTest
Running org.apache.commons.lang3.ArrayUtilsTest
Tests run: 205, Failures: 1, Errors: 0, Skipped: 0, Time elapsed: 0.051 sec <<< FAILURE! - in org.apache.commons.lang3.ArrayUtilsTest
testToString(org.apache.commons.lang3.ArrayUtilsTest)  Time elapsed: 0 sec  <<< FAILURE!
org.junit.ComparisonFailure: expected:<[{}]> but was:<[<null>]>
	at org.junit.Assert.assertEquals(Assert.java:115)
	at org.junit.Assert.assertEquals(Assert.java:144)
	at org.apache.commons.lang3.ArrayUtilsTest.testToString(ArrayUtilsTest.java:53)

Running org.apache.commons.lang3.CharUtilsTest
Tests run: 24, Failures: 0, Errors: 0, Skipped: 0, Time elapsed: 0.001 sec - in org.apache.commons.lang3.CharUtilsTest
Running org.apache.commons.lang3.NotImplementedExceptionTest
Tests run: 1, Failures: 0, Errors: 0, Skipped: 0, Time elapsed: 0 sec - in org.apache.commons.lang3.NotImplementedExceptionTest
Running org.apache.commons.lang3.StringUtilsEqualsIndexOfTest
Tests run: 50, Failures: 0, Errors: 0, Skipped: 0, Time elapsed: 0.019 sec - in org.apache.commons.lang3.StringUtilsEqualsIndexOfTest
Running org.apache.commons.lang3.RandomUtilsTest
Tests run: 23, Failures: 0, Errors: 0, Skipped: 0, Time elapsed: 0.007 sec - in org.apache.commons.lang3.RandomUtilsTest

Results :

Failed tests: 
  AnnotationUtilsTest.testToString:503 null
  ArrayUtilsTest.testToString:53 expected:<[{}]> but was:<[<null>]>
  DefaultToStringStyleTest.testAppendSuper:61 expected:<....Integer@66d89fb1[a=[hello]]> but was:<....Integer@66d89fb1[a=[<null>]]>
  DefaultToStringStyleTest.testLongArray:115 expected:<...ng.Integer@66d89fb1[[{1,2,-3,4}]]> but was:<...ng.Integer@66d89fb1[[<null>]]>
  DefaultToStringStyleTest.testLongArrayArray:125 expected:<...ng.Integer@66d89fb1[[{{1,2},<null>,{5}}]]> but was:<...ng.Integer@66d89fb1[[<null>]]>
  DefaultToStringStyleTest.testObjectArray:105 expected:<...ng.Integer@66d89fb1[[{<null>,5,{3,6}}]]> but was:<...ng.Integer@66d89fb1[[<null>]]>
  DefaultToStringStyleTest.testPerson:91 expected:<...erson@78b274de[name=[John Doe],age=33,smoker=false...> but was:<...erson@78b274de[name=[<null>],age=33,smoker=false...>
  DiffResultTest.testToStringOutput:95 expected:<...est.EmptyClass[test=[false] differs from DiffResultTest.EmptyClass[test=true]]> but was:<...est.EmptyClass[test=[<null>] differs from DiffResultTest.EmptyClass[test=<null>]]>
  DiffResultTest.testToStringSpecifyStyleOutput:115 expected:<...13f[
  booleanField=[false
] differs from org.apache.commons.lang3.builder.DiffResultTest$SimpleClass@174ed6a7[
  booleanField=true]
]> but was:<...13f[
  booleanField=[<null>
] differs from org.apache.commons.lang3.builder.DiffResultTest$SimpleClass@174ed6a7[
  booleanField=<null>]
]>
  JsonToStringStyleTest.testAppendSuper:74 expected:<{"a":["hello"]}> but was:<{"a":[null]}>
  JsonToStringStyleTest.testPerson:192 expected:<{"name":["Jane Doe"],"age":25,"smoker":t...> but was:<{"name":[null],"age":25,"smoker":t...>
  MultiLineToStringStyleTest.testAppendSuper:62 expected:<...teger@66d89fb1[
  a=[hello]
]> but was:<...teger@66d89fb1[
  a=[<null>]
]>
  MultiLineToStringStyleTest.testLongArray:116 expected:<...Integer@66d89fb1[
  [{1,2,-3,4}]
]> but was:<...Integer@66d89fb1[
  [<null>]
]>
  MultiLineToStringStyleTest.testLongArrayArray:126 expected:<...Integer@66d89fb1[
  [{{1,2},<null>,{5}}]
]> but was:<...Integer@66d89fb1[
  [<null>]
]>
  MultiLineToStringStyleTest.testObjectArray:106 expected:<...Integer@66d89fb1[
  [{<null>,5,{3,6}}]
]> but was:<...Integer@66d89fb1[
  [<null>]
]>
  MultiLineToStringStyleTest.testPerson:92 expected:<...on@76cec888[
  name=[Jane Doe]
  age=25
  smoker=t...> but was:<...on@76cec888[
  name=[<null>]
  age=25
  smoker=t...>
  MultilineRecursiveToStringStyleTest.simpleObject:42 expected:<...@112a39aa[
  amount=[100.0,
  date=2014.10.15]
]> but was:<...@112a39aa[
  amount=[<null>,
  date=<null>]
]>
  NoClassNameToStringStyleTest.testAppendSuper:60 expected:<[a=[hello]]> but was:<[a=[<null>]]>
  NoClassNameToStringStyleTest.testLongArray:113 expected:<[[{1,2,-3,4}]]> but was:<[[<null>]]>
  NoClassNameToStringStyleTest.testLongArrayArray:123 expected:<[[{{1,2},<null>,{5}}]]> but was:<[[<null>]]>
  NoClassNameToStringStyleTest.testObjectArray:103 expected:<[[{<null>,5,{3,6}}]]> but was:<[[<null>]]>
  NoClassNameToStringStyleTest.testPerson:89 expected:<[name=[John Q. Public],age=45,smoker=true]> but was:<[name=[<null>],age=45,smoker=true]>
  NoFieldNamesToStringStyleTest.testAppendSuper:61 expected:<...ng.Integer@66d89fb1[[hello]]> but was:<...ng.Integer@66d89fb1[[<null>]]>
  NoFieldNamesToStringStyleTest.testLongArray:115 expected:<...ng.Integer@66d89fb1[[{1,2,-3,4}]]> but was:<...ng.Integer@66d89fb1[[<null>]]>
  NoFieldNamesToStringStyleTest.testLongArrayArray:125 expected:<...ng.Integer@66d89fb1[[{{1,2},<null>,{5}}]]> but was:<...ng.Integer@66d89fb1[[<null>]]>
  NoFieldNamesToStringStyleTest.testObjectArray:105 expected:<...ng.Integer@66d89fb1[[{<null>,5,{3,6}}]]> but was:<...ng.Integer@66d89fb1[[<null>]]>
  NoFieldNamesToStringStyleTest.testPerson:91 expected:<...est$Person@2f6d549e[[Ron Paul],72,false]> but was:<...est$Person@2f6d549e[[<null>],72,false]>
  RecursiveToStringStyleTest.testAppendSuper:60 expected:<....Integer@66d89fb1[a=[hello]]> but was:<....Integer@66d89fb1[a=[<null>]]>
  RecursiveToStringStyleTest.testLongArray:118 expected:<...ng.Integer@66d89fb1[[{1,2,-3,4}]]> but was:<...ng.Integer@66d89fb1[[<null>]]>
  RecursiveToStringStyleTest.testLongArrayArray:128 expected:<...ng.Integer@66d89fb1[[{{1,2},<null>,{5}}]]> but was:<...ng.Integer@66d89fb1[[<null>]]>
  RecursiveToStringStyleTest.testObjectArray:108 expected:<...ng.Integer@66d89fb1[[{<null>,5,{3,6}}]]> but was:<...ng.Integer@66d89fb1[[<null>]]>
  RecursiveToStringStyleTest.testPerson:93 expected:<...erson@37c345e7[name=[John Doe,age=33,smoker=false,job=org.apache.commons.lang3.builder.RecursiveToStringStyleTest$Job@75225d4a[title=Manager]]]> but was:<...erson@37c345e7[name=[<null>,age=<null>,smoker=<null>,job=<null>]]>
  ReflectionToStringBuilderExcludeTest.test_toStringExclude:53->validateSecretFieldAbsent:130->validateNonSecretField:125 null
  ReflectionToStringBuilderExcludeTest.test_toStringExcludeArray:59->validateSecretFieldAbsent:130->validateNonSecretField:125 null
  ReflectionToStringBuilderExcludeTest.test_toStringExcludeArrayWithNull:65->validateSecretFieldPresent:134 null
  ReflectionToStringBuilderExcludeTest.test_toStringExcludeArrayWithNulls:71->validateSecretFieldPresent:134 null
  ReflectionToStringBuilderExcludeTest.test_toStringExcludeCollection:79->validateSecretFieldAbsent:130->validateNonSecretField:125 null
  ReflectionToStringBuilderExcludeTest.test_toStringExcludeCollectionWithNull:87->validateSecretFieldPresent:134 null
  ReflectionToStringBuilderExcludeTest.test_toStringExcludeCollectionWithNulls:96->validateSecretFieldPresent:134 null
  ReflectionToStringBuilderExcludeTest.test_toStringExcludeEmptyArray:102->validateSecretFieldPresent:134 null
  ReflectionToStringBuilderExcludeTest.test_toStringExcludeEmptyCollection:108->validateSecretFieldPresent:134 null
  ReflectionToStringBuilderExcludeTest.test_toStringExcludeNullArray:114->validateSecretFieldPresent:134 null
  ReflectionToStringBuilderExcludeTest.test_toStringExcludeNullCollection:120->validateSecretFieldPresent:134 null
  ShortPrefixToStringStyleTest.testAppendSuper:61 expected:<Integer[a=[hello]]> but was:<Integer[a=[<null>]]>
  ShortPrefixToStringStyleTest.testLongArray:115 expected:<Integer[[{1,2,-3,4}]]> but was:<Integer[[<null>]]>
  ShortPrefixToStringStyleTest.testLongArrayArray:125 expected:<Integer[[{{1,2},<null>,{5}}]]> but was:<Integer[[<null>]]>
  ShortPrefixToStringStyleTest.testObjectArray:105 expected:<Integer[[{<null>,5,{3,6}}]]> but was:<Integer[[<null>]]>
  ShortPrefixToStringStyleTest.testPerson:91 expected:<...yleTest.Person[name=[John Q. Public],age=45,smoker=true]> but was:<...yleTest.Person[name=[<null>],age=45,smoker=true]>
  SimpleToStringStyleTest.testAppendSuper:60 expected:<[hello]> but was:<[<null>]>
  SimpleToStringStyleTest.testLongArray:113 expected:<[{1,2,-3,4}]> but was:<[<null>]>
  SimpleToStringStyleTest.testLongArrayArray:123 expected:<[{{1,2},<null>,{5}}]> but was:<[<null>]>
  SimpleToStringStyleTest.testObjectArray:103 expected:<[{<null>,5,{3,6}}]> but was:<[<null>]>
  SimpleToStringStyleTest.testPerson:89 expected:<[Jane Q. Public],47,false> but was:<[<null>],47,false>
  StandardToStringStyleTest.testAppendSuper:76 expected:<Integer[a=[hello]]> but was:<Integer[a=[%NULL%]]>
  StandardToStringStyleTest.testLongArray:130 expected:<Integer[[[1, 2, -3, 4]]]> but was:<Integer[[%NULL%]]>
  StandardToStringStyleTest.testLongArrayArray:140 expected:<Integer[[[[1, 2], %NULL%, [5]]]]> but was:<Integer[[%NULL%]]>
  StandardToStringStyleTest.testObjectArray:120 expected:<Integer[[[%NULL%, 5, [3, 6]]]]> but was:<Integer[[%NULL%]]>
  StandardToStringStyleTest.testPerson:106 expected:<...yleTest.Person[name=[Suzy Queue],age=19,smoker=false...> but was:<...yleTest.Person[name=[%NULL%],age=19,smoker=false...>
  ToStringBuilderTest.testAppendSuper:604 expected:<....Integer@66d89fb1[a=[hello]]> but was:<....Integer@66d89fb1[a=[<null>]]>
  ToStringBuilderTest.testAppendToString:614 expected:<....Integer@66d89fb1[a=[hello]]> but was:<....Integer@66d89fb1[a=[<null>]]>
  ToStringBuilderTest.after:48->validateNullToStringStyleRegistry:595 Expected null, actual: {5=null} expected null, but was:<{5=null}>
  ToStringBuilderTest.testBooleanArray:798 expected:<...ng.Integer@66d89fb1[[{true,false,false}]]> but was:<...ng.Integer@66d89fb1[[<null>]]>
  ToStringBuilderTest.testBooleanArrayArray:878 expected:<...ng.Integer@66d89fb1[[{{true,false},<null>,{false}}]]> but was:<...ng.Integer@66d89fb1[[<null>]]>
  ToStringBuilderTest.testByteArray:758 expected:<...ng.Integer@66d89fb1[[{1,2,-3,4}]]> but was:<...ng.Integer@66d89fb1[[<null>]]>
  ToStringBuilderTest.testByteArrayArray:838 expected:<...ng.Integer@66d89fb1[[{{1,2},<null>,{5}}]]> but was:<...ng.Integer@66d89fb1[[<null>]]>
  ToStringBuilderTest.testCharArray:768 expected:<...ng.Integer@66d89fb1[[{A,2,_,D}]]> but was:<...ng.Integer@66d89fb1[[<null>]]>
  ToStringBuilderTest.testCharArrayArray:848 expected:<...ng.Integer@66d89fb1[[{{A,B},<null>,{p}}]]> but was:<...ng.Integer@66d89fb1[[<null>]]>
  ToStringBuilderTest.testDoubleArray:778 expected:<...ng.Integer@66d89fb1[[{1.0,2.9876,-3.00001,4.3}]]> but was:<...ng.Integer@66d89fb1[[<null>]]>
  ToStringBuilderTest.testDoubleArrayArray:858 expected:<...ng.Integer@66d89fb1[[{{1.0,2.29686},<null>,{NaN}}]]> but was:<...ng.Integer@66d89fb1[[<null>]]>
  ToStringBuilderTest.testFloatArray:788 expected:<...ng.Integer@66d89fb1[[{1.0,2.9876,-3.00001,4.3}]]> but was:<...ng.Integer@66d89fb1[[<null>]]>
  ToStringBuilderTest.testFloatArrayArray:868 expected:<...ng.Integer@66d89fb1[[{{1.0,2.29686},<null>,{NaN}}]]> but was:<...ng.Integer@66d89fb1[[<null>]]>
  ToStringBuilderTest.testInheritedReflectionStatics:947 expected:<...968c4[staticString2=[staticString2,staticInt2=67890]]> but was:<...968c4[staticString2=[<null>,staticInt2=<null>]]>
  ToStringBuilderTest.testInnerClassReflection:376 expected:<...Outer@fb9a026[inner=[org.apache.commons.lang3.builder.ToStringBuilderTest$Outer$Inner@63c126da[]]]> but was:<...Outer@fb9a026[inner=[<null>]]>
  ToStringBuilderTest.testIntArray:738 expected:<...ng.Integer@66d89fb1[[{1,2,-3,4}]]> but was:<...ng.Integer@66d89fb1[[<null>]]>
  ToStringBuilderTest.testIntArrayArray:818 expected:<...ng.Integer@66d89fb1[[{{1,2},<null>,{5}}]]> but was:<...ng.Integer@66d89fb1[[<null>]]>
  ToStringBuilderTest.testLongArray:728 expected:<...ng.Integer@66d89fb1[[{1,2,-3,4}]]> but was:<...ng.Integer@66d89fb1[[<null>]]>
  ToStringBuilderTest.testLongArrayArray:808 expected:<...ng.Integer@66d89fb1[[{{1,2},<null>,{5}}]]> but was:<...ng.Integer@66d89fb1[[<null>]]>
  ToStringBuilderTest.testObjectArray:718 expected:<...ng.Integer@66d89fb1[[{<null>,5,{3,6}}]]> but was:<...ng.Integer@66d89fb1[[<null>]]>
org.apache.commons.lang3.builder.ToStringBuilderTest.testObjectCycle(org.apache.commons.lang3.builder.ToStringBuilderTest)
  Run 1: ToStringBuilderTest.testObjectCycle:892 expected:<...ObjectCycle@787b217[[org.apache.commons.lang3.builder.ToStringBuilderTest$ObjectCycle@5dbd07dd[org.apache.commons.lang3.builder.ToStringBuilderTest$ObjectCycle@787b217]]]> but was:<...ObjectCycle@787b217[[<null>]]>
  Run 2: ToStringBuilderTest.after:48->validateNullToStringStyleRegistry:595 Expected null, actual: {5=null} expected null, but was:<{5=null}>

  ToStringBuilderTest.testReflectionArrayAndObjectCycle:576 expected:<...stFixture@517a564[o=[[Ljava.lang.Object;@22df9697]]}]> but was:<...stFixture@517a564[o=[<null>]]}]>
  ToStringBuilderTest.testReflectionBoolean:116 expected:<...lean@54318a7a[value=[true]]> but was:<...lean@54318a7a[value=[<null>]]>
  ToStringBuilderTest.testReflectionCharacter:106 expected:<...cter@52fe10f1[value=[A]]> but was:<...cter@52fe10f1[value=[<null>]]>
org.apache.commons.lang3.builder.ToStringBuilderTest.testReflectionHierarchy(org.apache.commons.lang3.builder.ToStringBuilderTest)
  Run 1: ToStringBuilderTest.testReflectionHierarchy:338 expected:<...tFixtureA@1cefd3c[a=[a]]> but was:<...tFixtureA@1cefd3c[a=[<null>]]>
  Run 2: ToStringBuilderTest.after:48->validateNullToStringStyleRegistry:595 Expected null, actual: {5=null} expected null, but was:<{5=null}>

  ToStringBuilderTest.testReflectionInteger:97 expected:<...eger@66d89fb1[value=[5]]> but was:<...eger@66d89fb1[value=[<null>]]>
  ToStringBuilderTest.testReflectionObjectCycle:562 expected:<...stCycleA@3a57c332[b=[org.apache.commons.lang3.builder.ToStringBuilderTest$ReflectionTestCycleB@57d0258a[a=org.apache.commons.lang3.builder.ToStringBuilderTest$ReflectionTestCycleA@3a57c332]]]> but was:<...stCycleA@3a57c332[b=[<null>]]>
  ToStringBuilderTest.testReflectionStatics:927 expected:<...a74355[staticString=[staticString,staticInt=12345,instanceString=instanceString,instanceInt=67890]]> but was:<...a74355[staticString=[<null>,staticInt=<null>,instanceString=<null>,instanceInt=<null>]]>
org.apache.commons.lang3.builder.ToStringBuilderTest.testSelfInstanceTwoVarsReflectionObjectCycle(org.apache.commons.lang3.builder.ToStringBuilderTest)
  Run 1: ToStringBuilderTest.testSelfInstanceTwoVarsReflectionObjectCycle:549 expected:<...2d284f10[typeIsSelf=[org.apache.commons.lang3.builder.ToStringBuilderTest$SelfInstanceTwoVarsReflectionTestFixture@2d284f10,otherType=The Other Type]]> but was:<...2d284f10[typeIsSelf=[<null>,otherType=<null>]]>
  Run 2: ToStringBuilderTest.after:48->validateNullToStringStyleRegistry:595 Expected null, actual: {5=null} expected null, but was:<{5=null}>

  ToStringBuilderTest.testSelfInstanceVarReflectionObjectCycle:539 expected:<...45ef3510[typeIsSelf=[org.apache.commons.lang3.builder.ToStringBuilderTest$SelfInstanceVarReflectionTestFixture@45ef3510]]> but was:<...45ef3510[typeIsSelf=[<null>]]>
  ToStringBuilderTest.testShortArray:748 expected:<...ng.Integer@66d89fb1[[{1,2,-3,4}]]> but was:<...ng.Integer@66d89fb1[[<null>]]>
  ToStringBuilderTest.testShortArrayArray:828 expected:<...ng.Integer@66d89fb1[[{{1,2},<null>,{5}}]]> but was:<...ng.Integer@66d89fb1[[<null>]]>
  ToStringBuilderTest.testSimpleReflectionObjectCycle:530 expected:<...tFixture@68bb6598[o=[org.apache.commons.lang3.builder.ToStringBuilderTest$SimpleReflectionTestFixture@68bb6598]]> but was:<...tFixture@68bb6598[o=[<null>]]>
  ToStringBuilderTest.testSimpleReflectionStatics:907 expected:<...9c799b[staticString=[staticString,staticInt=12345]]> but was:<...9c799b[staticString=[<null>,staticInt=<null>]]>

Tests in error: 
  DefaultToStringStyleTest.testObject:70 » NullPointer
  JsonToStringStyleTest.testObject:112 » NullPointer
  MultiLineToStringStyleTest.testObject:71 » NullPointer
  MultilineRecursiveToStringStyleTest.boolArray:113->toString:211 » NullPointer
  MultilineRecursiveToStringStyleTest.charArray:131->toString:211 » NullPointer
  MultilineRecursiveToStringStyleTest.doubleArray:167->toString:211 » NullPointer
  MultilineRecursiveToStringStyleTest.intArray:149->toString:211 » NullPointer
  MultilineRecursiveToStringStyleTest.longArray:185->toString:211 » NullPointer
  MultilineRecursiveToStringStyleTest.nestedAndArray:80->toString:211 » NullPointer
  MultilineRecursiveToStringStyleTest.nestedElements:57->toString:211 » NullPointer
  MultilineRecursiveToStringStyleTest.noArray:94->toString:211 » NullPointer
  MultilineRecursiveToStringStyleTest.stringArray:203->toString:211 » NullPointer
  NoClassNameToStringStyleTest.testObject:69 » NullPointer
  NoFieldNamesToStringStyleTest.testObject:70 » NullPointer
  RecursiveToStringStyleTest.testObject:69 » NullPointer
  ShortPrefixToStringStyleTest.testObject:70 » NullPointer
  SimpleToStringStyleTest.testObject:69 » NullPointer
  StandardToStringStyleTest.testObject:85 » NullPointer
org.apache.commons.lang3.builder.ToStringBuilderTest.testObject(org.apache.commons.lang3.builder.ToStringBuilderTest)
  Run 1: ToStringBuilderTest.testObject:623 » NullPointer
  Run 2: ToStringBuilderTest.after:48->validateNullToStringStyleRegistry:595 Expected null, actual: {5=null} expected null, but was:<{5=null}>

org.apache.commons.lang3.builder.ToStringBuilderTest.testObjectBuild(org.apache.commons.lang3.builder.ToStringBuilderTest)
  Run 1: ToStringBuilderTest.testObjectBuild:641 » NullPointer
  Run 2: ToStringBuilderTest.after:48->validateNullToStringStyleRegistry:595 Expected null, actual: {5=null} expected null, but was:<{5=null}>



Tests run: 3526, Failures: 92, Errors: 20, Skipped: 97

[INFO] ------------------------------------------------------------------------
[INFO] BUILD FAILURE
[INFO] ------------------------------------------------------------------------
[INFO] Total time: 31.553s
[INFO] Finished at: Tue Aug 04 09:04:59 BST 2015
[INFO] Final Memory: 23M/412M
[INFO] ------------------------------------------------------------------------
[ERROR] Failed to execute goal org.apache.maven.plugins:maven-surefire-plugin:2.18:test (default-test) on project commons-lang3: There are test failures.
[ERROR] 
[ERROR] Please refer to /home/perham/Study/LittleDarwin/Cases/commons-lang3-3.4-src/target/surefire-reports for the individual test results.
[ERROR] -> [Help 1]
[ERROR] 
[ERROR] To see the full stack trace of the errors, re-run Maven with the -e switch.
[ERROR] Re-run Maven using the -X switch to enable full debug logging.
[ERROR] 
[ERROR] For more information about the errors and possible solutions, please read the following articles:
[ERROR] [Help 1] http://cwiki.apache.org/confluence/display/MAVEN/MojoFailureException
