[INFO] Scanning for projects...
[INFO]                                                                         
[INFO] ------------------------------------------------------------------------
[INFO] Building Apache Commons Lang 3.4
[INFO] ------------------------------------------------------------------------
[INFO] 
[INFO] --- maven-enforcer-plugin:1.3.1:enforce (enforce-maven-3) @ commons-lang3 ---
[INFO] 
[INFO] --- build-helper-maven-plugin:1.8:parse-version (parse-version) @ commons-lang3 ---
[INFO] 
[INFO] --- maven-antrun-plugin:1.8:run (javadoc.resources) @ commons-lang3 ---
[INFO] Executing tasks

main:
[INFO] Executed tasks
[INFO] 
[INFO] --- maven-remote-resources-plugin:1.5:process (default) @ commons-lang3 ---
[INFO] 
[INFO] --- buildnumber-maven-plugin:1.3:create (default) @ commons-lang3 ---
[INFO] Executing: /bin/sh -c cd /home/perham/Study/LittleDarwin/Cases/commons-lang3-3.4-src && svn --non-interactive info
[INFO] Working directory: /home/perham/Study/LittleDarwin/Cases/commons-lang3-3.4-src
[INFO] Storing buildNumber: ?????? at timestamp: 1438675213604
[INFO] Executing: /bin/sh -c cd /home/perham/Study/LittleDarwin/Cases/commons-lang3-3.4-src && svn --non-interactive info
[INFO] Working directory: /home/perham/Study/LittleDarwin/Cases/commons-lang3-3.4-src
[INFO] Storing buildScmBranch: UNKNOWN_BRANCH
[INFO] 
[INFO] --- maven-resources-plugin:2.7:resources (default-resources) @ commons-lang3 ---
[INFO] Using 'ISO-8859-1' encoding to copy filtered resources.
[INFO] Copying 0 resource
[INFO] Copying 2 resources to META-INF
[INFO] 
[INFO] --- maven-compiler-plugin:3.2:compile (default-compile) @ commons-lang3 ---
[INFO] Changes detected - recompiling the module!
[INFO] Compiling 133 source files to /home/perham/Study/LittleDarwin/Cases/commons-lang3-3.4-src/target/classes
[INFO] /home/perham/Study/LittleDarwin/Cases/commons-lang3-3.4-src/src/main/java/org/apache/commons/lang3/SerializationUtils.java: /home/perham/Study/LittleDarwin/Cases/commons-lang3-3.4-src/src/main/java/org/apache/commons/lang3/SerializationUtils.java uses unchecked or unsafe operations.
[INFO] /home/perham/Study/LittleDarwin/Cases/commons-lang3-3.4-src/src/main/java/org/apache/commons/lang3/SerializationUtils.java: Recompile with -Xlint:unchecked for details.
[INFO] 
[INFO] --- maven-bundle-plugin:2.5.3:manifest (bundle-manifest) @ commons-lang3 ---
[INFO] 
[INFO] --- animal-sniffer-maven-plugin:1.13:check (checkAPIcompatibility) @ commons-lang3 ---
[INFO] Checking unresolved references to org.codehaus.mojo.signature:java16:1.0
[INFO] 
[INFO] --- maven-resources-plugin:2.7:testResources (default-testResources) @ commons-lang3 ---
[INFO] Using 'ISO-8859-1' encoding to copy filtered resources.
[INFO] Copying 2 resources
[INFO] Copying 2 resources to META-INF
[INFO] 
[INFO] --- maven-compiler-plugin:3.2:testCompile (default-testCompile) @ commons-lang3 ---
[INFO] Nothing to compile - all classes are up to date
[INFO] 
[INFO] --- maven-surefire-plugin:2.18:test (default-test) @ commons-lang3 ---
[INFO] Surefire report directory: /home/perham/Study/LittleDarwin/Cases/commons-lang3-3.4-src/target/surefire-reports

-------------------------------------------------------
 T E S T S
-------------------------------------------------------
Running org.apache.commons.lang3.ValidateTest
Tests run: 63, Failures: 0, Errors: 0, Skipped: 0, Time elapsed: 0.033 sec - in org.apache.commons.lang3.ValidateTest
Running org.apache.commons.lang3.LocaleUtilsTest
Tests run: 15, Failures: 0, Errors: 0, Skipped: 0, Time elapsed: 0.021 sec - in org.apache.commons.lang3.LocaleUtilsTest
Running org.apache.commons.lang3.tuple.MutableTripleTest
Tests run: 8, Failures: 0, Errors: 0, Skipped: 0, Time elapsed: 0.01 sec - in org.apache.commons.lang3.tuple.MutableTripleTest
Running org.apache.commons.lang3.tuple.TripleTest
Tests run: 10, Failures: 0, Errors: 0, Skipped: 0, Time elapsed: 0.007 sec - in org.apache.commons.lang3.tuple.TripleTest
Running org.apache.commons.lang3.tuple.ImmutablePairTest
Tests run: 6, Failures: 0, Errors: 0, Skipped: 0, Time elapsed: 0.001 sec - in org.apache.commons.lang3.tuple.ImmutablePairTest
Running org.apache.commons.lang3.tuple.MutablePairTest
Tests run: 8, Failures: 0, Errors: 0, Skipped: 0, Time elapsed: 0.001 sec - in org.apache.commons.lang3.tuple.MutablePairTest
Running org.apache.commons.lang3.tuple.ImmutableTripleTest
Tests run: 6, Failures: 0, Errors: 0, Skipped: 0, Time elapsed: 0 sec - in org.apache.commons.lang3.tuple.ImmutableTripleTest
Running org.apache.commons.lang3.tuple.PairTest
Tests run: 9, Failures: 0, Errors: 0, Skipped: 0, Time elapsed: 0.001 sec - in org.apache.commons.lang3.tuple.PairTest
Running org.apache.commons.lang3.StringUtilsIsTest
Tests run: 8, Failures: 0, Errors: 0, Skipped: 0, Time elapsed: 0.009 sec - in org.apache.commons.lang3.StringUtilsIsTest
Running org.apache.commons.lang3.JavaVersionTest
Tests run: 3, Failures: 0, Errors: 0, Skipped: 0, Time elapsed: 0 sec - in org.apache.commons.lang3.JavaVersionTest
Running org.apache.commons.lang3.builder.NoFieldNamesToStringStyleTest
Tests run: 8, Failures: 0, Errors: 0, Skipped: 0, Time elapsed: 0.006 sec - in org.apache.commons.lang3.builder.NoFieldNamesToStringStyleTest
Running org.apache.commons.lang3.builder.ShortPrefixToStringStyleTest
Tests run: 8, Failures: 0, Errors: 0, Skipped: 0, Time elapsed: 0.002 sec - in org.apache.commons.lang3.builder.ShortPrefixToStringStyleTest
Running org.apache.commons.lang3.builder.DiffResultTest
Tests run: 9, Failures: 0, Errors: 0, Skipped: 0, Time elapsed: 0.006 sec - in org.apache.commons.lang3.builder.DiffResultTest
Running org.apache.commons.lang3.builder.CompareToBuilderTest
Tests run: 48, Failures: 0, Errors: 0, Skipped: 0, Time elapsed: 0.019 sec - in org.apache.commons.lang3.builder.CompareToBuilderTest
Running org.apache.commons.lang3.builder.MultilineRecursiveToStringStyleTest
Tests run: 10, Failures: 0, Errors: 0, Skipped: 0, Time elapsed: 0.007 sec - in org.apache.commons.lang3.builder.MultilineRecursiveToStringStyleTest
Running org.apache.commons.lang3.builder.RecursiveToStringStyleTest
Tests run: 8, Failures: 0, Errors: 0, Skipped: 0, Time elapsed: 0.014 sec - in org.apache.commons.lang3.builder.RecursiveToStringStyleTest
Running org.apache.commons.lang3.builder.DefaultToStringStyleTest
Tests run: 8, Failures: 0, Errors: 0, Skipped: 0, Time elapsed: 0.001 sec - in org.apache.commons.lang3.builder.DefaultToStringStyleTest
Running org.apache.commons.lang3.builder.ReflectionToStringBuilderExcludeTest
Tests run: 11, Failures: 0, Errors: 0, Skipped: 0, Time elapsed: 0 sec - in org.apache.commons.lang3.builder.ReflectionToStringBuilderExcludeTest
Running org.apache.commons.lang3.builder.StandardToStringStyleTest
Tests run: 8, Failures: 0, Errors: 0, Skipped: 0, Time elapsed: 0.001 sec - in org.apache.commons.lang3.builder.StandardToStringStyleTest
Running org.apache.commons.lang3.builder.ToStringStyleTest
Tests run: 12, Failures: 0, Errors: 0, Skipped: 0, Time elapsed: 0.003 sec - in org.apache.commons.lang3.builder.ToStringStyleTest
Running org.apache.commons.lang3.builder.DiffTest
Tests run: 4, Failures: 0, Errors: 0, Skipped: 0, Time elapsed: 0 sec - in org.apache.commons.lang3.builder.DiffTest
Running org.apache.commons.lang3.builder.SimpleToStringStyleTest
Tests run: 8, Failures: 0, Errors: 0, Skipped: 0, Time elapsed: 0.002 sec - in org.apache.commons.lang3.builder.SimpleToStringStyleTest
Running org.apache.commons.lang3.builder.MultiLineToStringStyleTest
Tests run: 8, Failures: 0, Errors: 0, Skipped: 0, Time elapsed: 0.003 sec - in org.apache.commons.lang3.builder.MultiLineToStringStyleTest
Running org.apache.commons.lang3.builder.ToStringStyleConcurrencyTest
Tests run: 3, Failures: 0, Errors: 0, Skipped: 0, Time elapsed: 4.906 sec - in org.apache.commons.lang3.builder.ToStringStyleConcurrencyTest
Running org.apache.commons.lang3.builder.ReflectionToStringBuilderMutateInspectConcurrencyTest
Tests run: 1, Failures: 0, Errors: 0, Skipped: 1, Time elapsed: 0 sec - in org.apache.commons.lang3.builder.ReflectionToStringBuilderMutateInspectConcurrencyTest
Running org.apache.commons.lang3.builder.ToStringBuilderTest
Tests run: 94, Failures: 68, Errors: 9, Skipped: 1, Time elapsed: 0.092 sec <<< FAILURE! - in org.apache.commons.lang3.builder.ToStringBuilderTest
testReflectionArrayCycle(org.apache.commons.lang3.builder.ToStringBuilderTest)  Time elapsed: 0.005 sec  <<< FAILURE!
org.junit.ComparisonFailure: expected:<...g.Object;@6d392fa5[{[[Ljava.lang.Object;@6d392fa5]}]> but was:<...g.Object;@6d392fa5[{[<null>]}]>
	at org.junit.Assert.assertEquals(Assert.java:115)
	at org.junit.Assert.assertEquals(Assert.java:144)
	at org.apache.commons.lang3.builder.ToStringBuilderTest.testReflectionArrayCycle(ToStringBuilderTest.java:402)

testReflectionLongArrayArray(org.apache.commons.lang3.builder.ToStringBuilderTest)  Time elapsed: 0.002 sec  <<< ERROR!
java.lang.NullPointerException: null
	at org.apache.commons.lang3.builder.ToStringStyle.appendInternal(ToStringStyle.java:105)
	at org.apache.commons.lang3.builder.ToStringStyle.reflectionAppendArrayDetail(ToStringStyle.java:169)
	at org.apache.commons.lang3.builder.ReflectionToStringBuilder.reflectionAppendArray(ReflectionToStringBuilder.java:610)
	at org.apache.commons.lang3.builder.ReflectionToStringBuilder.appendFieldsIn(ReflectionToStringBuilder.java:515)
	at org.apache.commons.lang3.builder.ReflectionToStringBuilder.toString(ReflectionToStringBuilder.java:688)
	at org.apache.commons.lang3.builder.ReflectionToStringBuilder.toString(ReflectionToStringBuilder.java:287)
	at org.apache.commons.lang3.builder.ReflectionToStringBuilder.toString(ReflectionToStringBuilder.java:118)
	at org.apache.commons.lang3.builder.ToStringBuilder.reflectionToString(ToStringBuilder.java:152)
	at org.apache.commons.lang3.builder.ToStringBuilderTest.testReflectionLongArrayArray(ToStringBuilderTest.java:253)

testReflectionLongArrayArray(org.apache.commons.lang3.builder.ToStringBuilderTest)  Time elapsed: 0.003 sec  <<< FAILURE!
java.lang.AssertionError: Expected null, actual: {[[J@d385acb=null} expected null, but was:<{[[J@d385acb=null}>
	at org.junit.Assert.fail(Assert.java:88)
	at org.junit.Assert.failNotNull(Assert.java:755)
	at org.junit.Assert.assertNull(Assert.java:737)
	at org.apache.commons.lang3.builder.ToStringBuilderTest.validateNullToStringStyleRegistry(ToStringBuilderTest.java:595)
	at org.apache.commons.lang3.builder.ToStringBuilderTest.after(ToStringBuilderTest.java:48)

testBlank(org.apache.commons.lang3.builder.ToStringBuilderTest)  Time elapsed: 0 sec  <<< FAILURE!
java.lang.AssertionError: Expected null, actual: {[[J@d385acb=null} expected null, but was:<{[[J@d385acb=null}>
	at org.junit.Assert.fail(Assert.java:88)
	at org.junit.Assert.failNotNull(Assert.java:755)
	at org.junit.Assert.assertNull(Assert.java:737)
	at org.apache.commons.lang3.builder.ToStringBuilderTest.validateNullToStringStyleRegistry(ToStringBuilderTest.java:595)
	at org.apache.commons.lang3.builder.ToStringBuilderTest.after(ToStringBuilderTest.java:48)

testFloat(org.apache.commons.lang3.builder.ToStringBuilderTest)  Time elapsed: 0.001 sec  <<< FAILURE!
java.lang.AssertionError: Expected null, actual: {[[J@d385acb=null} expected null, but was:<{[[J@d385acb=null}>
	at org.junit.Assert.fail(Assert.java:88)
	at org.junit.Assert.failNotNull(Assert.java:755)
	at org.junit.Assert.assertNull(Assert.java:737)
	at org.apache.commons.lang3.builder.ToStringBuilderTest.validateNullToStringStyleRegistry(ToStringBuilderTest.java:595)
	at org.apache.commons.lang3.builder.ToStringBuilderTest.after(ToStringBuilderTest.java:48)

testShort(org.apache.commons.lang3.builder.ToStringBuilderTest)  Time elapsed: 0 sec  <<< FAILURE!
java.lang.AssertionError: Expected null, actual: {[[J@d385acb=null} expected null, but was:<{[[J@d385acb=null}>
	at org.junit.Assert.fail(Assert.java:88)
	at org.junit.Assert.failNotNull(Assert.java:755)
	at org.junit.Assert.assertNull(Assert.java:737)
	at org.apache.commons.lang3.builder.ToStringBuilderTest.validateNullToStringStyleRegistry(ToStringBuilderTest.java:595)
	at org.apache.commons.lang3.builder.ToStringBuilderTest.after(ToStringBuilderTest.java:48)

testReflectionArrayArrayCycle(org.apache.commons.lang3.builder.ToStringBuilderTest)  Time elapsed: 0.001 sec  <<< FAILURE!
org.junit.ComparisonFailure: expected:<...g.Object;@5878ea78[{[{[[Ljava.lang.Object;@5878ea78,[[Ljava.lang.Object;@5878ea78},{[[Ljava.lang.Object;@5878ea78,[[Ljava.lang.Object;@5878ea78}]}]> but was:<...g.Object;@5878ea78[{[<null>,<null>]}]>
	at org.junit.Assert.assertEquals(Assert.java:115)
	at org.junit.Assert.assertEquals(Assert.java:144)
	at org.apache.commons.lang3.builder.ToStringBuilderTest.testReflectionArrayArrayCycle(ToStringBuilderTest.java:432)

testReflectionArrayArrayCycle(org.apache.commons.lang3.builder.ToStringBuilderTest)  Time elapsed: 0.001 sec  <<< FAILURE!
java.lang.AssertionError: Expected null, actual: {[[J@d385acb=null} expected null, but was:<{[[J@d385acb=null}>
	at org.junit.Assert.fail(Assert.java:88)
	at org.junit.Assert.failNotNull(Assert.java:755)
	at org.junit.Assert.assertNull(Assert.java:737)
	at org.apache.commons.lang3.builder.ToStringBuilderTest.validateNullToStringStyleRegistry(ToStringBuilderTest.java:595)
	at org.apache.commons.lang3.builder.ToStringBuilderTest.after(ToStringBuilderTest.java:48)

testByte(org.apache.commons.lang3.builder.ToStringBuilderTest)  Time elapsed: 0 sec  <<< FAILURE!
java.lang.AssertionError: Expected null, actual: {[[J@d385acb=null} expected null, but was:<{[[J@d385acb=null}>
	at org.junit.Assert.fail(Assert.java:88)
	at org.junit.Assert.failNotNull(Assert.java:755)
	at org.junit.Assert.assertNull(Assert.java:737)
	at org.apache.commons.lang3.builder.ToStringBuilderTest.validateNullToStringStyleRegistry(ToStringBuilderTest.java:595)
	at org.apache.commons.lang3.builder.ToStringBuilderTest.after(ToStringBuilderTest.java:48)

testChar(org.apache.commons.lang3.builder.ToStringBuilderTest)  Time elapsed: 0.001 sec  <<< FAILURE!
java.lang.AssertionError: Expected null, actual: {[[J@d385acb=null} expected null, but was:<{[[J@d385acb=null}>
	at org.junit.Assert.fail(Assert.java:88)
	at org.junit.Assert.failNotNull(Assert.java:755)
	at org.junit.Assert.assertNull(Assert.java:737)
	at org.apache.commons.lang3.builder.ToStringBuilderTest.validateNullToStringStyleRegistry(ToStringBuilderTest.java:595)
	at org.apache.commons.lang3.builder.ToStringBuilderTest.after(ToStringBuilderTest.java:48)

testLong(org.apache.commons.lang3.builder.ToStringBuilderTest)  Time elapsed: 0 sec  <<< FAILURE!
java.lang.AssertionError: Expected null, actual: {[[J@d385acb=null} expected null, but was:<{[[J@d385acb=null}>
	at org.junit.Assert.fail(Assert.java:88)
	at org.junit.Assert.failNotNull(Assert.java:755)
	at org.junit.Assert.assertNull(Assert.java:737)
	at org.apache.commons.lang3.builder.ToStringBuilderTest.validateNullToStringStyleRegistry(ToStringBuilderTest.java:595)
	at org.apache.commons.lang3.builder.ToStringBuilderTest.after(ToStringBuilderTest.java:48)

testReflectionFloatArray(org.apache.commons.lang3.builder.ToStringBuilderTest)  Time elapsed: 0.001 sec  <<< FAILURE!
org.junit.ComparisonFailure: expected:<[F@6a6999a8[{[1.0,2.9876,-3.00001,4.3]}]> but was:<[F@6a6999a8[{[<null>,<null>,<null>,<null>]}]>
	at org.junit.Assert.assertEquals(Assert.java:115)
	at org.junit.Assert.assertEquals(Assert.java:144)
	at org.apache.commons.lang3.builder.ToStringBuilderTest.testReflectionFloatArray(ToStringBuilderTest.java:223)

testReflectionFloatArray(org.apache.commons.lang3.builder.ToStringBuilderTest)  Time elapsed: 0.001 sec  <<< FAILURE!
java.lang.AssertionError: Expected null, actual: {[[J@d385acb=null} expected null, but was:<{[[J@d385acb=null}>
	at org.junit.Assert.fail(Assert.java:88)
	at org.junit.Assert.failNotNull(Assert.java:755)
	at org.junit.Assert.assertNull(Assert.java:737)
	at org.apache.commons.lang3.builder.ToStringBuilderTest.validateNullToStringStyleRegistry(ToStringBuilderTest.java:595)
	at org.apache.commons.lang3.builder.ToStringBuilderTest.after(ToStringBuilderTest.java:48)

testLongArrayArray(org.apache.commons.lang3.builder.ToStringBuilderTest)  Time elapsed: 0.001 sec  <<< FAILURE!
java.lang.AssertionError: Expected null, actual: {[[J@d385acb=null} expected null, but was:<{[[J@d385acb=null}>
	at org.junit.Assert.fail(Assert.java:88)
	at org.junit.Assert.failNotNull(Assert.java:755)
	at org.junit.Assert.assertNull(Assert.java:737)
	at org.apache.commons.lang3.builder.ToStringBuilderTest.validateNullToStringStyleRegistry(ToStringBuilderTest.java:595)
	at org.apache.commons.lang3.builder.ToStringBuilderTest.after(ToStringBuilderTest.java:48)

test_setUpToClass_invalid(org.apache.commons.lang3.builder.ToStringBuilderTest)  Time elapsed: 0 sec  <<< FAILURE!
java.lang.AssertionError: Expected null, actual: {[[J@d385acb=null} expected null, but was:<{[[J@d385acb=null}>
	at org.junit.Assert.fail(Assert.java:88)
	at org.junit.Assert.failNotNull(Assert.java:755)
	at org.junit.Assert.assertNull(Assert.java:737)
	at org.apache.commons.lang3.builder.ToStringBuilderTest.validateNullToStringStyleRegistry(ToStringBuilderTest.java:595)
	at org.apache.commons.lang3.builder.ToStringBuilderTest.after(ToStringBuilderTest.java:48)

testBoolean(org.apache.commons.lang3.builder.ToStringBuilderTest)  Time elapsed: 0.001 sec  <<< FAILURE!
java.lang.AssertionError: Expected null, actual: {[[J@d385acb=null} expected null, but was:<{[[J@d385acb=null}>
	at org.junit.Assert.fail(Assert.java:88)
	at org.junit.Assert.failNotNull(Assert.java:755)
	at org.junit.Assert.assertNull(Assert.java:737)
	at org.apache.commons.lang3.builder.ToStringBuilderTest.validateNullToStringStyleRegistry(ToStringBuilderTest.java:595)
	at org.apache.commons.lang3.builder.ToStringBuilderTest.after(ToStringBuilderTest.java:48)

testReflectionDoubleArrayArray(org.apache.commons.lang3.builder.ToStringBuilderTest)  Time elapsed: 0.001 sec  <<< ERROR!
java.lang.NullPointerException: null
	at org.apache.commons.lang3.builder.ToStringStyle.appendInternal(ToStringStyle.java:105)
	at org.apache.commons.lang3.builder.ToStringStyle.reflectionAppendArrayDetail(ToStringStyle.java:169)
	at org.apache.commons.lang3.builder.ReflectionToStringBuilder.reflectionAppendArray(ReflectionToStringBuilder.java:610)
	at org.apache.commons.lang3.builder.ReflectionToStringBuilder.appendFieldsIn(ReflectionToStringBuilder.java:515)
	at org.apache.commons.lang3.builder.ReflectionToStringBuilder.toString(ReflectionToStringBuilder.java:688)
	at org.apache.commons.lang3.builder.ReflectionToStringBuilder.toString(ReflectionToStringBuilder.java:287)
	at org.apache.commons.lang3.builder.ReflectionToStringBuilder.toString(ReflectionToStringBuilder.java:118)
	at org.apache.commons.lang3.builder.ToStringBuilder.reflectionToString(ToStringBuilder.java:152)
	at org.apache.commons.lang3.builder.ToStringBuilderTest.testReflectionDoubleArrayArray(ToStringBuilderTest.java:298)

testReflectionDoubleArrayArray(org.apache.commons.lang3.builder.ToStringBuilderTest)  Time elapsed: 0.001 sec  <<< FAILURE!
java.lang.AssertionError: Expected null, actual: {[[J@d385acb=null, [[D@4d1d72a0=null} expected null, but was:<{[[J@d385acb=null, [[D@4d1d72a0=null}>
	at org.junit.Assert.fail(Assert.java:88)
	at org.junit.Assert.failNotNull(Assert.java:755)
	at org.junit.Assert.assertNull(Assert.java:737)
	at org.apache.commons.lang3.builder.ToStringBuilderTest.validateNullToStringStyleRegistry(ToStringBuilderTest.java:595)
	at org.apache.commons.lang3.builder.ToStringBuilderTest.after(ToStringBuilderTest.java:48)

testReflectionBooleanArray(org.apache.commons.lang3.builder.ToStringBuilderTest)  Time elapsed: 0.003 sec  <<< FAILURE!
org.junit.ComparisonFailure: expected:<[Z@48508ded[{[true,false,false]}]> but was:<[Z@48508ded[{[<null>,<null>,<null>]}]>
	at org.junit.Assert.assertEquals(Assert.java:115)
	at org.junit.Assert.assertEquals(Assert.java:144)
	at org.apache.commons.lang3.builder.ToStringBuilderTest.testReflectionBooleanArray(ToStringBuilderTest.java:232)

testReflectionBooleanArray(org.apache.commons.lang3.builder.ToStringBuilderTest)  Time elapsed: 0.003 sec  <<< FAILURE!
java.lang.AssertionError: Expected null, actual: {[[J@d385acb=null, [[D@4d1d72a0=null} expected null, but was:<{[[J@d385acb=null, [[D@4d1d72a0=null}>
	at org.junit.Assert.fail(Assert.java:88)
	at org.junit.Assert.failNotNull(Assert.java:755)
	at org.junit.Assert.assertNull(Assert.java:737)
	at org.apache.commons.lang3.builder.ToStringBuilderTest.validateNullToStringStyleRegistry(ToStringBuilderTest.java:595)
	at org.apache.commons.lang3.builder.ToStringBuilderTest.after(ToStringBuilderTest.java:48)

testReflectionInteger(org.apache.commons.lang3.builder.ToStringBuilderTest)  Time elapsed: 0 sec  <<< FAILURE!
java.lang.AssertionError: Expected null, actual: {[[J@d385acb=null, [[D@4d1d72a0=null} expected null, but was:<{[[J@d385acb=null, [[D@4d1d72a0=null}>
	at org.junit.Assert.fail(Assert.java:88)
	at org.junit.Assert.failNotNull(Assert.java:755)
	at org.junit.Assert.assertNull(Assert.java:737)
	at org.apache.commons.lang3.builder.ToStringBuilderTest.validateNullToStringStyleRegistry(ToStringBuilderTest.java:595)
	at org.apache.commons.lang3.builder.ToStringBuilderTest.after(ToStringBuilderTest.java:48)

testBooleanArray(org.apache.commons.lang3.builder.ToStringBuilderTest)  Time elapsed: 0 sec  <<< FAILURE!
java.lang.AssertionError: Expected null, actual: {[[J@d385acb=null, [[D@4d1d72a0=null} expected null, but was:<{[[J@d385acb=null, [[D@4d1d72a0=null}>
	at org.junit.Assert.fail(Assert.java:88)
	at org.junit.Assert.failNotNull(Assert.java:755)
	at org.junit.Assert.assertNull(Assert.java:737)
	at org.apache.commons.lang3.builder.ToStringBuilderTest.validateNullToStringStyleRegistry(ToStringBuilderTest.java:595)
	at org.apache.commons.lang3.builder.ToStringBuilderTest.after(ToStringBuilderTest.java:48)

testFloatArrayArray(org.apache.commons.lang3.builder.ToStringBuilderTest)  Time elapsed: 0 sec  <<< FAILURE!
java.lang.AssertionError: Expected null, actual: {[[J@d385acb=null, [[D@4d1d72a0=null} expected null, but was:<{[[J@d385acb=null, [[D@4d1d72a0=null}>
	at org.junit.Assert.fail(Assert.java:88)
	at org.junit.Assert.failNotNull(Assert.java:755)
	at org.junit.Assert.assertNull(Assert.java:737)
	at org.apache.commons.lang3.builder.ToStringBuilderTest.validateNullToStringStyleRegistry(ToStringBuilderTest.java:595)
	at org.apache.commons.lang3.builder.ToStringBuilderTest.after(ToStringBuilderTest.java:48)

testReflectionyteArray(org.apache.commons.lang3.builder.ToStringBuilderTest)  Time elapsed: 0 sec  <<< FAILURE!
org.junit.ComparisonFailure: expected:<[B@13405f43[{[1,2,-3,4]}]> but was:<[B@13405f43[{[<null>,<null>,<null>,<null>]}]>
	at org.junit.Assert.assertEquals(Assert.java:115)
	at org.junit.Assert.assertEquals(Assert.java:144)
	at org.apache.commons.lang3.builder.ToStringBuilderTest.testReflectionyteArray(ToStringBuilderTest.java:196)

testReflectionyteArray(org.apache.commons.lang3.builder.ToStringBuilderTest)  Time elapsed: 0 sec  <<< FAILURE!
java.lang.AssertionError: Expected null, actual: {[[J@d385acb=null, [[D@4d1d72a0=null} expected null, but was:<{[[J@d385acb=null, [[D@4d1d72a0=null}>
	at org.junit.Assert.fail(Assert.java:88)
	at org.junit.Assert.failNotNull(Assert.java:755)
	at org.junit.Assert.assertNull(Assert.java:737)
	at org.apache.commons.lang3.builder.ToStringBuilderTest.validateNullToStringStyleRegistry(ToStringBuilderTest.java:595)
	at org.apache.commons.lang3.builder.ToStringBuilderTest.after(ToStringBuilderTest.java:48)

testReflectionDoubleArray(org.apache.commons.lang3.builder.ToStringBuilderTest)  Time elapsed: 0.005 sec  <<< FAILURE!
org.junit.ComparisonFailure: expected:<[D@672e3194[{[1.0,2.9876,-3.00001,4.3]}]> but was:<[D@672e3194[{[<null>,<null>,<null>,<null>]}]>
	at org.junit.Assert.assertEquals(Assert.java:115)
	at org.junit.Assert.assertEquals(Assert.java:144)
	at org.apache.commons.lang3.builder.ToStringBuilderTest.testReflectionDoubleArray(ToStringBuilderTest.java:214)

testReflectionDoubleArray(org.apache.commons.lang3.builder.ToStringBuilderTest)  Time elapsed: 0.005 sec  <<< FAILURE!
java.lang.AssertionError: Expected null, actual: {[[J@d385acb=null, [[D@4d1d72a0=null} expected null, but was:<{[[J@d385acb=null, [[D@4d1d72a0=null}>
	at org.junit.Assert.fail(Assert.java:88)
	at org.junit.Assert.failNotNull(Assert.java:755)
	at org.junit.Assert.assertNull(Assert.java:737)
	at org.apache.commons.lang3.builder.ToStringBuilderTest.validateNullToStringStyleRegistry(ToStringBuilderTest.java:595)
	at org.apache.commons.lang3.builder.ToStringBuilderTest.after(ToStringBuilderTest.java:48)

testReflectionIntArrayArray(org.apache.commons.lang3.builder.ToStringBuilderTest)  Time elapsed: 0 sec  <<< ERROR!
java.lang.NullPointerException: null
	at org.apache.commons.lang3.builder.ToStringStyle.appendInternal(ToStringStyle.java:105)
	at org.apache.commons.lang3.builder.ToStringStyle.reflectionAppendArrayDetail(ToStringStyle.java:169)
	at org.apache.commons.lang3.builder.ReflectionToStringBuilder.reflectionAppendArray(ReflectionToStringBuilder.java:610)
	at org.apache.commons.lang3.builder.ReflectionToStringBuilder.appendFieldsIn(ReflectionToStringBuilder.java:515)
	at org.apache.commons.lang3.builder.ReflectionToStringBuilder.toString(ReflectionToStringBuilder.java:688)
	at org.apache.commons.lang3.builder.ReflectionToStringBuilder.toString(ReflectionToStringBuilder.java:287)
	at org.apache.commons.lang3.builder.ReflectionToStringBuilder.toString(ReflectionToStringBuilder.java:118)
	at org.apache.commons.lang3.builder.ToStringBuilder.reflectionToString(ToStringBuilder.java:152)
	at org.apache.commons.lang3.builder.ToStringBuilderTest.testReflectionIntArrayArray(ToStringBuilderTest.java:262)

testReflectionIntArrayArray(org.apache.commons.lang3.builder.ToStringBuilderTest)  Time elapsed: 0 sec  <<< FAILURE!
java.lang.AssertionError: Expected null, actual: {[[J@d385acb=null, [[D@4d1d72a0=null, [[I@9b92078=null} expected null, but was:<{[[J@d385acb=null, [[D@4d1d72a0=null, [[I@9b92078=null}>
	at org.junit.Assert.fail(Assert.java:88)
	at org.junit.Assert.failNotNull(Assert.java:755)
	at org.junit.Assert.assertNull(Assert.java:737)
	at org.apache.commons.lang3.builder.ToStringBuilderTest.validateNullToStringStyleRegistry(ToStringBuilderTest.java:595)
	at org.apache.commons.lang3.builder.ToStringBuilderTest.after(ToStringBuilderTest.java:48)

testSimpleReflectionStatics(org.apache.commons.lang3.builder.ToStringBuilderTest)  Time elapsed: 0 sec  <<< FAILURE!
java.lang.AssertionError: Expected null, actual: {[[J@d385acb=null, [[D@4d1d72a0=null, [[I@9b92078=null} expected null, but was:<{[[J@d385acb=null, [[D@4d1d72a0=null, [[I@9b92078=null}>
	at org.junit.Assert.fail(Assert.java:88)
	at org.junit.Assert.failNotNull(Assert.java:755)
	at org.junit.Assert.assertNull(Assert.java:737)
	at org.apache.commons.lang3.builder.ToStringBuilderTest.validateNullToStringStyleRegistry(ToStringBuilderTest.java:595)
	at org.apache.commons.lang3.builder.ToStringBuilderTest.after(ToStringBuilderTest.java:48)

testReflectionStatics(org.apache.commons.lang3.builder.ToStringBuilderTest)  Time elapsed: 0 sec  <<< FAILURE!
java.lang.AssertionError: Expected null, actual: {[[J@d385acb=null, [[D@4d1d72a0=null, [[I@9b92078=null} expected null, but was:<{[[J@d385acb=null, [[D@4d1d72a0=null, [[I@9b92078=null}>
	at org.junit.Assert.fail(Assert.java:88)
	at org.junit.Assert.failNotNull(Assert.java:755)
	at org.junit.Assert.assertNull(Assert.java:737)
	at org.apache.commons.lang3.builder.ToStringBuilderTest.validateNullToStringStyleRegistry(ToStringBuilderTest.java:595)
	at org.apache.commons.lang3.builder.ToStringBuilderTest.after(ToStringBuilderTest.java:48)

testReflectionLongArray(org.apache.commons.lang3.builder.ToStringBuilderTest)  Time elapsed: 0 sec  <<< FAILURE!
org.junit.ComparisonFailure: expected:<[J@30a2268a[{[1,2,-3,4]}]> but was:<[J@30a2268a[{[<null>,<null>,<null>,<null>]}]>
	at org.junit.Assert.assertEquals(Assert.java:115)
	at org.junit.Assert.assertEquals(Assert.java:144)
	at org.apache.commons.lang3.builder.ToStringBuilderTest.testReflectionLongArray(ToStringBuilderTest.java:169)

testReflectionLongArray(org.apache.commons.lang3.builder.ToStringBuilderTest)  Time elapsed: 0.001 sec  <<< FAILURE!
java.lang.AssertionError: Expected null, actual: {[[J@d385acb=null, [[D@4d1d72a0=null, [[I@9b92078=null} expected null, but was:<{[[J@d385acb=null, [[D@4d1d72a0=null, [[I@9b92078=null}>
	at org.junit.Assert.fail(Assert.java:88)
	at org.junit.Assert.failNotNull(Assert.java:755)
	at org.junit.Assert.assertNull(Assert.java:737)
	at org.apache.commons.lang3.builder.ToStringBuilderTest.validateNullToStringStyleRegistry(ToStringBuilderTest.java:595)
	at org.apache.commons.lang3.builder.ToStringBuilderTest.after(ToStringBuilderTest.java:48)

testReflectionhortArrayArray(org.apache.commons.lang3.builder.ToStringBuilderTest)  Time elapsed: 0 sec  <<< ERROR!
java.lang.NullPointerException: null
	at org.apache.commons.lang3.builder.ToStringStyle.appendInternal(ToStringStyle.java:105)
	at org.apache.commons.lang3.builder.ToStringStyle.reflectionAppendArrayDetail(ToStringStyle.java:169)
	at org.apache.commons.lang3.builder.ReflectionToStringBuilder.reflectionAppendArray(ReflectionToStringBuilder.java:610)
	at org.apache.commons.lang3.builder.ReflectionToStringBuilder.appendFieldsIn(ReflectionToStringBuilder.java:515)
	at org.apache.commons.lang3.builder.ReflectionToStringBuilder.toString(ReflectionToStringBuilder.java:688)
	at org.apache.commons.lang3.builder.ReflectionToStringBuilder.toString(ReflectionToStringBuilder.java:287)
	at org.apache.commons.lang3.builder.ReflectionToStringBuilder.toString(ReflectionToStringBuilder.java:118)
	at org.apache.commons.lang3.builder.ToStringBuilder.reflectionToString(ToStringBuilder.java:152)
	at org.apache.commons.lang3.builder.ToStringBuilderTest.testReflectionhortArrayArray(ToStringBuilderTest.java:271)

testReflectionhortArrayArray(org.apache.commons.lang3.builder.ToStringBuilderTest)  Time elapsed: 0.001 sec  <<< FAILURE!
java.lang.AssertionError: Expected null, actual: {[[J@d385acb=null, [[S@659046f7=null, [[D@4d1d72a0=null, [[I@9b92078=null} expected null, but was:<{[[J@d385acb=null, [[S@659046f7=null, [[D@4d1d72a0=null, [[I@9b92078=null}>
	at org.junit.Assert.fail(Assert.java:88)
	at org.junit.Assert.failNotNull(Assert.java:755)
	at org.junit.Assert.assertNull(Assert.java:737)
	at org.apache.commons.lang3.builder.ToStringBuilderTest.validateNullToStringStyleRegistry(ToStringBuilderTest.java:595)
	at org.apache.commons.lang3.builder.ToStringBuilderTest.after(ToStringBuilderTest.java:48)

testConstructorEx1(org.apache.commons.lang3.builder.ToStringBuilderTest)  Time elapsed: 0 sec  <<< FAILURE!
java.lang.AssertionError: Expected null, actual: {[[J@d385acb=null, [[S@659046f7=null, [[D@4d1d72a0=null, [[I@9b92078=null} expected null, but was:<{[[J@d385acb=null, [[S@659046f7=null, [[D@4d1d72a0=null, [[I@9b92078=null}>
	at org.junit.Assert.fail(Assert.java:88)
	at org.junit.Assert.failNotNull(Assert.java:755)
	at org.junit.Assert.assertNull(Assert.java:737)
	at org.apache.commons.lang3.builder.ToStringBuilderTest.validateNullToStringStyleRegistry(ToStringBuilderTest.java:595)
	at org.apache.commons.lang3.builder.ToStringBuilderTest.after(ToStringBuilderTest.java:48)

testConstructorEx2(org.apache.commons.lang3.builder.ToStringBuilderTest)  Time elapsed: 0.001 sec  <<< FAILURE!
java.lang.AssertionError: Expected null, actual: {[[J@d385acb=null, [[S@659046f7=null, [[D@4d1d72a0=null, [[I@9b92078=null} expected null, but was:<{[[J@d385acb=null, [[S@659046f7=null, [[D@4d1d72a0=null, [[I@9b92078=null}>
	at org.junit.Assert.fail(Assert.java:88)
	at org.junit.Assert.failNotNull(Assert.java:755)
	at org.junit.Assert.assertNull(Assert.java:737)
	at org.apache.commons.lang3.builder.ToStringBuilderTest.validateNullToStringStyleRegistry(ToStringBuilderTest.java:595)
	at org.apache.commons.lang3.builder.ToStringBuilderTest.after(ToStringBuilderTest.java:48)

testConstructorEx3(org.apache.commons.lang3.builder.ToStringBuilderTest)  Time elapsed: 0 sec  <<< FAILURE!
java.lang.AssertionError: Expected null, actual: {[[J@d385acb=null, [[S@659046f7=null, [[D@4d1d72a0=null, [[I@9b92078=null} expected null, but was:<{[[J@d385acb=null, [[S@659046f7=null, [[D@4d1d72a0=null, [[I@9b92078=null}>
	at org.junit.Assert.fail(Assert.java:88)
	at org.junit.Assert.failNotNull(Assert.java:755)
	at org.junit.Assert.assertNull(Assert.java:737)
	at org.apache.commons.lang3.builder.ToStringBuilderTest.validateNullToStringStyleRegistry(ToStringBuilderTest.java:595)
	at org.apache.commons.lang3.builder.ToStringBuilderTest.after(ToStringBuilderTest.java:48)

testReflectionObjectArray(org.apache.commons.lang3.builder.ToStringBuilderTest)  Time elapsed: 0.001 sec  <<< ERROR!
java.lang.NullPointerException: null
	at org.apache.commons.lang3.builder.ToStringStyle.appendInternal(ToStringStyle.java:105)
	at org.apache.commons.lang3.builder.ToStringStyle.reflectionAppendArrayDetail(ToStringStyle.java:169)
	at org.apache.commons.lang3.builder.ReflectionToStringBuilder.reflectionAppendArray(ReflectionToStringBuilder.java:610)
	at org.apache.commons.lang3.builder.ReflectionToStringBuilder.appendFieldsIn(ReflectionToStringBuilder.java:515)
	at org.apache.commons.lang3.builder.ReflectionToStringBuilder.toString(ReflectionToStringBuilder.java:688)
	at org.apache.commons.lang3.builder.ReflectionToStringBuilder.toString(ReflectionToStringBuilder.java:287)
	at org.apache.commons.lang3.builder.ReflectionToStringBuilder.toString(ReflectionToStringBuilder.java:118)
	at org.apache.commons.lang3.builder.ToStringBuilder.reflectionToString(ToStringBuilder.java:152)
	at org.apache.commons.lang3.builder.ToStringBuilderTest.testReflectionObjectArray(ToStringBuilderTest.java:160)

testReflectionObjectArray(org.apache.commons.lang3.builder.ToStringBuilderTest)  Time elapsed: 0.001 sec  <<< FAILURE!
java.lang.AssertionError: Expected null, actual: {[Ljava.lang.Object;@63233638=null, [[J@d385acb=null, [[S@659046f7=null, [[D@4d1d72a0=null, [[I@9b92078=null} expected null, but was:<{[Ljava.lang.Object;@63233638=null, [[J@d385acb=null, [[S@659046f7=null, [[D@4d1d72a0=null, [[I@9b92078=null}>
	at org.junit.Assert.fail(Assert.java:88)
	at org.junit.Assert.failNotNull(Assert.java:755)
	at org.junit.Assert.assertNull(Assert.java:737)
	at org.apache.commons.lang3.builder.ToStringBuilderTest.validateNullToStringStyleRegistry(ToStringBuilderTest.java:595)
	at org.apache.commons.lang3.builder.ToStringBuilderTest.after(ToStringBuilderTest.java:48)

testReflectionObjectCycle(org.apache.commons.lang3.builder.ToStringBuilderTest)  Time elapsed: 0.002 sec  <<< FAILURE!
java.lang.AssertionError: Expected null, actual: {[Ljava.lang.Object;@63233638=null, [[J@d385acb=null, [[S@659046f7=null, [[D@4d1d72a0=null, [[I@9b92078=null} expected null, but was:<{[Ljava.lang.Object;@63233638=null, [[J@d385acb=null, [[S@659046f7=null, [[D@4d1d72a0=null, [[I@9b92078=null}>
	at org.junit.Assert.fail(Assert.java:88)
	at org.junit.Assert.failNotNull(Assert.java:755)
	at org.junit.Assert.assertNull(Assert.java:737)
	at org.apache.commons.lang3.builder.ToStringBuilderTest.validateNullToStringStyleRegistry(ToStringBuilderTest.java:595)
	at org.apache.commons.lang3.builder.ToStringBuilderTest.after(ToStringBuilderTest.java:48)

testReflectionBooleanArrayArray(org.apache.commons.lang3.builder.ToStringBuilderTest)  Time elapsed: 0 sec  <<< ERROR!
java.lang.NullPointerException: null
	at org.apache.commons.lang3.builder.ToStringStyle.appendInternal(ToStringStyle.java:105)
	at org.apache.commons.lang3.builder.ToStringStyle.reflectionAppendArrayDetail(ToStringStyle.java:169)
	at org.apache.commons.lang3.builder.ReflectionToStringBuilder.reflectionAppendArray(ReflectionToStringBuilder.java:610)
	at org.apache.commons.lang3.builder.ReflectionToStringBuilder.appendFieldsIn(ReflectionToStringBuilder.java:515)
	at org.apache.commons.lang3.builder.ReflectionToStringBuilder.toString(ReflectionToStringBuilder.java:688)
	at org.apache.commons.lang3.builder.ReflectionToStringBuilder.toString(ReflectionToStringBuilder.java:287)
	at org.apache.commons.lang3.builder.ReflectionToStringBuilder.toString(ReflectionToStringBuilder.java:118)
	at org.apache.commons.lang3.builder.ToStringBuilder.reflectionToString(ToStringBuilder.java:152)
	at org.apache.commons.lang3.builder.ToStringBuilderTest.testReflectionBooleanArrayArray(ToStringBuilderTest.java:307)

testReflectionBooleanArrayArray(org.apache.commons.lang3.builder.ToStringBuilderTest)  Time elapsed: 0.001 sec  <<< FAILURE!
java.lang.AssertionError: Expected null, actual: {[Ljava.lang.Object;@63233638=null, [[Z@792cc6d9=null, [[J@d385acb=null, [[S@659046f7=null, [[D@4d1d72a0=null, [[I@9b92078=null} expected null, but was:<{[Ljava.lang.Object;@63233638=null, [[Z@792cc6d9=null, [[J@d385acb=null, [[S@659046f7=null, [[D@4d1d72a0=null, [[I@9b92078=null}>
	at org.junit.Assert.fail(Assert.java:88)
	at org.junit.Assert.failNotNull(Assert.java:755)
	at org.junit.Assert.assertNull(Assert.java:737)
	at org.apache.commons.lang3.builder.ToStringBuilderTest.validateNullToStringStyleRegistry(ToStringBuilderTest.java:595)
	at org.apache.commons.lang3.builder.ToStringBuilderTest.after(ToStringBuilderTest.java:48)

testLongArray(org.apache.commons.lang3.builder.ToStringBuilderTest)  Time elapsed: 0 sec  <<< FAILURE!
java.lang.AssertionError: Expected null, actual: {[Ljava.lang.Object;@63233638=null, [[Z@792cc6d9=null, [[J@d385acb=null, [[S@659046f7=null, [[D@4d1d72a0=null, [[I@9b92078=null} expected null, but was:<{[Ljava.lang.Object;@63233638=null, [[Z@792cc6d9=null, [[J@d385acb=null, [[S@659046f7=null, [[D@4d1d72a0=null, [[I@9b92078=null}>
	at org.junit.Assert.fail(Assert.java:88)
	at org.junit.Assert.failNotNull(Assert.java:755)
	at org.junit.Assert.assertNull(Assert.java:737)
	at org.apache.commons.lang3.builder.ToStringBuilderTest.validateNullToStringStyleRegistry(ToStringBuilderTest.java:595)
	at org.apache.commons.lang3.builder.ToStringBuilderTest.after(ToStringBuilderTest.java:48)

testSimpleReflectionObjectCycle(org.apache.commons.lang3.builder.ToStringBuilderTest)  Time elapsed: 0.002 sec  <<< FAILURE!
java.lang.AssertionError: Expected null, actual: {[Ljava.lang.Object;@63233638=null, [[Z@792cc6d9=null, [[J@d385acb=null, [[S@659046f7=null, [[D@4d1d72a0=null, [[I@9b92078=null} expected null, but was:<{[Ljava.lang.Object;@63233638=null, [[Z@792cc6d9=null, [[J@d385acb=null, [[S@659046f7=null, [[D@4d1d72a0=null, [[I@9b92078=null}>
	at org.junit.Assert.fail(Assert.java:88)
	at org.junit.Assert.failNotNull(Assert.java:755)
	at org.junit.Assert.assertNull(Assert.java:737)
	at org.apache.commons.lang3.builder.ToStringBuilderTest.validateNullToStringStyleRegistry(ToStringBuilderTest.java:595)
	at org.apache.commons.lang3.builder.ToStringBuilderTest.after(ToStringBuilderTest.java:48)

testShortArray(org.apache.commons.lang3.builder.ToStringBuilderTest)  Time elapsed: 0 sec  <<< FAILURE!
java.lang.AssertionError: Expected null, actual: {[Ljava.lang.Object;@63233638=null, [[Z@792cc6d9=null, [[J@d385acb=null, [[S@659046f7=null, [[D@4d1d72a0=null, [[I@9b92078=null} expected null, but was:<{[Ljava.lang.Object;@63233638=null, [[Z@792cc6d9=null, [[J@d385acb=null, [[S@659046f7=null, [[D@4d1d72a0=null, [[I@9b92078=null}>
	at org.junit.Assert.fail(Assert.java:88)
	at org.junit.Assert.failNotNull(Assert.java:755)
	at org.junit.Assert.assertNull(Assert.java:737)
	at org.apache.commons.lang3.builder.ToStringBuilderTest.validateNullToStringStyleRegistry(ToStringBuilderTest.java:595)
	at org.apache.commons.lang3.builder.ToStringBuilderTest.after(ToStringBuilderTest.java:48)

testIntArrayArray(org.apache.commons.lang3.builder.ToStringBuilderTest)  Time elapsed: 0 sec  <<< FAILURE!
java.lang.AssertionError: Expected null, actual: {[Ljava.lang.Object;@63233638=null, [[Z@792cc6d9=null, [[J@d385acb=null, [[S@659046f7=null, [[D@4d1d72a0=null, [[I@9b92078=null} expected null, but was:<{[Ljava.lang.Object;@63233638=null, [[Z@792cc6d9=null, [[J@d385acb=null, [[S@659046f7=null, [[D@4d1d72a0=null, [[I@9b92078=null}>
	at org.junit.Assert.fail(Assert.java:88)
	at org.junit.Assert.failNotNull(Assert.java:755)
	at org.junit.Assert.assertNull(Assert.java:737)
	at org.apache.commons.lang3.builder.ToStringBuilderTest.validateNullToStringStyleRegistry(ToStringBuilderTest.java:595)
	at org.apache.commons.lang3.builder.ToStringBuilderTest.after(ToStringBuilderTest.java:48)

testInheritedReflectionStatics(org.apache.commons.lang3.builder.ToStringBuilderTest)  Time elapsed: 0 sec  <<< FAILURE!
java.lang.AssertionError: Expected null, actual: {[Ljava.lang.Object;@63233638=null, [[Z@792cc6d9=null, [[J@d385acb=null, [[S@659046f7=null, [[D@4d1d72a0=null, [[I@9b92078=null} expected null, but was:<{[Ljava.lang.Object;@63233638=null, [[Z@792cc6d9=null, [[J@d385acb=null, [[S@659046f7=null, [[D@4d1d72a0=null, [[I@9b92078=null}>
	at org.junit.Assert.fail(Assert.java:88)
	at org.junit.Assert.failNotNull(Assert.java:755)
	at org.junit.Assert.assertNull(Assert.java:737)
	at org.apache.commons.lang3.builder.ToStringBuilderTest.validateNullToStringStyleRegistry(ToStringBuilderTest.java:595)
	at org.apache.commons.lang3.builder.ToStringBuilderTest.after(ToStringBuilderTest.java:48)

testReflectionByteArrayArray(org.apache.commons.lang3.builder.ToStringBuilderTest)  Time elapsed: 0 sec  <<< ERROR!
java.lang.NullPointerException: null
	at org.apache.commons.lang3.builder.ToStringStyle.appendInternal(ToStringStyle.java:105)
	at org.apache.commons.lang3.builder.ToStringStyle.reflectionAppendArrayDetail(ToStringStyle.java:169)
	at org.apache.commons.lang3.builder.ReflectionToStringBuilder.reflectionAppendArray(ReflectionToStringBuilder.java:610)
	at org.apache.commons.lang3.builder.ReflectionToStringBuilder.appendFieldsIn(ReflectionToStringBuilder.java:515)
	at org.apache.commons.lang3.builder.ReflectionToStringBuilder.toString(ReflectionToStringBuilder.java:688)
	at org.apache.commons.lang3.builder.ReflectionToStringBuilder.toString(ReflectionToStringBuilder.java:287)
	at org.apache.commons.lang3.builder.ReflectionToStringBuilder.toString(ReflectionToStringBuilder.java:118)
	at org.apache.commons.lang3.builder.ToStringBuilder.reflectionToString(ToStringBuilder.java:152)
	at org.apache.commons.lang3.builder.ToStringBuilderTest.testReflectionByteArrayArray(ToStringBuilderTest.java:280)

testReflectionByteArrayArray(org.apache.commons.lang3.builder.ToStringBuilderTest)  Time elapsed: 0 sec  <<< FAILURE!
java.lang.AssertionError: Expected null, actual: {[Ljava.lang.Object;@63233638=null, [[Z@792cc6d9=null, [[B@3c859513=null, [[J@d385acb=null, [[S@659046f7=null, [[D@4d1d72a0=null, [[I@9b92078=null} expected null, but was:<{[Ljava.lang.Object;@63233638=null, [[Z@792cc6d9=null, [[B@3c859513=null, [[J@d385acb=null, [[S@659046f7=null, [[D@4d1d72a0=null, [[I@9b92078=null}>
	at org.junit.Assert.fail(Assert.java:88)
	at org.junit.Assert.failNotNull(Assert.java:755)
	at org.junit.Assert.assertNull(Assert.java:737)
	at org.apache.commons.lang3.builder.ToStringBuilderTest.validateNullToStringStyleRegistry(ToStringBuilderTest.java:595)
	at org.apache.commons.lang3.builder.ToStringBuilderTest.after(ToStringBuilderTest.java:48)

testReflectionArrayCycleLevel2(org.apache.commons.lang3.builder.ToStringBuilderTest)  Time elapsed: 0 sec  <<< FAILURE!
org.junit.ComparisonFailure: expected:<...g.Object;@65fe316f[{[{[Ljava.lang.Object;@65fe316f}]}]> but was:<...g.Object;@65fe316f[{[<null>]}]>
	at org.junit.Assert.assertEquals(Assert.java:115)
	at org.junit.Assert.assertEquals(Assert.java:144)
	at org.apache.commons.lang3.builder.ToStringBuilderTest.testReflectionArrayCycleLevel2(ToStringBuilderTest.java:416)

testReflectionArrayCycleLevel2(org.apache.commons.lang3.builder.ToStringBuilderTest)  Time elapsed: 0.001 sec  <<< FAILURE!
java.lang.AssertionError: Expected null, actual: {[Ljava.lang.Object;@63233638=null, [[Z@792cc6d9=null, [[B@3c859513=null, [[J@d385acb=null, [[S@659046f7=null, [[D@4d1d72a0=null, [[I@9b92078=null} expected null, but was:<{[Ljava.lang.Object;@63233638=null, [[Z@792cc6d9=null, [[B@3c859513=null, [[J@d385acb=null, [[S@659046f7=null, [[D@4d1d72a0=null, [[I@9b92078=null}>
	at org.junit.Assert.fail(Assert.java:88)
	at org.junit.Assert.failNotNull(Assert.java:755)
	at org.junit.Assert.assertNull(Assert.java:737)
	at org.apache.commons.lang3.builder.ToStringBuilderTest.validateNullToStringStyleRegistry(ToStringBuilderTest.java:595)
	at org.apache.commons.lang3.builder.ToStringBuilderTest.after(ToStringBuilderTest.java:48)

testAppendToString(org.apache.commons.lang3.builder.ToStringBuilderTest)  Time elapsed: 0.007 sec  <<< FAILURE!
java.lang.AssertionError: Expected null, actual: {[Ljava.lang.Object;@63233638=null, [[Z@792cc6d9=null, [[B@3c859513=null, [[J@d385acb=null, [[S@659046f7=null, [[D@4d1d72a0=null, [[I@9b92078=null} expected null, but was:<{[Ljava.lang.Object;@63233638=null, [[Z@792cc6d9=null, [[B@3c859513=null, [[J@d385acb=null, [[S@659046f7=null, [[D@4d1d72a0=null, [[I@9b92078=null}>
	at org.junit.Assert.fail(Assert.java:88)
	at org.junit.Assert.failNotNull(Assert.java:755)
	at org.junit.Assert.assertNull(Assert.java:737)
	at org.apache.commons.lang3.builder.ToStringBuilderTest.validateNullToStringStyleRegistry(ToStringBuilderTest.java:595)
	at org.apache.commons.lang3.builder.ToStringBuilderTest.after(ToStringBuilderTest.java:48)

testReflectionArrayAndObjectCycle(org.apache.commons.lang3.builder.ToStringBuilderTest)  Time elapsed: 0 sec  <<< FAILURE!
org.junit.ComparisonFailure: expected:<...g.Object;@135fa2b9[{[org.apache.commons.lang3.builder.ToStringBuilderTest$SimpleReflectionTestFixture@6bb4299e[o=[Ljava.lang.Object;@135fa2b9]]}]> but was:<...g.Object;@135fa2b9[{[<null>]}]>
	at org.junit.Assert.assertEquals(Assert.java:115)
	at org.junit.Assert.assertEquals(Assert.java:144)
	at org.apache.commons.lang3.builder.ToStringBuilderTest.testReflectionArrayAndObjectCycle(ToStringBuilderTest.java:576)

testReflectionArrayAndObjectCycle(org.apache.commons.lang3.builder.ToStringBuilderTest)  Time elapsed: 0.002 sec  <<< FAILURE!
java.lang.AssertionError: Expected null, actual: {[Ljava.lang.Object;@63233638=null, [[Z@792cc6d9=null, [[B@3c859513=null, [[J@d385acb=null, [[S@659046f7=null, [[D@4d1d72a0=null, [[I@9b92078=null} expected null, but was:<{[Ljava.lang.Object;@63233638=null, [[Z@792cc6d9=null, [[B@3c859513=null, [[J@d385acb=null, [[S@659046f7=null, [[D@4d1d72a0=null, [[I@9b92078=null}>
	at org.junit.Assert.fail(Assert.java:88)
	at org.junit.Assert.failNotNull(Assert.java:755)
	at org.junit.Assert.assertNull(Assert.java:737)
	at org.apache.commons.lang3.builder.ToStringBuilderTest.validateNullToStringStyleRegistry(ToStringBuilderTest.java:595)
	at org.apache.commons.lang3.builder.ToStringBuilderTest.after(ToStringBuilderTest.java:48)

testSetDefaultEx(org.apache.commons.lang3.builder.ToStringBuilderTest)  Time elapsed: 0 sec  <<< FAILURE!
java.lang.AssertionError: Expected null, actual: {[Ljava.lang.Object;@63233638=null, [[Z@792cc6d9=null, [[B@3c859513=null, [[J@d385acb=null, [[S@659046f7=null, [[D@4d1d72a0=null, [[I@9b92078=null} expected null, but was:<{[Ljava.lang.Object;@63233638=null, [[Z@792cc6d9=null, [[B@3c859513=null, [[J@d385acb=null, [[S@659046f7=null, [[D@4d1d72a0=null, [[I@9b92078=null}>
	at org.junit.Assert.fail(Assert.java:88)
	at org.junit.Assert.failNotNull(Assert.java:755)
	at org.junit.Assert.assertNull(Assert.java:737)
	at org.apache.commons.lang3.builder.ToStringBuilderTest.validateNullToStringStyleRegistry(ToStringBuilderTest.java:595)
	at org.apache.commons.lang3.builder.ToStringBuilderTest.after(ToStringBuilderTest.java:48)

testReflectionCharArrayArray(org.apache.commons.lang3.builder.ToStringBuilderTest)  Time elapsed: 0.001 sec  <<< ERROR!
java.lang.NullPointerException: null
	at org.apache.commons.lang3.builder.ToStringStyle.appendInternal(ToStringStyle.java:105)
	at org.apache.commons.lang3.builder.ToStringStyle.reflectionAppendArrayDetail(ToStringStyle.java:169)
	at org.apache.commons.lang3.builder.ReflectionToStringBuilder.reflectionAppendArray(ReflectionToStringBuilder.java:610)
	at org.apache.commons.lang3.builder.ReflectionToStringBuilder.appendFieldsIn(ReflectionToStringBuilder.java:515)
	at org.apache.commons.lang3.builder.ReflectionToStringBuilder.toString(ReflectionToStringBuilder.java:688)
	at org.apache.commons.lang3.builder.ReflectionToStringBuilder.toString(ReflectionToStringBuilder.java:287)
	at org.apache.commons.lang3.builder.ReflectionToStringBuilder.toString(ReflectionToStringBuilder.java:118)
	at org.apache.commons.lang3.builder.ToStringBuilder.reflectionToString(ToStringBuilder.java:152)
	at org.apache.commons.lang3.builder.ToStringBuilderTest.testReflectionCharArrayArray(ToStringBuilderTest.java:289)

testReflectionCharArrayArray(org.apache.commons.lang3.builder.ToStringBuilderTest)  Time elapsed: 0.001 sec  <<< FAILURE!
java.lang.AssertionError: Expected null, actual: {[[C@1187b50=null, [Ljava.lang.Object;@63233638=null, [[Z@792cc6d9=null, [[B@3c859513=null, [[J@d385acb=null, [[S@659046f7=null, [[D@4d1d72a0=null, [[I@9b92078=null} expected null, but was:<{[[C@1187b50=null, [Ljava.lang.Object;@63233638=null, [[Z@792cc6d9=null, [[B@3c859513=null, [[J@d385acb=null, [[S@659046f7=null, [[D@4d1d72a0=null, [[I@9b92078=null}>
	at org.junit.Assert.fail(Assert.java:88)
	at org.junit.Assert.failNotNull(Assert.java:755)
	at org.junit.Assert.assertNull(Assert.java:737)
	at org.apache.commons.lang3.builder.ToStringBuilderTest.validateNullToStringStyleRegistry(ToStringBuilderTest.java:595)
	at org.apache.commons.lang3.builder.ToStringBuilderTest.after(ToStringBuilderTest.java:48)

testIntArray(org.apache.commons.lang3.builder.ToStringBuilderTest)  Time elapsed: 0 sec  <<< FAILURE!
java.lang.AssertionError: Expected null, actual: {[[C@1187b50=null, [Ljava.lang.Object;@63233638=null, [[Z@792cc6d9=null, [[B@3c859513=null, [[J@d385acb=null, [[S@659046f7=null, [[D@4d1d72a0=null, [[I@9b92078=null} expected null, but was:<{[[C@1187b50=null, [Ljava.lang.Object;@63233638=null, [[Z@792cc6d9=null, [[B@3c859513=null, [[J@d385acb=null, [[S@659046f7=null, [[D@4d1d72a0=null, [[I@9b92078=null}>
	at org.junit.Assert.fail(Assert.java:88)
	at org.junit.Assert.failNotNull(Assert.java:755)
	at org.junit.Assert.assertNull(Assert.java:737)
	at org.apache.commons.lang3.builder.ToStringBuilderTest.validateNullToStringStyleRegistry(ToStringBuilderTest.java:595)
	at org.apache.commons.lang3.builder.ToStringBuilderTest.after(ToStringBuilderTest.java:48)

testDouble(org.apache.commons.lang3.builder.ToStringBuilderTest)  Time elapsed: 0 sec  <<< FAILURE!
java.lang.AssertionError: Expected null, actual: {[[C@1187b50=null, [Ljava.lang.Object;@63233638=null, [[Z@792cc6d9=null, [[B@3c859513=null, [[J@d385acb=null, [[S@659046f7=null, [[D@4d1d72a0=null, [[I@9b92078=null} expected null, but was:<{[[C@1187b50=null, [Ljava.lang.Object;@63233638=null, [[Z@792cc6d9=null, [[B@3c859513=null, [[J@d385acb=null, [[S@659046f7=null, [[D@4d1d72a0=null, [[I@9b92078=null}>
	at org.junit.Assert.fail(Assert.java:88)
	at org.junit.Assert.failNotNull(Assert.java:755)
	at org.junit.Assert.assertNull(Assert.java:737)
	at org.apache.commons.lang3.builder.ToStringBuilderTest.validateNullToStringStyleRegistry(ToStringBuilderTest.java:595)
	at org.apache.commons.lang3.builder.ToStringBuilderTest.after(ToStringBuilderTest.java:48)

testByteArrayArray(org.apache.commons.lang3.builder.ToStringBuilderTest)  Time elapsed: 0 sec  <<< FAILURE!
java.lang.AssertionError: Expected null, actual: {[[C@1187b50=null, [Ljava.lang.Object;@63233638=null, [[Z@792cc6d9=null, [[B@3c859513=null, [[J@d385acb=null, [[S@659046f7=null, [[D@4d1d72a0=null, [[I@9b92078=null} expected null, but was:<{[[C@1187b50=null, [Ljava.lang.Object;@63233638=null, [[Z@792cc6d9=null, [[B@3c859513=null, [[J@d385acb=null, [[S@659046f7=null, [[D@4d1d72a0=null, [[I@9b92078=null}>
	at org.junit.Assert.fail(Assert.java:88)
	at org.junit.Assert.failNotNull(Assert.java:755)
	at org.junit.Assert.assertNull(Assert.java:737)
	at org.apache.commons.lang3.builder.ToStringBuilderTest.validateNullToStringStyleRegistry(ToStringBuilderTest.java:595)
	at org.apache.commons.lang3.builder.ToStringBuilderTest.after(ToStringBuilderTest.java:48)

testReflectionShortArray(org.apache.commons.lang3.builder.ToStringBuilderTest)  Time elapsed: 0 sec  <<< FAILURE!
org.junit.ComparisonFailure: expected:<[S@697a3d13[{[1,2,-3,4]}]> but was:<[S@697a3d13[{[<null>,<null>,<null>,<null>]}]>
	at org.junit.Assert.assertEquals(Assert.java:115)
	at org.junit.Assert.assertEquals(Assert.java:144)
	at org.apache.commons.lang3.builder.ToStringBuilderTest.testReflectionShortArray(ToStringBuilderTest.java:187)

testReflectionShortArray(org.apache.commons.lang3.builder.ToStringBuilderTest)  Time elapsed: 0 sec  <<< FAILURE!
java.lang.AssertionError: Expected null, actual: {[[C@1187b50=null, [Ljava.lang.Object;@63233638=null, [[Z@792cc6d9=null, [[B@3c859513=null, [[J@d385acb=null, [[S@659046f7=null, [[D@4d1d72a0=null, [[I@9b92078=null} expected null, but was:<{[[C@1187b50=null, [Ljava.lang.Object;@63233638=null, [[Z@792cc6d9=null, [[B@3c859513=null, [[J@d385acb=null, [[S@659046f7=null, [[D@4d1d72a0=null, [[I@9b92078=null}>
	at org.junit.Assert.fail(Assert.java:88)
	at org.junit.Assert.failNotNull(Assert.java:755)
	at org.junit.Assert.assertNull(Assert.java:737)
	at org.apache.commons.lang3.builder.ToStringBuilderTest.validateNullToStringStyleRegistry(ToStringBuilderTest.java:595)
	at org.apache.commons.lang3.builder.ToStringBuilderTest.after(ToStringBuilderTest.java:48)

testCharArrayArray(org.apache.commons.lang3.builder.ToStringBuilderTest)  Time elapsed: 0 sec  <<< FAILURE!
java.lang.AssertionError: Expected null, actual: {[[C@1187b50=null, [Ljava.lang.Object;@63233638=null, [[Z@792cc6d9=null, [[B@3c859513=null, [[J@d385acb=null, [[S@659046f7=null, [[D@4d1d72a0=null, [[I@9b92078=null} expected null, but was:<{[[C@1187b50=null, [Ljava.lang.Object;@63233638=null, [[Z@792cc6d9=null, [[B@3c859513=null, [[J@d385acb=null, [[S@659046f7=null, [[D@4d1d72a0=null, [[I@9b92078=null}>
	at org.junit.Assert.fail(Assert.java:88)
	at org.junit.Assert.failNotNull(Assert.java:755)
	at org.junit.Assert.assertNull(Assert.java:737)
	at org.apache.commons.lang3.builder.ToStringBuilderTest.validateNullToStringStyleRegistry(ToStringBuilderTest.java:595)
	at org.apache.commons.lang3.builder.ToStringBuilderTest.after(ToStringBuilderTest.java:48)

testSelfInstanceVarReflectionObjectCycle(org.apache.commons.lang3.builder.ToStringBuilderTest)  Time elapsed: 0.001 sec  <<< FAILURE!
java.lang.AssertionError: Expected null, actual: {[[C@1187b50=null, [Ljava.lang.Object;@63233638=null, [[Z@792cc6d9=null, [[B@3c859513=null, [[J@d385acb=null, [[S@659046f7=null, [[D@4d1d72a0=null, [[I@9b92078=null} expected null, but was:<{[[C@1187b50=null, [Ljava.lang.Object;@63233638=null, [[Z@792cc6d9=null, [[B@3c859513=null, [[J@d385acb=null, [[S@659046f7=null, [[D@4d1d72a0=null, [[I@9b92078=null}>
	at org.junit.Assert.fail(Assert.java:88)
	at org.junit.Assert.failNotNull(Assert.java:755)
	at org.junit.Assert.assertNull(Assert.java:737)
	at org.apache.commons.lang3.builder.ToStringBuilderTest.validateNullToStringStyleRegistry(ToStringBuilderTest.java:595)
	at org.apache.commons.lang3.builder.ToStringBuilderTest.after(ToStringBuilderTest.java:48)

testObject(org.apache.commons.lang3.builder.ToStringBuilderTest)  Time elapsed: 0 sec  <<< FAILURE!
java.lang.AssertionError: Expected null, actual: {[[C@1187b50=null, [Ljava.lang.Object;@63233638=null, [[Z@792cc6d9=null, [[B@3c859513=null, [[J@d385acb=null, [[S@659046f7=null, [[D@4d1d72a0=null, [[I@9b92078=null} expected null, but was:<{[[C@1187b50=null, [Ljava.lang.Object;@63233638=null, [[Z@792cc6d9=null, [[B@3c859513=null, [[J@d385acb=null, [[S@659046f7=null, [[D@4d1d72a0=null, [[I@9b92078=null}>
	at org.junit.Assert.fail(Assert.java:88)
	at org.junit.Assert.failNotNull(Assert.java:755)
	at org.junit.Assert.assertNull(Assert.java:737)
	at org.apache.commons.lang3.builder.ToStringBuilderTest.validateNullToStringStyleRegistry(ToStringBuilderTest.java:595)
	at org.apache.commons.lang3.builder.ToStringBuilderTest.after(ToStringBuilderTest.java:48)

testAppendSuper(org.apache.commons.lang3.builder.ToStringBuilderTest)  Time elapsed: 0.004 sec  <<< FAILURE!
java.lang.AssertionError: Expected null, actual: {[[C@1187b50=null, [Ljava.lang.Object;@63233638=null, [[Z@792cc6d9=null, [[B@3c859513=null, [[J@d385acb=null, [[S@659046f7=null, [[D@4d1d72a0=null, [[I@9b92078=null} expected null, but was:<{[[C@1187b50=null, [Ljava.lang.Object;@63233638=null, [[Z@792cc6d9=null, [[B@3c859513=null, [[J@d385acb=null, [[S@659046f7=null, [[D@4d1d72a0=null, [[I@9b92078=null}>
	at org.junit.Assert.fail(Assert.java:88)
	at org.junit.Assert.failNotNull(Assert.java:755)
	at org.junit.Assert.assertNull(Assert.java:737)
	at org.apache.commons.lang3.builder.ToStringBuilderTest.validateNullToStringStyleRegistry(ToStringBuilderTest.java:595)
	at org.apache.commons.lang3.builder.ToStringBuilderTest.after(ToStringBuilderTest.java:48)

testReflectionIntArray(org.apache.commons.lang3.builder.ToStringBuilderTest)  Time elapsed: 0 sec  <<< FAILURE!
org.junit.ComparisonFailure: expected:<[I@3f0821d0[{[1,2,-3,4]}]> but was:<[I@3f0821d0[{[<null>,<null>,<null>,<null>]}]>
	at org.junit.Assert.assertEquals(Assert.java:115)
	at org.junit.Assert.assertEquals(Assert.java:144)
	at org.apache.commons.lang3.builder.ToStringBuilderTest.testReflectionIntArray(ToStringBuilderTest.java:178)

testReflectionIntArray(org.apache.commons.lang3.builder.ToStringBuilderTest)  Time elapsed: 0 sec  <<< FAILURE!
java.lang.AssertionError: Expected null, actual: {[[C@1187b50=null, [Ljava.lang.Object;@63233638=null, [[Z@792cc6d9=null, [[B@3c859513=null, [[J@d385acb=null, [[S@659046f7=null, [[D@4d1d72a0=null, [[I@9b92078=null} expected null, but was:<{[[C@1187b50=null, [Ljava.lang.Object;@63233638=null, [[Z@792cc6d9=null, [[B@3c859513=null, [[J@d385acb=null, [[S@659046f7=null, [[D@4d1d72a0=null, [[I@9b92078=null}>
	at org.junit.Assert.fail(Assert.java:88)
	at org.junit.Assert.failNotNull(Assert.java:755)
	at org.junit.Assert.assertNull(Assert.java:737)
	at org.apache.commons.lang3.builder.ToStringBuilderTest.validateNullToStringStyleRegistry(ToStringBuilderTest.java:595)
	at org.apache.commons.lang3.builder.ToStringBuilderTest.after(ToStringBuilderTest.java:48)

testReflectionCharArray(org.apache.commons.lang3.builder.ToStringBuilderTest)  Time elapsed: 0 sec  <<< FAILURE!
org.junit.ComparisonFailure: expected:<[C@2ee3ff04[{[A,2,_,D]}]> but was:<[C@2ee3ff04[{[<null>,<null>,<null>,<null>]}]>
	at org.junit.Assert.assertEquals(Assert.java:115)
	at org.junit.Assert.assertEquals(Assert.java:144)
	at org.apache.commons.lang3.builder.ToStringBuilderTest.testReflectionCharArray(ToStringBuilderTest.java:205)

testReflectionCharArray(org.apache.commons.lang3.builder.ToStringBuilderTest)  Time elapsed: 0 sec  <<< FAILURE!
java.lang.AssertionError: Expected null, actual: {[[C@1187b50=null, [Ljava.lang.Object;@63233638=null, [[Z@792cc6d9=null, [[B@3c859513=null, [[J@d385acb=null, [[S@659046f7=null, [[D@4d1d72a0=null, [[I@9b92078=null} expected null, but was:<{[[C@1187b50=null, [Ljava.lang.Object;@63233638=null, [[Z@792cc6d9=null, [[B@3c859513=null, [[J@d385acb=null, [[S@659046f7=null, [[D@4d1d72a0=null, [[I@9b92078=null}>
	at org.junit.Assert.fail(Assert.java:88)
	at org.junit.Assert.failNotNull(Assert.java:755)
	at org.junit.Assert.assertNull(Assert.java:737)
	at org.apache.commons.lang3.builder.ToStringBuilderTest.validateNullToStringStyleRegistry(ToStringBuilderTest.java:595)
	at org.apache.commons.lang3.builder.ToStringBuilderTest.after(ToStringBuilderTest.java:48)

testGetSetDefault(org.apache.commons.lang3.builder.ToStringBuilderTest)  Time elapsed: 0.001 sec  <<< FAILURE!
java.lang.AssertionError: Expected null, actual: {[[C@1187b50=null, [Ljava.lang.Object;@63233638=null, [[Z@792cc6d9=null, [[B@3c859513=null, [[J@d385acb=null, [[S@659046f7=null, [[D@4d1d72a0=null, [[I@9b92078=null} expected null, but was:<{[[C@1187b50=null, [Ljava.lang.Object;@63233638=null, [[Z@792cc6d9=null, [[B@3c859513=null, [[J@d385acb=null, [[S@659046f7=null, [[D@4d1d72a0=null, [[I@9b92078=null}>
	at org.junit.Assert.fail(Assert.java:88)
	at org.junit.Assert.failNotNull(Assert.java:755)
	at org.junit.Assert.assertNull(Assert.java:737)
	at org.apache.commons.lang3.builder.ToStringBuilderTest.validateNullToStringStyleRegistry(ToStringBuilderTest.java:595)
	at org.apache.commons.lang3.builder.ToStringBuilderTest.after(ToStringBuilderTest.java:48)

testInnerClassReflection(org.apache.commons.lang3.builder.ToStringBuilderTest)  Time elapsed: 0.003 sec  <<< FAILURE!
java.lang.AssertionError: Expected null, actual: {[[C@1187b50=null, [Ljava.lang.Object;@63233638=null, [[Z@792cc6d9=null, [[B@3c859513=null, [[J@d385acb=null, [[S@659046f7=null, [[D@4d1d72a0=null, [[I@9b92078=null} expected null, but was:<{[[C@1187b50=null, [Ljava.lang.Object;@63233638=null, [[Z@792cc6d9=null, [[B@3c859513=null, [[J@d385acb=null, [[S@659046f7=null, [[D@4d1d72a0=null, [[I@9b92078=null}>
	at org.junit.Assert.fail(Assert.java:88)
	at org.junit.Assert.failNotNull(Assert.java:755)
	at org.junit.Assert.assertNull(Assert.java:737)
	at org.apache.commons.lang3.builder.ToStringBuilderTest.validateNullToStringStyleRegistry(ToStringBuilderTest.java:595)
	at org.apache.commons.lang3.builder.ToStringBuilderTest.after(ToStringBuilderTest.java:48)

testReflectionCharacter(org.apache.commons.lang3.builder.ToStringBuilderTest)  Time elapsed: 0.003 sec  <<< FAILURE!
java.lang.AssertionError: Expected null, actual: {[[C@1187b50=null, [Ljava.lang.Object;@63233638=null, [[Z@792cc6d9=null, [[B@3c859513=null, [[J@d385acb=null, [[S@659046f7=null, [[D@4d1d72a0=null, [[I@9b92078=null} expected null, but was:<{[[C@1187b50=null, [Ljava.lang.Object;@63233638=null, [[Z@792cc6d9=null, [[B@3c859513=null, [[J@d385acb=null, [[S@659046f7=null, [[D@4d1d72a0=null, [[I@9b92078=null}>
	at org.junit.Assert.fail(Assert.java:88)
	at org.junit.Assert.failNotNull(Assert.java:755)
	at org.junit.Assert.assertNull(Assert.java:737)
	at org.apache.commons.lang3.builder.ToStringBuilderTest.validateNullToStringStyleRegistry(ToStringBuilderTest.java:595)
	at org.apache.commons.lang3.builder.ToStringBuilderTest.after(ToStringBuilderTest.java:48)

testDoubleArray(org.apache.commons.lang3.builder.ToStringBuilderTest)  Time elapsed: 0.002 sec  <<< FAILURE!
java.lang.AssertionError: Expected null, actual: {[[C@1187b50=null, [Ljava.lang.Object;@63233638=null, [[Z@792cc6d9=null, [[B@3c859513=null, [[J@d385acb=null, [[S@659046f7=null, [[D@4d1d72a0=null, [[I@9b92078=null} expected null, but was:<{[[C@1187b50=null, [Ljava.lang.Object;@63233638=null, [[Z@792cc6d9=null, [[B@3c859513=null, [[J@d385acb=null, [[S@659046f7=null, [[D@4d1d72a0=null, [[I@9b92078=null}>
	at org.junit.Assert.fail(Assert.java:88)
	at org.junit.Assert.failNotNull(Assert.java:755)
	at org.junit.Assert.assertNull(Assert.java:737)
	at org.apache.commons.lang3.builder.ToStringBuilderTest.validateNullToStringStyleRegistry(ToStringBuilderTest.java:595)
	at org.apache.commons.lang3.builder.ToStringBuilderTest.after(ToStringBuilderTest.java:48)

testReflectionFloatArrayArray(org.apache.commons.lang3.builder.ToStringBuilderTest)  Time elapsed: 0.001 sec  <<< ERROR!
java.lang.NullPointerException: null
	at org.apache.commons.lang3.builder.ToStringStyle.appendInternal(ToStringStyle.java:105)
	at org.apache.commons.lang3.builder.ToStringStyle.reflectionAppendArrayDetail(ToStringStyle.java:169)
	at org.apache.commons.lang3.builder.ReflectionToStringBuilder.reflectionAppendArray(ReflectionToStringBuilder.java:610)
	at org.apache.commons.lang3.builder.ReflectionToStringBuilder.appendFieldsIn(ReflectionToStringBuilder.java:515)
	at org.apache.commons.lang3.builder.ReflectionToStringBuilder.toString(ReflectionToStringBuilder.java:688)
	at org.apache.commons.lang3.builder.ReflectionToStringBuilder.toString(ReflectionToStringBuilder.java:287)
	at org.apache.commons.lang3.builder.ReflectionToStringBuilder.toString(ReflectionToStringBuilder.java:118)
	at org.apache.commons.lang3.builder.ToStringBuilder.reflectionToString(ToStringBuilder.java:152)
	at org.apache.commons.lang3.builder.ToStringBuilderTest.testReflectionFloatArrayArray(ToStringBuilderTest.java:243)

testReflectionFloatArrayArray(org.apache.commons.lang3.builder.ToStringBuilderTest)  Time elapsed: 0.002 sec  <<< FAILURE!
java.lang.AssertionError: Expected null, actual: {[[C@1187b50=null, [[F@209740de=null, [Ljava.lang.Object;@63233638=null, [[Z@792cc6d9=null, [[B@3c859513=null, [[J@d385acb=null, [[S@659046f7=null, [[D@4d1d72a0=null, [[I@9b92078=null} expected null, but was:<{[[C@1187b50=null, [[F@209740de=null, [Ljava.lang.Object;@63233638=null, [[Z@792cc6d9=null, [[B@3c859513=null, [[J@d385acb=null, [[S@659046f7=null, [[D@4d1d72a0=null, [[I@9b92078=null}>
	at org.junit.Assert.fail(Assert.java:88)
	at org.junit.Assert.failNotNull(Assert.java:755)
	at org.junit.Assert.assertNull(Assert.java:737)
	at org.apache.commons.lang3.builder.ToStringBuilderTest.validateNullToStringStyleRegistry(ToStringBuilderTest.java:595)
	at org.apache.commons.lang3.builder.ToStringBuilderTest.after(ToStringBuilderTest.java:48)

Running org.apache.commons.lang3.builder.EqualsBuilderTest
Tests run: 48, Failures: 0, Errors: 0, Skipped: 0, Time elapsed: 0.025 sec - in org.apache.commons.lang3.builder.EqualsBuilderTest
Running org.apache.commons.lang3.builder.HashCodeBuilderAndEqualsBuilderTest
Tests run: 4, Failures: 0, Errors: 0, Skipped: 0, Time elapsed: 0.006 sec - in org.apache.commons.lang3.builder.HashCodeBuilderAndEqualsBuilderTest
Running org.apache.commons.lang3.builder.ReflectionToStringBuilderConcurrencyTest
Tests run: 3, Failures: 0, Errors: 0, Skipped: 3, Time elapsed: 0 sec - in org.apache.commons.lang3.builder.ReflectionToStringBuilderConcurrencyTest
Running org.apache.commons.lang3.builder.JsonToStringStyleTest
Tests run: 9, Failures: 0, Errors: 0, Skipped: 0, Time elapsed: 0.002 sec - in org.apache.commons.lang3.builder.JsonToStringStyleTest
Running org.apache.commons.lang3.builder.NoClassNameToStringStyleTest
Tests run: 8, Failures: 0, Errors: 0, Skipped: 0, Time elapsed: 0.003 sec - in org.apache.commons.lang3.builder.NoClassNameToStringStyleTest
Running org.apache.commons.lang3.builder.DiffBuilderTest
Tests run: 30, Failures: 0, Errors: 0, Skipped: 0, Time elapsed: 0.025 sec - in org.apache.commons.lang3.builder.DiffBuilderTest
Running org.apache.commons.lang3.builder.HashCodeBuilderTest
Tests run: 44, Failures: 0, Errors: 0, Skipped: 0, Time elapsed: 0.015 sec - in org.apache.commons.lang3.builder.HashCodeBuilderTest
Running org.apache.commons.lang3.concurrent.AtomicInitializerTest
Tests run: 3, Failures: 0, Errors: 0, Skipped: 0, Time elapsed: 0.005 sec - in org.apache.commons.lang3.concurrent.AtomicInitializerTest
Running org.apache.commons.lang3.concurrent.CallableBackgroundInitializerTest
Tests run: 4, Failures: 0, Errors: 0, Skipped: 0, Time elapsed: 0.001 sec - in org.apache.commons.lang3.concurrent.CallableBackgroundInitializerTest
Running org.apache.commons.lang3.concurrent.BackgroundInitializerTest
Tests run: 15, Failures: 0, Errors: 0, Skipped: 0, Time elapsed: 0.016 sec - in org.apache.commons.lang3.concurrent.BackgroundInitializerTest
Running org.apache.commons.lang3.concurrent.LazyInitializerTest
Tests run: 3, Failures: 0, Errors: 0, Skipped: 0, Time elapsed: 0.005 sec - in org.apache.commons.lang3.concurrent.LazyInitializerTest
Running org.apache.commons.lang3.concurrent.BasicThreadFactoryTest
Tests run: 15, Failures: 0, Errors: 0, Skipped: 0, Time elapsed: 0.044 sec - in org.apache.commons.lang3.concurrent.BasicThreadFactoryTest
Running org.apache.commons.lang3.concurrent.ConstantInitializerTest
Tests run: 7, Failures: 0, Errors: 0, Skipped: 0, Time elapsed: 0.001 sec - in org.apache.commons.lang3.concurrent.ConstantInitializerTest
Running org.apache.commons.lang3.concurrent.MultiBackgroundInitializerTest
Tests run: 17, Failures: 0, Errors: 0, Skipped: 0, Time elapsed: 0.07 sec - in org.apache.commons.lang3.concurrent.MultiBackgroundInitializerTest
Running org.apache.commons.lang3.concurrent.AtomicSafeInitializerTest
Tests run: 4, Failures: 0, Errors: 0, Skipped: 0, Time elapsed: 0.009 sec - in org.apache.commons.lang3.concurrent.AtomicSafeInitializerTest
Running org.apache.commons.lang3.concurrent.ConcurrentUtilsTest
Tests run: 40, Failures: 0, Errors: 0, Skipped: 0, Time elapsed: 0.014 sec - in org.apache.commons.lang3.concurrent.ConcurrentUtilsTest
Running org.apache.commons.lang3.concurrent.TimedSemaphoreTest
Tests run: 15, Failures: 0, Errors: 0, Skipped: 0, Time elapsed: 1.201 sec - in org.apache.commons.lang3.concurrent.TimedSemaphoreTest
Running org.apache.commons.lang3.StringUtilsSubstringTest
Tests run: 14, Failures: 0, Errors: 0, Skipped: 0, Time elapsed: 0.006 sec - in org.apache.commons.lang3.StringUtilsSubstringTest
Running org.apache.commons.lang3.SystemUtilsTest
Tests run: 12, Failures: 0, Errors: 0, Skipped: 0, Time elapsed: 0.004 sec - in org.apache.commons.lang3.SystemUtilsTest
Running org.apache.commons.lang3.CharRangeTest
Tests run: 16, Failures: 0, Errors: 0, Skipped: 0, Time elapsed: 0.033 sec - in org.apache.commons.lang3.CharRangeTest
Running org.apache.commons.lang3.CharSetTest
Tests run: 14, Failures: 0, Errors: 0, Skipped: 0, Time elapsed: 0.008 sec - in org.apache.commons.lang3.CharSetTest
Running org.apache.commons.lang3.StringUtilsStartsEndsWithTest
Tests run: 6, Failures: 0, Errors: 0, Skipped: 0, Time elapsed: 0.003 sec - in org.apache.commons.lang3.StringUtilsStartsEndsWithTest
Running org.apache.commons.lang3.RandomStringUtilsTest
Tests run: 11, Failures: 0, Errors: 0, Skipped: 0, Time elapsed: 0.032 sec - in org.apache.commons.lang3.RandomStringUtilsTest
Running org.apache.commons.lang3.SerializationUtilsTest
Tests run: 26, Failures: 0, Errors: 0, Skipped: 0, Time elapsed: 0.043 sec - in org.apache.commons.lang3.SerializationUtilsTest
Running org.apache.commons.lang3.time.StopWatchTest
Tests run: 8, Failures: 0, Errors: 0, Skipped: 0, Time elapsed: 4.764 sec - in org.apache.commons.lang3.time.StopWatchTest
Running org.apache.commons.lang3.time.DateUtilsRoundingTest
Tests run: 22, Failures: 0, Errors: 0, Skipped: 0, Time elapsed: 0.164 sec - in org.apache.commons.lang3.time.DateUtilsRoundingTest
Running org.apache.commons.lang3.time.FastDateParserTest
Tests run: 33, Failures: 0, Errors: 0, Skipped: 0, Time elapsed: 2.064 sec - in org.apache.commons.lang3.time.FastDateParserTest
Running org.apache.commons.lang3.time.FastDateFormat_ParserTest
Tests run: 33, Failures: 0, Errors: 0, Skipped: 0, Time elapsed: 0.673 sec - in org.apache.commons.lang3.time.FastDateFormat_ParserTest
Running org.apache.commons.lang3.time.DurationFormatUtilsTest
Tests run: 25, Failures: 0, Errors: 0, Skipped: 0, Time elapsed: 0.737 sec - in org.apache.commons.lang3.time.DurationFormatUtilsTest
Running org.apache.commons.lang3.time.DateFormatUtilsTest
Tests run: 10, Failures: 0, Errors: 0, Skipped: 0, Time elapsed: 0.002 sec - in org.apache.commons.lang3.time.DateFormatUtilsTest
Running org.apache.commons.lang3.time.DateUtilsFragmentTest
Tests run: 57, Failures: 0, Errors: 0, Skipped: 0, Time elapsed: 0.01 sec - in org.apache.commons.lang3.time.DateUtilsFragmentTest
Running org.apache.commons.lang3.time.FastDatePrinterTimeZonesTest
Tests run: 617, Failures: 0, Errors: 0, Skipped: 0, Time elapsed: 0.193 sec - in org.apache.commons.lang3.time.FastDatePrinterTimeZonesTest
Running org.apache.commons.lang3.time.FastDateFormatTest
>>FastDateFormatTest: FastDateParser:34125  SimpleDateFormat:3336
Tests run: 14, Failures: 0, Errors: 0, Skipped: 0, Time elapsed: 4.023 sec - in org.apache.commons.lang3.time.FastDateFormatTest
Running org.apache.commons.lang3.time.FastDateFormat_PrinterTest
Tests run: 17, Failures: 0, Errors: 0, Skipped: 0, Time elapsed: 0.008 sec - in org.apache.commons.lang3.time.FastDateFormat_PrinterTest
Running org.apache.commons.lang3.time.FastDatePrinterTest
Tests run: 17, Failures: 0, Errors: 0, Skipped: 0, Time elapsed: 0.004 sec - in org.apache.commons.lang3.time.FastDatePrinterTest
Running org.apache.commons.lang3.time.FastDateParserSDFTest
Tests run: 276, Failures: 0, Errors: 0, Skipped: 92, Time elapsed: 0.061 sec - in org.apache.commons.lang3.time.FastDateParserSDFTest
Running org.apache.commons.lang3.time.DateUtilsTest
DateUtilsTest: Default Locale=en_US
Tests run: 38, Failures: 0, Errors: 0, Skipped: 0, Time elapsed: 0.018 sec - in org.apache.commons.lang3.time.DateUtilsTest
Running org.apache.commons.lang3.reflect.InheritanceUtilsTest
Tests run: 9, Failures: 0, Errors: 0, Skipped: 0, Time elapsed: 0.003 sec - in org.apache.commons.lang3.reflect.InheritanceUtilsTest
Running org.apache.commons.lang3.reflect.MethodUtilsTest
Tests run: 23, Failures: 0, Errors: 0, Skipped: 0, Time elapsed: 0.033 sec - in org.apache.commons.lang3.reflect.MethodUtilsTest
Running org.apache.commons.lang3.reflect.ConstructorUtilsTest
Tests run: 7, Failures: 0, Errors: 0, Skipped: 0, Time elapsed: 0.004 sec - in org.apache.commons.lang3.reflect.ConstructorUtilsTest
Running org.apache.commons.lang3.reflect.FieldUtilsTest
Tests run: 64, Failures: 0, Errors: 0, Skipped: 0, Time elapsed: 0.029 sec - in org.apache.commons.lang3.reflect.FieldUtilsTest
Running org.apache.commons.lang3.reflect.TypeLiteralTest
Tests run: 4, Failures: 0, Errors: 0, Skipped: 0, Time elapsed: 0.005 sec - in org.apache.commons.lang3.reflect.TypeLiteralTest
Running org.apache.commons.lang3.reflect.TypeUtilsTest
Tests run: 19, Failures: 0, Errors: 0, Skipped: 0, Time elapsed: 0.043 sec - in org.apache.commons.lang3.reflect.TypeUtilsTest
Running org.apache.commons.lang3.mutable.MutableByteTest
Tests run: 17, Failures: 0, Errors: 0, Skipped: 0, Time elapsed: 0.002 sec - in org.apache.commons.lang3.mutable.MutableByteTest
Running org.apache.commons.lang3.mutable.MutableShortTest
Tests run: 14, Failures: 0, Errors: 0, Skipped: 0, Time elapsed: 0.001 sec - in org.apache.commons.lang3.mutable.MutableShortTest
Running org.apache.commons.lang3.mutable.MutableIntTest
Tests run: 17, Failures: 0, Errors: 0, Skipped: 0, Time elapsed: 0.003 sec - in org.apache.commons.lang3.mutable.MutableIntTest
Running org.apache.commons.lang3.mutable.MutableDoubleTest
Tests run: 18, Failures: 0, Errors: 0, Skipped: 0, Time elapsed: 0.003 sec - in org.apache.commons.lang3.mutable.MutableDoubleTest
Running org.apache.commons.lang3.mutable.MutableFloatTest
Tests run: 18, Failures: 0, Errors: 0, Skipped: 0, Time elapsed: 0.003 sec - in org.apache.commons.lang3.mutable.MutableFloatTest
Running org.apache.commons.lang3.mutable.MutableLongTest
Tests run: 17, Failures: 0, Errors: 0, Skipped: 0, Time elapsed: 0.007 sec - in org.apache.commons.lang3.mutable.MutableLongTest
Running org.apache.commons.lang3.mutable.MutableBooleanTest
Tests run: 9, Failures: 0, Errors: 0, Skipped: 0, Time elapsed: 0.002 sec - in org.apache.commons.lang3.mutable.MutableBooleanTest
Running org.apache.commons.lang3.mutable.MutableObjectTest
Tests run: 5, Failures: 0, Errors: 0, Skipped: 0, Time elapsed: 0 sec - in org.apache.commons.lang3.mutable.MutableObjectTest
Running org.apache.commons.lang3.text.translate.UnicodeEscaperTest
Tests run: 3, Failures: 0, Errors: 0, Skipped: 0, Time elapsed: 0.001 sec - in org.apache.commons.lang3.text.translate.UnicodeEscaperTest
Running org.apache.commons.lang3.text.translate.EntityArraysTest
Tests run: 3, Failures: 0, Errors: 0, Skipped: 0, Time elapsed: 0 sec - in org.apache.commons.lang3.text.translate.EntityArraysTest
Running org.apache.commons.lang3.text.translate.UnicodeUnpairedSurrogateRemoverTest
Tests run: 2, Failures: 0, Errors: 0, Skipped: 0, Time elapsed: 0.001 sec - in org.apache.commons.lang3.text.translate.UnicodeUnpairedSurrogateRemoverTest
Running org.apache.commons.lang3.text.translate.NumericEntityUnescaperTest
Tests run: 3, Failures: 0, Errors: 0, Skipped: 0, Time elapsed: 0 sec - in org.apache.commons.lang3.text.translate.NumericEntityUnescaperTest
Running org.apache.commons.lang3.text.translate.NumericEntityEscaperTest
Tests run: 4, Failures: 0, Errors: 0, Skipped: 0, Time elapsed: 0.001 sec - in org.apache.commons.lang3.text.translate.NumericEntityEscaperTest
Running org.apache.commons.lang3.text.translate.LookupTranslatorTest
Tests run: 2, Failures: 0, Errors: 0, Skipped: 0, Time elapsed: 0 sec - in org.apache.commons.lang3.text.translate.LookupTranslatorTest
Running org.apache.commons.lang3.text.translate.UnicodeUnescaperTest
Tests run: 3, Failures: 0, Errors: 0, Skipped: 0, Time elapsed: 0 sec - in org.apache.commons.lang3.text.translate.UnicodeUnescaperTest
Running org.apache.commons.lang3.text.translate.OctalUnescaperTest
Tests run: 1, Failures: 0, Errors: 0, Skipped: 0, Time elapsed: 0 sec - in org.apache.commons.lang3.text.translate.OctalUnescaperTest
Running org.apache.commons.lang3.text.StrMatcherTest
Tests run: 14, Failures: 0, Errors: 0, Skipped: 0, Time elapsed: 0.003 sec - in org.apache.commons.lang3.text.StrMatcherTest
Running org.apache.commons.lang3.text.StrTokenizerTest
Tests run: 55, Failures: 0, Errors: 0, Skipped: 0, Time elapsed: 0.013 sec - in org.apache.commons.lang3.text.StrTokenizerTest
Running org.apache.commons.lang3.text.FormattableUtilsTest
Tests run: 5, Failures: 0, Errors: 0, Skipped: 0, Time elapsed: 0 sec - in org.apache.commons.lang3.text.FormattableUtilsTest
Running org.apache.commons.lang3.text.CompositeFormatTest
Tests run: 2, Failures: 0, Errors: 0, Skipped: 0, Time elapsed: 0.001 sec - in org.apache.commons.lang3.text.CompositeFormatTest
Running org.apache.commons.lang3.text.WordUtilsTest
Tests run: 12, Failures: 0, Errors: 0, Skipped: 0, Time elapsed: 0.003 sec - in org.apache.commons.lang3.text.WordUtilsTest
Running org.apache.commons.lang3.text.StrLookupTest
Tests run: 5, Failures: 0, Errors: 0, Skipped: 0, Time elapsed: 0.003 sec - in org.apache.commons.lang3.text.StrLookupTest
Running org.apache.commons.lang3.text.StrBuilderAppendInsertTest
Tests run: 51, Failures: 0, Errors: 0, Skipped: 0, Time elapsed: 0.01 sec - in org.apache.commons.lang3.text.StrBuilderAppendInsertTest
Running org.apache.commons.lang3.text.ExtendedMessageFormatTest
Tests run: 10, Failures: 0, Errors: 0, Skipped: 0, Time elapsed: 0.754 sec - in org.apache.commons.lang3.text.ExtendedMessageFormatTest
Running org.apache.commons.lang3.text.StrSubstitutorTest
Tests run: 40, Failures: 0, Errors: 0, Skipped: 0, Time elapsed: 0.024 sec - in org.apache.commons.lang3.text.StrSubstitutorTest
Running org.apache.commons.lang3.text.StrBuilderTest
Tests run: 90, Failures: 0, Errors: 0, Skipped: 0, Time elapsed: 0.035 sec - in org.apache.commons.lang3.text.StrBuilderTest
Running org.apache.commons.lang3.StringEscapeUtilsTest
Tests run: 28, Failures: 0, Errors: 0, Skipped: 0, Time elapsed: 0.372 sec - in org.apache.commons.lang3.StringEscapeUtilsTest
Running org.apache.commons.lang3.AnnotationUtilsTest
Tests run: 10, Failures: 0, Errors: 0, Skipped: 0, Time elapsed: 0.022 sec - in org.apache.commons.lang3.AnnotationUtilsTest
Running org.apache.commons.lang3.ConversionTest
Tests run: 42, Failures: 0, Errors: 0, Skipped: 0, Time elapsed: 0.012 sec - in org.apache.commons.lang3.ConversionTest
Running org.apache.commons.lang3.StringUtilsTrimEmptyTest
Tests run: 15, Failures: 0, Errors: 0, Skipped: 0, Time elapsed: 0.005 sec - in org.apache.commons.lang3.StringUtilsTrimEmptyTest
Running org.apache.commons.lang3.EnumUtilsTest
Tests run: 34, Failures: 0, Errors: 0, Skipped: 0, Time elapsed: 0.009 sec - in org.apache.commons.lang3.EnumUtilsTest
Running org.apache.commons.lang3.exception.ExceptionUtilsTest
Tests run: 28, Failures: 0, Errors: 0, Skipped: 0, Time elapsed: 0.025 sec - in org.apache.commons.lang3.exception.ExceptionUtilsTest
Running org.apache.commons.lang3.exception.DefaultExceptionContextTest
Tests run: 8, Failures: 0, Errors: 0, Skipped: 0, Time elapsed: 0.004 sec - in org.apache.commons.lang3.exception.DefaultExceptionContextTest
Running org.apache.commons.lang3.exception.ContextedExceptionTest
Tests run: 14, Failures: 0, Errors: 0, Skipped: 0, Time elapsed: 0.01 sec - in org.apache.commons.lang3.exception.ContextedExceptionTest
Running org.apache.commons.lang3.exception.ContextedRuntimeExceptionTest
Tests run: 14, Failures: 0, Errors: 0, Skipped: 0, Time elapsed: 0.01 sec - in org.apache.commons.lang3.exception.ContextedRuntimeExceptionTest
Running org.apache.commons.lang3.BitFieldTest
Tests run: 15, Failures: 0, Errors: 0, Skipped: 0, Time elapsed: 0.003 sec - in org.apache.commons.lang3.BitFieldTest
Running org.apache.commons.lang3.ArrayUtilsRemoveMultipleTest
Tests run: 55, Failures: 0, Errors: 0, Skipped: 0, Time elapsed: 0.011 sec - in org.apache.commons.lang3.ArrayUtilsRemoveMultipleTest
Running org.apache.commons.lang3.HashSetvBitSetTest
Ratio=9% array=100 count=1 extract=12040441 bitset=1166112
Ratio=6% array=100 count=10 extract=17917445 bitset=1145408
Ratio=4% array=100 count=50 extract=21922592 bitset=1030756
Ratio=4% array=100 count=100 extract=10112009 bitset=426183
Ratio=153% array=1000 count=10 extract=6320690 bitset=9671753
Ratio=30% array=1000 count=100 extract=18339542 bitset=5684283
Ratio=6% array=1000 count=500 extract=44178979 bitset=3084028
Ratio=1% array=1000 count=1000 extract=69656587 bitset=804387
Ratio=95% count=0 hash=2542514 bits=2440570
Ratio=7% count=5 hash=2726267 bits=202691
Ratio=30% count=10 hash=896879 bits=277676
Ratio=21% count=200 hash=19330369 bits=4142958
Ratio=17% count=50 hash=5765575 bits=996532
Ratio=26% count=100 hash=8634648 bits=2312900
Ratio=22% count=1000 hash=71841154 bits=15900802
Ratio=20% count=2000 hash=156393106 bits=31650620
Tests run: 2, Failures: 0, Errors: 0, Skipped: 0, Time elapsed: 0.637 sec - in org.apache.commons.lang3.HashSetvBitSetTest
Running org.apache.commons.lang3.StringUtilsTest
Tests run: 124, Failures: 0, Errors: 0, Skipped: 0, Time elapsed: 0.162 sec - in org.apache.commons.lang3.StringUtilsTest
Running org.apache.commons.lang3.ArrayUtilsRemoveTest
Tests run: 19, Failures: 0, Errors: 0, Skipped: 0, Time elapsed: 0 sec - in org.apache.commons.lang3.ArrayUtilsRemoveTest
Running org.apache.commons.lang3.ObjectUtilsTest
Tests run: 36, Failures: 0, Errors: 0, Skipped: 0, Time elapsed: 0.012 sec - in org.apache.commons.lang3.ObjectUtilsTest
Running org.apache.commons.lang3.ClassPathUtilsTest
Tests run: 13, Failures: 0, Errors: 0, Skipped: 0, Time elapsed: 0.002 sec - in org.apache.commons.lang3.ClassPathUtilsTest
Running org.apache.commons.lang3.math.NumberUtilsTest
Tests run: 91, Failures: 0, Errors: 0, Skipped: 0, Time elapsed: 0.035 sec - in org.apache.commons.lang3.math.NumberUtilsTest
Running org.apache.commons.lang3.math.IEEE754rUtilsTest
Tests run: 3, Failures: 0, Errors: 0, Skipped: 0, Time elapsed: 0 sec - in org.apache.commons.lang3.math.IEEE754rUtilsTest
Running org.apache.commons.lang3.math.FractionTest
Tests run: 25, Failures: 0, Errors: 0, Skipped: 0, Time elapsed: 0.366 sec - in org.apache.commons.lang3.math.FractionTest
Running org.apache.commons.lang3.BooleanUtilsTest
Tests run: 72, Failures: 0, Errors: 0, Skipped: 0, Time elapsed: 0.01 sec - in org.apache.commons.lang3.BooleanUtilsTest
Running org.apache.commons.lang3.CharSequenceUtilsTest
Tests run: 2, Failures: 0, Errors: 0, Skipped: 0, Time elapsed: 0 sec - in org.apache.commons.lang3.CharSequenceUtilsTest
Running org.apache.commons.lang3.CharSetUtilsTest
Tests run: 11, Failures: 0, Errors: 0, Skipped: 0, Time elapsed: 0.001 sec - in org.apache.commons.lang3.CharSetUtilsTest
Running org.apache.commons.lang3.ArrayUtilsAddTest
Tests run: 13, Failures: 0, Errors: 0, Skipped: 0, Time elapsed: 0.001 sec - in org.apache.commons.lang3.ArrayUtilsAddTest
Running org.apache.commons.lang3.CharEncodingTest
Tests run: 6, Failures: 0, Errors: 0, Skipped: 0, Time elapsed: 0.023 sec - in org.apache.commons.lang3.CharEncodingTest
Running org.apache.commons.lang3.ClassUtilsTest
Tests run: 57, Failures: 0, Errors: 0, Skipped: 0, Time elapsed: 0.023 sec - in org.apache.commons.lang3.ClassUtilsTest
Running org.apache.commons.lang3.RangeTest
Tests run: 24, Failures: 0, Errors: 0, Skipped: 0, Time elapsed: 0.005 sec - in org.apache.commons.lang3.RangeTest
Running org.apache.commons.lang3.event.EventUtilsTest
Tests run: 8, Failures: 0, Errors: 0, Skipped: 0, Time elapsed: 0.017 sec - in org.apache.commons.lang3.event.EventUtilsTest
Running org.apache.commons.lang3.event.EventListenerSupportTest
Tests run: 9, Failures: 0, Errors: 0, Skipped: 0, Time elapsed: 0.02 sec - in org.apache.commons.lang3.event.EventListenerSupportTest
Running org.apache.commons.lang3.ArrayUtilsTest
Tests run: 205, Failures: 0, Errors: 0, Skipped: 0, Time elapsed: 0.05 sec - in org.apache.commons.lang3.ArrayUtilsTest
Running org.apache.commons.lang3.CharUtilsTest
Tests run: 24, Failures: 0, Errors: 0, Skipped: 0, Time elapsed: 0.001 sec - in org.apache.commons.lang3.CharUtilsTest
Running org.apache.commons.lang3.NotImplementedExceptionTest
Tests run: 1, Failures: 0, Errors: 0, Skipped: 0, Time elapsed: 0 sec - in org.apache.commons.lang3.NotImplementedExceptionTest
Running org.apache.commons.lang3.StringUtilsEqualsIndexOfTest
Tests run: 50, Failures: 0, Errors: 0, Skipped: 0, Time elapsed: 0.009 sec - in org.apache.commons.lang3.StringUtilsEqualsIndexOfTest
Running org.apache.commons.lang3.RandomUtilsTest
Tests run: 23, Failures: 0, Errors: 0, Skipped: 0, Time elapsed: 0.004 sec - in org.apache.commons.lang3.RandomUtilsTest

Results :

Failed tests: 
  ToStringBuilderTest.after:48->validateNullToStringStyleRegistry:595 Expected null, actual: {[[C@1187b50=null, [Ljava.lang.Object;@63233638=null, [[Z@792cc6d9=null, [[B@3c859513=null, [[J@d385acb=null, [[S@659046f7=null, [[D@4d1d72a0=null, [[I@9b92078=null} expected null, but was:<{[[C@1187b50=null, [Ljava.lang.Object;@63233638=null, [[Z@792cc6d9=null, [[B@3c859513=null, [[J@d385acb=null, [[S@659046f7=null, [[D@4d1d72a0=null, [[I@9b92078=null}>
  ToStringBuilderTest.after:48->validateNullToStringStyleRegistry:595 Expected null, actual: {[Ljava.lang.Object;@63233638=null, [[Z@792cc6d9=null, [[B@3c859513=null, [[J@d385acb=null, [[S@659046f7=null, [[D@4d1d72a0=null, [[I@9b92078=null} expected null, but was:<{[Ljava.lang.Object;@63233638=null, [[Z@792cc6d9=null, [[B@3c859513=null, [[J@d385acb=null, [[S@659046f7=null, [[D@4d1d72a0=null, [[I@9b92078=null}>
  ToStringBuilderTest.after:48->validateNullToStringStyleRegistry:595 Expected null, actual: {[[J@d385acb=null} expected null, but was:<{[[J@d385acb=null}>
  ToStringBuilderTest.after:48->validateNullToStringStyleRegistry:595 Expected null, actual: {[[J@d385acb=null} expected null, but was:<{[[J@d385acb=null}>
  ToStringBuilderTest.after:48->validateNullToStringStyleRegistry:595 Expected null, actual: {[[J@d385acb=null, [[D@4d1d72a0=null} expected null, but was:<{[[J@d385acb=null, [[D@4d1d72a0=null}>
  ToStringBuilderTest.after:48->validateNullToStringStyleRegistry:595 Expected null, actual: {[[J@d385acb=null} expected null, but was:<{[[J@d385acb=null}>
  ToStringBuilderTest.after:48->validateNullToStringStyleRegistry:595 Expected null, actual: {[[C@1187b50=null, [Ljava.lang.Object;@63233638=null, [[Z@792cc6d9=null, [[B@3c859513=null, [[J@d385acb=null, [[S@659046f7=null, [[D@4d1d72a0=null, [[I@9b92078=null} expected null, but was:<{[[C@1187b50=null, [Ljava.lang.Object;@63233638=null, [[Z@792cc6d9=null, [[B@3c859513=null, [[J@d385acb=null, [[S@659046f7=null, [[D@4d1d72a0=null, [[I@9b92078=null}>
  ToStringBuilderTest.after:48->validateNullToStringStyleRegistry:595 Expected null, actual: {[[J@d385acb=null} expected null, but was:<{[[J@d385acb=null}>
  ToStringBuilderTest.after:48->validateNullToStringStyleRegistry:595 Expected null, actual: {[[C@1187b50=null, [Ljava.lang.Object;@63233638=null, [[Z@792cc6d9=null, [[B@3c859513=null, [[J@d385acb=null, [[S@659046f7=null, [[D@4d1d72a0=null, [[I@9b92078=null} expected null, but was:<{[[C@1187b50=null, [Ljava.lang.Object;@63233638=null, [[Z@792cc6d9=null, [[B@3c859513=null, [[J@d385acb=null, [[S@659046f7=null, [[D@4d1d72a0=null, [[I@9b92078=null}>
  ToStringBuilderTest.after:48->validateNullToStringStyleRegistry:595 Expected null, actual: {[[J@d385acb=null, [[S@659046f7=null, [[D@4d1d72a0=null, [[I@9b92078=null} expected null, but was:<{[[J@d385acb=null, [[S@659046f7=null, [[D@4d1d72a0=null, [[I@9b92078=null}>
  ToStringBuilderTest.after:48->validateNullToStringStyleRegistry:595 Expected null, actual: {[[J@d385acb=null, [[S@659046f7=null, [[D@4d1d72a0=null, [[I@9b92078=null} expected null, but was:<{[[J@d385acb=null, [[S@659046f7=null, [[D@4d1d72a0=null, [[I@9b92078=null}>
  ToStringBuilderTest.after:48->validateNullToStringStyleRegistry:595 Expected null, actual: {[[J@d385acb=null, [[S@659046f7=null, [[D@4d1d72a0=null, [[I@9b92078=null} expected null, but was:<{[[J@d385acb=null, [[S@659046f7=null, [[D@4d1d72a0=null, [[I@9b92078=null}>
  ToStringBuilderTest.after:48->validateNullToStringStyleRegistry:595 Expected null, actual: {[[C@1187b50=null, [Ljava.lang.Object;@63233638=null, [[Z@792cc6d9=null, [[B@3c859513=null, [[J@d385acb=null, [[S@659046f7=null, [[D@4d1d72a0=null, [[I@9b92078=null} expected null, but was:<{[[C@1187b50=null, [Ljava.lang.Object;@63233638=null, [[Z@792cc6d9=null, [[B@3c859513=null, [[J@d385acb=null, [[S@659046f7=null, [[D@4d1d72a0=null, [[I@9b92078=null}>
  ToStringBuilderTest.after:48->validateNullToStringStyleRegistry:595 Expected null, actual: {[[C@1187b50=null, [Ljava.lang.Object;@63233638=null, [[Z@792cc6d9=null, [[B@3c859513=null, [[J@d385acb=null, [[S@659046f7=null, [[D@4d1d72a0=null, [[I@9b92078=null} expected null, but was:<{[[C@1187b50=null, [Ljava.lang.Object;@63233638=null, [[Z@792cc6d9=null, [[B@3c859513=null, [[J@d385acb=null, [[S@659046f7=null, [[D@4d1d72a0=null, [[I@9b92078=null}>
  ToStringBuilderTest.after:48->validateNullToStringStyleRegistry:595 Expected null, actual: {[[J@d385acb=null} expected null, but was:<{[[J@d385acb=null}>
  ToStringBuilderTest.after:48->validateNullToStringStyleRegistry:595 Expected null, actual: {[[J@d385acb=null, [[D@4d1d72a0=null} expected null, but was:<{[[J@d385acb=null, [[D@4d1d72a0=null}>
  ToStringBuilderTest.after:48->validateNullToStringStyleRegistry:595 Expected null, actual: {[[C@1187b50=null, [Ljava.lang.Object;@63233638=null, [[Z@792cc6d9=null, [[B@3c859513=null, [[J@d385acb=null, [[S@659046f7=null, [[D@4d1d72a0=null, [[I@9b92078=null} expected null, but was:<{[[C@1187b50=null, [Ljava.lang.Object;@63233638=null, [[Z@792cc6d9=null, [[B@3c859513=null, [[J@d385acb=null, [[S@659046f7=null, [[D@4d1d72a0=null, [[I@9b92078=null}>
  ToStringBuilderTest.after:48->validateNullToStringStyleRegistry:595 Expected null, actual: {[Ljava.lang.Object;@63233638=null, [[Z@792cc6d9=null, [[J@d385acb=null, [[S@659046f7=null, [[D@4d1d72a0=null, [[I@9b92078=null} expected null, but was:<{[Ljava.lang.Object;@63233638=null, [[Z@792cc6d9=null, [[J@d385acb=null, [[S@659046f7=null, [[D@4d1d72a0=null, [[I@9b92078=null}>
  ToStringBuilderTest.after:48->validateNullToStringStyleRegistry:595 Expected null, actual: {[[C@1187b50=null, [Ljava.lang.Object;@63233638=null, [[Z@792cc6d9=null, [[B@3c859513=null, [[J@d385acb=null, [[S@659046f7=null, [[D@4d1d72a0=null, [[I@9b92078=null} expected null, but was:<{[[C@1187b50=null, [Ljava.lang.Object;@63233638=null, [[Z@792cc6d9=null, [[B@3c859513=null, [[J@d385acb=null, [[S@659046f7=null, [[D@4d1d72a0=null, [[I@9b92078=null}>
  ToStringBuilderTest.after:48->validateNullToStringStyleRegistry:595 Expected null, actual: {[[C@1187b50=null, [Ljava.lang.Object;@63233638=null, [[Z@792cc6d9=null, [[B@3c859513=null, [[J@d385acb=null, [[S@659046f7=null, [[D@4d1d72a0=null, [[I@9b92078=null} expected null, but was:<{[[C@1187b50=null, [Ljava.lang.Object;@63233638=null, [[Z@792cc6d9=null, [[B@3c859513=null, [[J@d385acb=null, [[S@659046f7=null, [[D@4d1d72a0=null, [[I@9b92078=null}>
  ToStringBuilderTest.after:48->validateNullToStringStyleRegistry:595 Expected null, actual: {[Ljava.lang.Object;@63233638=null, [[Z@792cc6d9=null, [[J@d385acb=null, [[S@659046f7=null, [[D@4d1d72a0=null, [[I@9b92078=null} expected null, but was:<{[Ljava.lang.Object;@63233638=null, [[Z@792cc6d9=null, [[J@d385acb=null, [[S@659046f7=null, [[D@4d1d72a0=null, [[I@9b92078=null}>
  ToStringBuilderTest.after:48->validateNullToStringStyleRegistry:595 Expected null, actual: {[[J@d385acb=null} expected null, but was:<{[[J@d385acb=null}>
  ToStringBuilderTest.after:48->validateNullToStringStyleRegistry:595 Expected null, actual: {[Ljava.lang.Object;@63233638=null, [[Z@792cc6d9=null, [[J@d385acb=null, [[S@659046f7=null, [[D@4d1d72a0=null, [[I@9b92078=null} expected null, but was:<{[Ljava.lang.Object;@63233638=null, [[Z@792cc6d9=null, [[J@d385acb=null, [[S@659046f7=null, [[D@4d1d72a0=null, [[I@9b92078=null}>
  ToStringBuilderTest.after:48->validateNullToStringStyleRegistry:595 Expected null, actual: {[[J@d385acb=null} expected null, but was:<{[[J@d385acb=null}>
  ToStringBuilderTest.after:48->validateNullToStringStyleRegistry:595 Expected null, actual: {[[C@1187b50=null, [Ljava.lang.Object;@63233638=null, [[Z@792cc6d9=null, [[B@3c859513=null, [[J@d385acb=null, [[S@659046f7=null, [[D@4d1d72a0=null, [[I@9b92078=null} expected null, but was:<{[[C@1187b50=null, [Ljava.lang.Object;@63233638=null, [[Z@792cc6d9=null, [[B@3c859513=null, [[J@d385acb=null, [[S@659046f7=null, [[D@4d1d72a0=null, [[I@9b92078=null}>
org.apache.commons.lang3.builder.ToStringBuilderTest.testReflectionArrayAndObjectCycle(org.apache.commons.lang3.builder.ToStringBuilderTest)
  Run 1: ToStringBuilderTest.testReflectionArrayAndObjectCycle:576 expected:<...g.Object;@135fa2b9[{[org.apache.commons.lang3.builder.ToStringBuilderTest$SimpleReflectionTestFixture@6bb4299e[o=[Ljava.lang.Object;@135fa2b9]]}]> but was:<...g.Object;@135fa2b9[{[<null>]}]>
  Run 2: ToStringBuilderTest.after:48->validateNullToStringStyleRegistry:595 Expected null, actual: {[Ljava.lang.Object;@63233638=null, [[Z@792cc6d9=null, [[B@3c859513=null, [[J@d385acb=null, [[S@659046f7=null, [[D@4d1d72a0=null, [[I@9b92078=null} expected null, but was:<{[Ljava.lang.Object;@63233638=null, [[Z@792cc6d9=null, [[B@3c859513=null, [[J@d385acb=null, [[S@659046f7=null, [[D@4d1d72a0=null, [[I@9b92078=null}>

org.apache.commons.lang3.builder.ToStringBuilderTest.testReflectionArrayArrayCycle(org.apache.commons.lang3.builder.ToStringBuilderTest)
  Run 1: ToStringBuilderTest.testReflectionArrayArrayCycle:432 expected:<...g.Object;@5878ea78[{[{[[Ljava.lang.Object;@5878ea78,[[Ljava.lang.Object;@5878ea78},{[[Ljava.lang.Object;@5878ea78,[[Ljava.lang.Object;@5878ea78}]}]> but was:<...g.Object;@5878ea78[{[<null>,<null>]}]>
  Run 2: ToStringBuilderTest.after:48->validateNullToStringStyleRegistry:595 Expected null, actual: {[[J@d385acb=null} expected null, but was:<{[[J@d385acb=null}>

  ToStringBuilderTest.testReflectionArrayCycle:402 expected:<...g.Object;@6d392fa5[{[[Ljava.lang.Object;@6d392fa5]}]> but was:<...g.Object;@6d392fa5[{[<null>]}]>
org.apache.commons.lang3.builder.ToStringBuilderTest.testReflectionArrayCycleLevel2(org.apache.commons.lang3.builder.ToStringBuilderTest)
  Run 1: ToStringBuilderTest.testReflectionArrayCycleLevel2:416 expected:<...g.Object;@65fe316f[{[{[Ljava.lang.Object;@65fe316f}]}]> but was:<...g.Object;@65fe316f[{[<null>]}]>
  Run 2: ToStringBuilderTest.after:48->validateNullToStringStyleRegistry:595 Expected null, actual: {[Ljava.lang.Object;@63233638=null, [[Z@792cc6d9=null, [[B@3c859513=null, [[J@d385acb=null, [[S@659046f7=null, [[D@4d1d72a0=null, [[I@9b92078=null} expected null, but was:<{[Ljava.lang.Object;@63233638=null, [[Z@792cc6d9=null, [[B@3c859513=null, [[J@d385acb=null, [[S@659046f7=null, [[D@4d1d72a0=null, [[I@9b92078=null}>

org.apache.commons.lang3.builder.ToStringBuilderTest.testReflectionBooleanArray(org.apache.commons.lang3.builder.ToStringBuilderTest)
  Run 1: ToStringBuilderTest.testReflectionBooleanArray:232 expected:<[Z@48508ded[{[true,false,false]}]> but was:<[Z@48508ded[{[<null>,<null>,<null>]}]>
  Run 2: ToStringBuilderTest.after:48->validateNullToStringStyleRegistry:595 Expected null, actual: {[[J@d385acb=null, [[D@4d1d72a0=null} expected null, but was:<{[[J@d385acb=null, [[D@4d1d72a0=null}>

org.apache.commons.lang3.builder.ToStringBuilderTest.testReflectionCharArray(org.apache.commons.lang3.builder.ToStringBuilderTest)
  Run 1: ToStringBuilderTest.testReflectionCharArray:205 expected:<[C@2ee3ff04[{[A,2,_,D]}]> but was:<[C@2ee3ff04[{[<null>,<null>,<null>,<null>]}]>
  Run 2: ToStringBuilderTest.after:48->validateNullToStringStyleRegistry:595 Expected null, actual: {[[C@1187b50=null, [Ljava.lang.Object;@63233638=null, [[Z@792cc6d9=null, [[B@3c859513=null, [[J@d385acb=null, [[S@659046f7=null, [[D@4d1d72a0=null, [[I@9b92078=null} expected null, but was:<{[[C@1187b50=null, [Ljava.lang.Object;@63233638=null, [[Z@792cc6d9=null, [[B@3c859513=null, [[J@d385acb=null, [[S@659046f7=null, [[D@4d1d72a0=null, [[I@9b92078=null}>

  ToStringBuilderTest.after:48->validateNullToStringStyleRegistry:595 Expected null, actual: {[[C@1187b50=null, [Ljava.lang.Object;@63233638=null, [[Z@792cc6d9=null, [[B@3c859513=null, [[J@d385acb=null, [[S@659046f7=null, [[D@4d1d72a0=null, [[I@9b92078=null} expected null, but was:<{[[C@1187b50=null, [Ljava.lang.Object;@63233638=null, [[Z@792cc6d9=null, [[B@3c859513=null, [[J@d385acb=null, [[S@659046f7=null, [[D@4d1d72a0=null, [[I@9b92078=null}>
org.apache.commons.lang3.builder.ToStringBuilderTest.testReflectionDoubleArray(org.apache.commons.lang3.builder.ToStringBuilderTest)
  Run 1: ToStringBuilderTest.testReflectionDoubleArray:214 expected:<[D@672e3194[{[1.0,2.9876,-3.00001,4.3]}]> but was:<[D@672e3194[{[<null>,<null>,<null>,<null>]}]>
  Run 2: ToStringBuilderTest.after:48->validateNullToStringStyleRegistry:595 Expected null, actual: {[[J@d385acb=null, [[D@4d1d72a0=null} expected null, but was:<{[[J@d385acb=null, [[D@4d1d72a0=null}>

org.apache.commons.lang3.builder.ToStringBuilderTest.testReflectionFloatArray(org.apache.commons.lang3.builder.ToStringBuilderTest)
  Run 1: ToStringBuilderTest.testReflectionFloatArray:223 expected:<[F@6a6999a8[{[1.0,2.9876,-3.00001,4.3]}]> but was:<[F@6a6999a8[{[<null>,<null>,<null>,<null>]}]>
  Run 2: ToStringBuilderTest.after:48->validateNullToStringStyleRegistry:595 Expected null, actual: {[[J@d385acb=null} expected null, but was:<{[[J@d385acb=null}>

org.apache.commons.lang3.builder.ToStringBuilderTest.testReflectionIntArray(org.apache.commons.lang3.builder.ToStringBuilderTest)
  Run 1: ToStringBuilderTest.testReflectionIntArray:178 expected:<[I@3f0821d0[{[1,2,-3,4]}]> but was:<[I@3f0821d0[{[<null>,<null>,<null>,<null>]}]>
  Run 2: ToStringBuilderTest.after:48->validateNullToStringStyleRegistry:595 Expected null, actual: {[[C@1187b50=null, [Ljava.lang.Object;@63233638=null, [[Z@792cc6d9=null, [[B@3c859513=null, [[J@d385acb=null, [[S@659046f7=null, [[D@4d1d72a0=null, [[I@9b92078=null} expected null, but was:<{[[C@1187b50=null, [Ljava.lang.Object;@63233638=null, [[Z@792cc6d9=null, [[B@3c859513=null, [[J@d385acb=null, [[S@659046f7=null, [[D@4d1d72a0=null, [[I@9b92078=null}>

  ToStringBuilderTest.after:48->validateNullToStringStyleRegistry:595 Expected null, actual: {[[J@d385acb=null, [[D@4d1d72a0=null} expected null, but was:<{[[J@d385acb=null, [[D@4d1d72a0=null}>
org.apache.commons.lang3.builder.ToStringBuilderTest.testReflectionLongArray(org.apache.commons.lang3.builder.ToStringBuilderTest)
  Run 1: ToStringBuilderTest.testReflectionLongArray:169 expected:<[J@30a2268a[{[1,2,-3,4]}]> but was:<[J@30a2268a[{[<null>,<null>,<null>,<null>]}]>
  Run 2: ToStringBuilderTest.after:48->validateNullToStringStyleRegistry:595 Expected null, actual: {[[J@d385acb=null, [[D@4d1d72a0=null, [[I@9b92078=null} expected null, but was:<{[[J@d385acb=null, [[D@4d1d72a0=null, [[I@9b92078=null}>

  ToStringBuilderTest.after:48->validateNullToStringStyleRegistry:595 Expected null, actual: {[Ljava.lang.Object;@63233638=null, [[J@d385acb=null, [[S@659046f7=null, [[D@4d1d72a0=null, [[I@9b92078=null} expected null, but was:<{[Ljava.lang.Object;@63233638=null, [[J@d385acb=null, [[S@659046f7=null, [[D@4d1d72a0=null, [[I@9b92078=null}>
org.apache.commons.lang3.builder.ToStringBuilderTest.testReflectionShortArray(org.apache.commons.lang3.builder.ToStringBuilderTest)
  Run 1: ToStringBuilderTest.testReflectionShortArray:187 expected:<[S@697a3d13[{[1,2,-3,4]}]> but was:<[S@697a3d13[{[<null>,<null>,<null>,<null>]}]>
  Run 2: ToStringBuilderTest.after:48->validateNullToStringStyleRegistry:595 Expected null, actual: {[[C@1187b50=null, [Ljava.lang.Object;@63233638=null, [[Z@792cc6d9=null, [[B@3c859513=null, [[J@d385acb=null, [[S@659046f7=null, [[D@4d1d72a0=null, [[I@9b92078=null} expected null, but was:<{[[C@1187b50=null, [Ljava.lang.Object;@63233638=null, [[Z@792cc6d9=null, [[B@3c859513=null, [[J@d385acb=null, [[S@659046f7=null, [[D@4d1d72a0=null, [[I@9b92078=null}>

  ToStringBuilderTest.after:48->validateNullToStringStyleRegistry:595 Expected null, actual: {[[J@d385acb=null, [[D@4d1d72a0=null, [[I@9b92078=null} expected null, but was:<{[[J@d385acb=null, [[D@4d1d72a0=null, [[I@9b92078=null}>
org.apache.commons.lang3.builder.ToStringBuilderTest.testReflectionyteArray(org.apache.commons.lang3.builder.ToStringBuilderTest)
  Run 1: ToStringBuilderTest.testReflectionyteArray:196 expected:<[B@13405f43[{[1,2,-3,4]}]> but was:<[B@13405f43[{[<null>,<null>,<null>,<null>]}]>
  Run 2: ToStringBuilderTest.after:48->validateNullToStringStyleRegistry:595 Expected null, actual: {[[J@d385acb=null, [[D@4d1d72a0=null} expected null, but was:<{[[J@d385acb=null, [[D@4d1d72a0=null}>

  ToStringBuilderTest.after:48->validateNullToStringStyleRegistry:595 Expected null, actual: {[[C@1187b50=null, [Ljava.lang.Object;@63233638=null, [[Z@792cc6d9=null, [[B@3c859513=null, [[J@d385acb=null, [[S@659046f7=null, [[D@4d1d72a0=null, [[I@9b92078=null} expected null, but was:<{[[C@1187b50=null, [Ljava.lang.Object;@63233638=null, [[Z@792cc6d9=null, [[B@3c859513=null, [[J@d385acb=null, [[S@659046f7=null, [[D@4d1d72a0=null, [[I@9b92078=null}>
  ToStringBuilderTest.after:48->validateNullToStringStyleRegistry:595 Expected null, actual: {[Ljava.lang.Object;@63233638=null, [[Z@792cc6d9=null, [[B@3c859513=null, [[J@d385acb=null, [[S@659046f7=null, [[D@4d1d72a0=null, [[I@9b92078=null} expected null, but was:<{[Ljava.lang.Object;@63233638=null, [[Z@792cc6d9=null, [[B@3c859513=null, [[J@d385acb=null, [[S@659046f7=null, [[D@4d1d72a0=null, [[I@9b92078=null}>
  ToStringBuilderTest.after:48->validateNullToStringStyleRegistry:595 Expected null, actual: {[[J@d385acb=null} expected null, but was:<{[[J@d385acb=null}>
  ToStringBuilderTest.after:48->validateNullToStringStyleRegistry:595 Expected null, actual: {[Ljava.lang.Object;@63233638=null, [[Z@792cc6d9=null, [[J@d385acb=null, [[S@659046f7=null, [[D@4d1d72a0=null, [[I@9b92078=null} expected null, but was:<{[Ljava.lang.Object;@63233638=null, [[Z@792cc6d9=null, [[J@d385acb=null, [[S@659046f7=null, [[D@4d1d72a0=null, [[I@9b92078=null}>
  ToStringBuilderTest.after:48->validateNullToStringStyleRegistry:595 Expected null, actual: {[Ljava.lang.Object;@63233638=null, [[Z@792cc6d9=null, [[J@d385acb=null, [[S@659046f7=null, [[D@4d1d72a0=null, [[I@9b92078=null} expected null, but was:<{[Ljava.lang.Object;@63233638=null, [[Z@792cc6d9=null, [[J@d385acb=null, [[S@659046f7=null, [[D@4d1d72a0=null, [[I@9b92078=null}>
  ToStringBuilderTest.after:48->validateNullToStringStyleRegistry:595 Expected null, actual: {[[J@d385acb=null, [[D@4d1d72a0=null, [[I@9b92078=null} expected null, but was:<{[[J@d385acb=null, [[D@4d1d72a0=null, [[I@9b92078=null}>
  ToStringBuilderTest.after:48->validateNullToStringStyleRegistry:595 Expected null, actual: {[[J@d385acb=null} expected null, but was:<{[[J@d385acb=null}>

Tests in error: 
org.apache.commons.lang3.builder.ToStringBuilderTest.testReflectionBooleanArrayArray(org.apache.commons.lang3.builder.ToStringBuilderTest)
  Run 1: ToStringBuilderTest.testReflectionBooleanArrayArray:307 » NullPointer
  Run 2: ToStringBuilderTest.after:48->validateNullToStringStyleRegistry:595 Expected null, actual: {[Ljava.lang.Object;@63233638=null, [[Z@792cc6d9=null, [[J@d385acb=null, [[S@659046f7=null, [[D@4d1d72a0=null, [[I@9b92078=null} expected null, but was:<{[Ljava.lang.Object;@63233638=null, [[Z@792cc6d9=null, [[J@d385acb=null, [[S@659046f7=null, [[D@4d1d72a0=null, [[I@9b92078=null}>

org.apache.commons.lang3.builder.ToStringBuilderTest.testReflectionByteArrayArray(org.apache.commons.lang3.builder.ToStringBuilderTest)
  Run 1: ToStringBuilderTest.testReflectionByteArrayArray:280 » NullPointer
  Run 2: ToStringBuilderTest.after:48->validateNullToStringStyleRegistry:595 Expected null, actual: {[Ljava.lang.Object;@63233638=null, [[Z@792cc6d9=null, [[B@3c859513=null, [[J@d385acb=null, [[S@659046f7=null, [[D@4d1d72a0=null, [[I@9b92078=null} expected null, but was:<{[Ljava.lang.Object;@63233638=null, [[Z@792cc6d9=null, [[B@3c859513=null, [[J@d385acb=null, [[S@659046f7=null, [[D@4d1d72a0=null, [[I@9b92078=null}>

org.apache.commons.lang3.builder.ToStringBuilderTest.testReflectionCharArrayArray(org.apache.commons.lang3.builder.ToStringBuilderTest)
  Run 1: ToStringBuilderTest.testReflectionCharArrayArray:289 » NullPointer
  Run 2: ToStringBuilderTest.after:48->validateNullToStringStyleRegistry:595 Expected null, actual: {[[C@1187b50=null, [Ljava.lang.Object;@63233638=null, [[Z@792cc6d9=null, [[B@3c859513=null, [[J@d385acb=null, [[S@659046f7=null, [[D@4d1d72a0=null, [[I@9b92078=null} expected null, but was:<{[[C@1187b50=null, [Ljava.lang.Object;@63233638=null, [[Z@792cc6d9=null, [[B@3c859513=null, [[J@d385acb=null, [[S@659046f7=null, [[D@4d1d72a0=null, [[I@9b92078=null}>

org.apache.commons.lang3.builder.ToStringBuilderTest.testReflectionDoubleArrayArray(org.apache.commons.lang3.builder.ToStringBuilderTest)
  Run 1: ToStringBuilderTest.testReflectionDoubleArrayArray:298 » NullPointer
  Run 2: ToStringBuilderTest.after:48->validateNullToStringStyleRegistry:595 Expected null, actual: {[[J@d385acb=null, [[D@4d1d72a0=null} expected null, but was:<{[[J@d385acb=null, [[D@4d1d72a0=null}>

org.apache.commons.lang3.builder.ToStringBuilderTest.testReflectionFloatArrayArray(org.apache.commons.lang3.builder.ToStringBuilderTest)
  Run 1: ToStringBuilderTest.testReflectionFloatArrayArray:243 » NullPointer
  Run 2: ToStringBuilderTest.after:48->validateNullToStringStyleRegistry:595 Expected null, actual: {[[C@1187b50=null, [[F@209740de=null, [Ljava.lang.Object;@63233638=null, [[Z@792cc6d9=null, [[B@3c859513=null, [[J@d385acb=null, [[S@659046f7=null, [[D@4d1d72a0=null, [[I@9b92078=null} expected null, but was:<{[[C@1187b50=null, [[F@209740de=null, [Ljava.lang.Object;@63233638=null, [[Z@792cc6d9=null, [[B@3c859513=null, [[J@d385acb=null, [[S@659046f7=null, [[D@4d1d72a0=null, [[I@9b92078=null}>

org.apache.commons.lang3.builder.ToStringBuilderTest.testReflectionIntArrayArray(org.apache.commons.lang3.builder.ToStringBuilderTest)
  Run 1: ToStringBuilderTest.testReflectionIntArrayArray:262 » NullPointer
  Run 2: ToStringBuilderTest.after:48->validateNullToStringStyleRegistry:595 Expected null, actual: {[[J@d385acb=null, [[D@4d1d72a0=null, [[I@9b92078=null} expected null, but was:<{[[J@d385acb=null, [[D@4d1d72a0=null, [[I@9b92078=null}>

org.apache.commons.lang3.builder.ToStringBuilderTest.testReflectionLongArrayArray(org.apache.commons.lang3.builder.ToStringBuilderTest)
  Run 1: ToStringBuilderTest.testReflectionLongArrayArray:253 » NullPointer
  Run 2: ToStringBuilderTest.after:48->validateNullToStringStyleRegistry:595 Expected null, actual: {[[J@d385acb=null} expected null, but was:<{[[J@d385acb=null}>

org.apache.commons.lang3.builder.ToStringBuilderTest.testReflectionObjectArray(org.apache.commons.lang3.builder.ToStringBuilderTest)
  Run 1: ToStringBuilderTest.testReflectionObjectArray:160 » NullPointer
  Run 2: ToStringBuilderTest.after:48->validateNullToStringStyleRegistry:595 Expected null, actual: {[Ljava.lang.Object;@63233638=null, [[J@d385acb=null, [[S@659046f7=null, [[D@4d1d72a0=null, [[I@9b92078=null} expected null, but was:<{[Ljava.lang.Object;@63233638=null, [[J@d385acb=null, [[S@659046f7=null, [[D@4d1d72a0=null, [[I@9b92078=null}>

org.apache.commons.lang3.builder.ToStringBuilderTest.testReflectionhortArrayArray(org.apache.commons.lang3.builder.ToStringBuilderTest)
  Run 1: ToStringBuilderTest.testReflectionhortArrayArray:271 » NullPointer
  Run 2: ToStringBuilderTest.after:48->validateNullToStringStyleRegistry:595 Expected null, actual: {[[J@d385acb=null, [[S@659046f7=null, [[D@4d1d72a0=null, [[I@9b92078=null} expected null, but was:<{[[J@d385acb=null, [[S@659046f7=null, [[D@4d1d72a0=null, [[I@9b92078=null}>



Tests run: 3526, Failures: 48, Errors: 9, Skipped: 97

[INFO] ------------------------------------------------------------------------
[INFO] BUILD FAILURE
[INFO] ------------------------------------------------------------------------
[INFO] Total time: 35.366s
[INFO] Finished at: Tue Aug 04 09:00:46 BST 2015
[INFO] Final Memory: 23M/414M
[INFO] ------------------------------------------------------------------------
[ERROR] Failed to execute goal org.apache.maven.plugins:maven-surefire-plugin:2.18:test (default-test) on project commons-lang3: There are test failures.
[ERROR] 
[ERROR] Please refer to /home/perham/Study/LittleDarwin/Cases/commons-lang3-3.4-src/target/surefire-reports for the individual test results.
[ERROR] -> [Help 1]
[ERROR] 
[ERROR] To see the full stack trace of the errors, re-run Maven with the -e switch.
[ERROR] Re-run Maven using the -X switch to enable full debug logging.
[ERROR] 
[ERROR] For more information about the errors and possible solutions, please read the following articles:
[ERROR] [Help 1] http://cwiki.apache.org/confluence/display/MAVEN/MojoFailureException
