[INFO] Scanning for projects...
[INFO]                                                                         
[INFO] ------------------------------------------------------------------------
[INFO] Building Apache Commons Lang 3.4
[INFO] ------------------------------------------------------------------------
[INFO] 
[INFO] --- maven-enforcer-plugin:1.3.1:enforce (enforce-maven-3) @ commons-lang3 ---
[INFO] 
[INFO] --- build-helper-maven-plugin:1.8:parse-version (parse-version) @ commons-lang3 ---
[INFO] 
[INFO] --- maven-antrun-plugin:1.8:run (javadoc.resources) @ commons-lang3 ---
[INFO] Executing tasks

main:
[INFO] Executed tasks
[INFO] 
[INFO] --- maven-remote-resources-plugin:1.5:process (default) @ commons-lang3 ---
[INFO] 
[INFO] --- buildnumber-maven-plugin:1.3:create (default) @ commons-lang3 ---
[INFO] Executing: /bin/sh -c cd /home/perham/Study/LittleDarwin/Cases/commons-lang3-3.4-src && svn --non-interactive info
[INFO] Working directory: /home/perham/Study/LittleDarwin/Cases/commons-lang3-3.4-src
[INFO] Storing buildNumber: ?????? at timestamp: 1438674299414
[INFO] Executing: /bin/sh -c cd /home/perham/Study/LittleDarwin/Cases/commons-lang3-3.4-src && svn --non-interactive info
[INFO] Working directory: /home/perham/Study/LittleDarwin/Cases/commons-lang3-3.4-src
[INFO] Storing buildScmBranch: UNKNOWN_BRANCH
[INFO] 
[INFO] --- maven-resources-plugin:2.7:resources (default-resources) @ commons-lang3 ---
[INFO] Using 'ISO-8859-1' encoding to copy filtered resources.
[INFO] Copying 0 resource
[INFO] Copying 2 resources to META-INF
[INFO] 
[INFO] --- maven-compiler-plugin:3.2:compile (default-compile) @ commons-lang3 ---
[INFO] Changes detected - recompiling the module!
[INFO] Compiling 133 source files to /home/perham/Study/LittleDarwin/Cases/commons-lang3-3.4-src/target/classes
[INFO] /home/perham/Study/LittleDarwin/Cases/commons-lang3-3.4-src/src/main/java/org/apache/commons/lang3/SerializationUtils.java: /home/perham/Study/LittleDarwin/Cases/commons-lang3-3.4-src/src/main/java/org/apache/commons/lang3/SerializationUtils.java uses unchecked or unsafe operations.
[INFO] /home/perham/Study/LittleDarwin/Cases/commons-lang3-3.4-src/src/main/java/org/apache/commons/lang3/SerializationUtils.java: Recompile with -Xlint:unchecked for details.
[INFO] 
[INFO] --- maven-bundle-plugin:2.5.3:manifest (bundle-manifest) @ commons-lang3 ---
[INFO] 
[INFO] --- animal-sniffer-maven-plugin:1.13:check (checkAPIcompatibility) @ commons-lang3 ---
[INFO] Checking unresolved references to org.codehaus.mojo.signature:java16:1.0
[INFO] 
[INFO] --- maven-resources-plugin:2.7:testResources (default-testResources) @ commons-lang3 ---
[INFO] Using 'ISO-8859-1' encoding to copy filtered resources.
[INFO] Copying 2 resources
[INFO] Copying 2 resources to META-INF
[INFO] 
[INFO] --- maven-compiler-plugin:3.2:testCompile (default-testCompile) @ commons-lang3 ---
[INFO] Nothing to compile - all classes are up to date
[INFO] 
[INFO] --- maven-surefire-plugin:2.18:test (default-test) @ commons-lang3 ---
[INFO] Surefire report directory: /home/perham/Study/LittleDarwin/Cases/commons-lang3-3.4-src/target/surefire-reports

-------------------------------------------------------
 T E S T S
-------------------------------------------------------
Running org.apache.commons.lang3.ValidateTest
Tests run: 63, Failures: 0, Errors: 0, Skipped: 0, Time elapsed: 0.031 sec - in org.apache.commons.lang3.ValidateTest
Running org.apache.commons.lang3.LocaleUtilsTest
Tests run: 15, Failures: 0, Errors: 0, Skipped: 0, Time elapsed: 0.017 sec - in org.apache.commons.lang3.LocaleUtilsTest
Running org.apache.commons.lang3.tuple.MutableTripleTest
Tests run: 8, Failures: 0, Errors: 0, Skipped: 0, Time elapsed: 0.008 sec - in org.apache.commons.lang3.tuple.MutableTripleTest
Running org.apache.commons.lang3.tuple.TripleTest
Tests run: 10, Failures: 0, Errors: 0, Skipped: 0, Time elapsed: 0.006 sec - in org.apache.commons.lang3.tuple.TripleTest
Running org.apache.commons.lang3.tuple.ImmutablePairTest
Tests run: 6, Failures: 0, Errors: 0, Skipped: 0, Time elapsed: 0.001 sec - in org.apache.commons.lang3.tuple.ImmutablePairTest
Running org.apache.commons.lang3.tuple.MutablePairTest
Tests run: 8, Failures: 0, Errors: 0, Skipped: 0, Time elapsed: 0.005 sec - in org.apache.commons.lang3.tuple.MutablePairTest
Running org.apache.commons.lang3.tuple.ImmutableTripleTest
Tests run: 6, Failures: 0, Errors: 0, Skipped: 0, Time elapsed: 0.001 sec - in org.apache.commons.lang3.tuple.ImmutableTripleTest
Running org.apache.commons.lang3.tuple.PairTest
Tests run: 9, Failures: 0, Errors: 0, Skipped: 0, Time elapsed: 0.002 sec - in org.apache.commons.lang3.tuple.PairTest
Running org.apache.commons.lang3.StringUtilsIsTest
Tests run: 8, Failures: 0, Errors: 0, Skipped: 0, Time elapsed: 0.012 sec - in org.apache.commons.lang3.StringUtilsIsTest
Running org.apache.commons.lang3.JavaVersionTest
Tests run: 3, Failures: 0, Errors: 0, Skipped: 0, Time elapsed: 0.002 sec - in org.apache.commons.lang3.JavaVersionTest
Running org.apache.commons.lang3.builder.NoFieldNamesToStringStyleTest
Tests run: 8, Failures: 8, Errors: 0, Skipped: 0, Time elapsed: 0.014 sec <<< FAILURE! - in org.apache.commons.lang3.builder.NoFieldNamesToStringStyleTest
testObjectArray(org.apache.commons.lang3.builder.NoFieldNamesToStringStyleTest)  Time elapsed: 0.011 sec  <<< FAILURE!
org.junit.ComparisonFailure: expected:<[java.lang.Integer]@dda4f7b[{<null>,5,{...> but was:<[]@dda4f7b[{<null>,5,{...>
	at org.junit.Assert.assertEquals(Assert.java:115)
	at org.junit.Assert.assertEquals(Assert.java:144)
	at org.apache.commons.lang3.builder.NoFieldNamesToStringStyleTest.testObjectArray(NoFieldNamesToStringStyleTest.java:104)

testBlank(org.apache.commons.lang3.builder.NoFieldNamesToStringStyleTest)  Time elapsed: 0 sec  <<< FAILURE!
org.junit.ComparisonFailure: expected:<[java.lang.Integer]@dda4f7b[]> but was:<[]@dda4f7b[]>
	at org.junit.Assert.assertEquals(Assert.java:115)
	at org.junit.Assert.assertEquals(Assert.java:144)
	at org.apache.commons.lang3.builder.NoFieldNamesToStringStyleTest.testBlank(NoFieldNamesToStringStyleTest.java:53)

testLong(org.apache.commons.lang3.builder.NoFieldNamesToStringStyleTest)  Time elapsed: 0 sec  <<< FAILURE!
org.junit.ComparisonFailure: expected:<[java.lang.Integer]@dda4f7b[3]> but was:<[]@dda4f7b[3]>
	at org.junit.Assert.assertEquals(Assert.java:115)
	at org.junit.Assert.assertEquals(Assert.java:144)
	at org.apache.commons.lang3.builder.NoFieldNamesToStringStyleTest.testLong(NoFieldNamesToStringStyleTest.java:96)

testLongArrayArray(org.apache.commons.lang3.builder.NoFieldNamesToStringStyleTest)  Time elapsed: 0.001 sec  <<< FAILURE!
org.junit.ComparisonFailure: expected:<[java.lang.Integer]@dda4f7b[{{1,2},<nul...> but was:<[]@dda4f7b[{{1,2},<nul...>
	at org.junit.Assert.assertEquals(Assert.java:115)
	at org.junit.Assert.assertEquals(Assert.java:144)
	at org.apache.commons.lang3.builder.NoFieldNamesToStringStyleTest.testLongArrayArray(NoFieldNamesToStringStyleTest.java:124)

testLongArray(org.apache.commons.lang3.builder.NoFieldNamesToStringStyleTest)  Time elapsed: 0 sec  <<< FAILURE!
org.junit.ComparisonFailure: expected:<[java.lang.Integer]@dda4f7b[{1,2,-3,4}]> but was:<[]@dda4f7b[{1,2,-3,4}]>
	at org.junit.Assert.assertEquals(Assert.java:115)
	at org.junit.Assert.assertEquals(Assert.java:144)
	at org.apache.commons.lang3.builder.NoFieldNamesToStringStyleTest.testLongArray(NoFieldNamesToStringStyleTest.java:114)

testObject(org.apache.commons.lang3.builder.NoFieldNamesToStringStyleTest)  Time elapsed: 0.001 sec  <<< FAILURE!
org.junit.ComparisonFailure: expected:<[java.lang.Integer]@dda4f7b[<null>]> but was:<[]@dda4f7b[<null>]>
	at org.junit.Assert.assertEquals(Assert.java:115)
	at org.junit.Assert.assertEquals(Assert.java:144)
	at org.apache.commons.lang3.builder.NoFieldNamesToStringStyleTest.testObject(NoFieldNamesToStringStyleTest.java:70)

testPerson(org.apache.commons.lang3.builder.NoFieldNamesToStringStyleTest)  Time elapsed: 0.001 sec  <<< FAILURE!
org.junit.ComparisonFailure: expected:<[org.apache.commons.lang3.builder.ToStringStyleTest$Person]@7707d6ae[Ron Paul,7...> but was:<[]@7707d6ae[Ron Paul,7...>
	at org.junit.Assert.assertEquals(Assert.java:115)
	at org.junit.Assert.assertEquals(Assert.java:144)
	at org.apache.commons.lang3.builder.NoFieldNamesToStringStyleTest.testPerson(NoFieldNamesToStringStyleTest.java:91)

testAppendSuper(org.apache.commons.lang3.builder.NoFieldNamesToStringStyleTest)  Time elapsed: 0 sec  <<< FAILURE!
org.junit.ComparisonFailure: expected:<[java.lang.Integer]@dda4f7b[]> but was:<[]@dda4f7b[]>
	at org.junit.Assert.assertEquals(Assert.java:115)
	at org.junit.Assert.assertEquals(Assert.java:144)
	at org.apache.commons.lang3.builder.NoFieldNamesToStringStyleTest.testAppendSuper(NoFieldNamesToStringStyleTest.java:58)

Running org.apache.commons.lang3.builder.ShortPrefixToStringStyleTest
Tests run: 8, Failures: 8, Errors: 0, Skipped: 0, Time elapsed: 0.002 sec <<< FAILURE! - in org.apache.commons.lang3.builder.ShortPrefixToStringStyleTest
testObjectArray(org.apache.commons.lang3.builder.ShortPrefixToStringStyleTest)  Time elapsed: 0 sec  <<< FAILURE!
org.junit.ComparisonFailure: expected:<[Integer][{<null>,5,{3,6}}]> but was:<[][{<null>,5,{3,6}}]>
	at org.junit.Assert.assertEquals(Assert.java:115)
	at org.junit.Assert.assertEquals(Assert.java:144)
	at org.apache.commons.lang3.builder.ShortPrefixToStringStyleTest.testObjectArray(ShortPrefixToStringStyleTest.java:104)

testBlank(org.apache.commons.lang3.builder.ShortPrefixToStringStyleTest)  Time elapsed: 0 sec  <<< FAILURE!
org.junit.ComparisonFailure: expected:<[Integer][]> but was:<[][]>
	at org.junit.Assert.assertEquals(Assert.java:115)
	at org.junit.Assert.assertEquals(Assert.java:144)
	at org.apache.commons.lang3.builder.ShortPrefixToStringStyleTest.testBlank(ShortPrefixToStringStyleTest.java:53)

testLong(org.apache.commons.lang3.builder.ShortPrefixToStringStyleTest)  Time elapsed: 0 sec  <<< FAILURE!
org.junit.ComparisonFailure: expected:<[Integer][3]> but was:<[][3]>
	at org.junit.Assert.assertEquals(Assert.java:115)
	at org.junit.Assert.assertEquals(Assert.java:144)
	at org.apache.commons.lang3.builder.ShortPrefixToStringStyleTest.testLong(ShortPrefixToStringStyleTest.java:96)

testLongArrayArray(org.apache.commons.lang3.builder.ShortPrefixToStringStyleTest)  Time elapsed: 0 sec  <<< FAILURE!
org.junit.ComparisonFailure: expected:<[Integer][{{1,2},<null>,{5}}]> but was:<[][{{1,2},<null>,{5}}]>
	at org.junit.Assert.assertEquals(Assert.java:115)
	at org.junit.Assert.assertEquals(Assert.java:144)
	at org.apache.commons.lang3.builder.ShortPrefixToStringStyleTest.testLongArrayArray(ShortPrefixToStringStyleTest.java:124)

testLongArray(org.apache.commons.lang3.builder.ShortPrefixToStringStyleTest)  Time elapsed: 0.001 sec  <<< FAILURE!
org.junit.ComparisonFailure: expected:<[Integer][{1,2,-3,4}]> but was:<[][{1,2,-3,4}]>
	at org.junit.Assert.assertEquals(Assert.java:115)
	at org.junit.Assert.assertEquals(Assert.java:144)
	at org.apache.commons.lang3.builder.ShortPrefixToStringStyleTest.testLongArray(ShortPrefixToStringStyleTest.java:114)

testObject(org.apache.commons.lang3.builder.ShortPrefixToStringStyleTest)  Time elapsed: 0 sec  <<< FAILURE!
org.junit.ComparisonFailure: expected:<[Integer][<null>]> but was:<[][<null>]>
	at org.junit.Assert.assertEquals(Assert.java:115)
	at org.junit.Assert.assertEquals(Assert.java:144)
	at org.apache.commons.lang3.builder.ShortPrefixToStringStyleTest.testObject(ShortPrefixToStringStyleTest.java:70)

testPerson(org.apache.commons.lang3.builder.ShortPrefixToStringStyleTest)  Time elapsed: 0 sec  <<< FAILURE!
org.junit.ComparisonFailure: expected:<[ToStringStyleTest.Person][name=John Q. Public...> but was:<[][name=John Q. Public...>
	at org.junit.Assert.assertEquals(Assert.java:115)
	at org.junit.Assert.assertEquals(Assert.java:144)
	at org.apache.commons.lang3.builder.ShortPrefixToStringStyleTest.testPerson(ShortPrefixToStringStyleTest.java:91)

testAppendSuper(org.apache.commons.lang3.builder.ShortPrefixToStringStyleTest)  Time elapsed: 0.001 sec  <<< FAILURE!
org.junit.ComparisonFailure: expected:<[Integer][]> but was:<[][]>
	at org.junit.Assert.assertEquals(Assert.java:115)
	at org.junit.Assert.assertEquals(Assert.java:144)
	at org.apache.commons.lang3.builder.ShortPrefixToStringStyleTest.testAppendSuper(ShortPrefixToStringStyleTest.java:58)

Running org.apache.commons.lang3.builder.DiffResultTest
Tests run: 9, Failures: 1, Errors: 0, Skipped: 0, Time elapsed: 0.008 sec <<< FAILURE! - in org.apache.commons.lang3.builder.DiffResultTest
testToStringOutput(org.apache.commons.lang3.builder.DiffResultTest)  Time elapsed: 0.006 sec  <<< FAILURE!
org.junit.ComparisonFailure: expected:<[DiffResultTest.EmptyClass[test=false] differs from DiffResultTest.EmptyClass][test=true]> but was:<[[test=false] differs from ][test=true]>
	at org.junit.Assert.assertEquals(Assert.java:115)
	at org.junit.Assert.assertEquals(Assert.java:144)
	at org.apache.commons.lang3.builder.DiffResultTest.testToStringOutput(DiffResultTest.java:95)

Running org.apache.commons.lang3.builder.CompareToBuilderTest
Tests run: 48, Failures: 0, Errors: 0, Skipped: 0, Time elapsed: 0.019 sec - in org.apache.commons.lang3.builder.CompareToBuilderTest
Running org.apache.commons.lang3.builder.MultilineRecursiveToStringStyleTest
Tests run: 10, Failures: 10, Errors: 0, Skipped: 0, Time elapsed: 0.008 sec <<< FAILURE! - in org.apache.commons.lang3.builder.MultilineRecursiveToStringStyleTest
doubleArray(org.apache.commons.lang3.builder.MultilineRecursiveToStringStyleTest)  Time elapsed: 0.001 sec  <<< FAILURE!
org.junit.ComparisonFailure: expected:<[org.apache.commons.lang3.builder.MultilineRecursiveToStringStyleTest$WithArrays]@44d74990[
  boolArr...> but was:<[]@44d74990[
  boolArr...>
	at org.junit.Assert.assertEquals(Assert.java:115)
	at org.junit.Assert.assertEquals(Assert.java:144)
	at org.apache.commons.lang3.builder.MultilineRecursiveToStringStyleTest.doubleArray(MultilineRecursiveToStringStyleTest.java:167)

stringArray(org.apache.commons.lang3.builder.MultilineRecursiveToStringStyleTest)  Time elapsed: 0 sec  <<< FAILURE!
org.junit.ComparisonFailure: expected:<[org.apache.commons.lang3.builder.MultilineRecursiveToStringStyleTest$WithArrays]@496d6956[
  boolArr...> but was:<[]@496d6956[
  boolArr...>
	at org.junit.Assert.assertEquals(Assert.java:115)
	at org.junit.Assert.assertEquals(Assert.java:144)
	at org.apache.commons.lang3.builder.MultilineRecursiveToStringStyleTest.stringArray(MultilineRecursiveToStringStyleTest.java:203)

simpleObject(org.apache.commons.lang3.builder.MultilineRecursiveToStringStyleTest)  Time elapsed: 0.001 sec  <<< FAILURE!
org.junit.ComparisonFailure: expected:<[org.apache.commons.lang3.builder.MultilineRecursiveToStringStyleTest$Transaction]@445ebf88[
  amount=...> but was:<[]@445ebf88[
  amount=...>
	at org.junit.Assert.assertEquals(Assert.java:115)
	at org.junit.Assert.assertEquals(Assert.java:144)
	at org.apache.commons.lang3.builder.MultilineRecursiveToStringStyleTest.simpleObject(MultilineRecursiveToStringStyleTest.java:42)

longArray(org.apache.commons.lang3.builder.MultilineRecursiveToStringStyleTest)  Time elapsed: 0.001 sec  <<< FAILURE!
org.junit.ComparisonFailure: expected:<[org.apache.commons.lang3.builder.MultilineRecursiveToStringStyleTest$WithArrays]@3096f94[
  boolArra...> but was:<[]@3096f94[
  boolArra...>
	at org.junit.Assert.assertEquals(Assert.java:115)
	at org.junit.Assert.assertEquals(Assert.java:144)
	at org.apache.commons.lang3.builder.MultilineRecursiveToStringStyleTest.longArray(MultilineRecursiveToStringStyleTest.java:185)

intArray(org.apache.commons.lang3.builder.MultilineRecursiveToStringStyleTest)  Time elapsed: 0.001 sec  <<< FAILURE!
org.junit.ComparisonFailure: expected:<[org.apache.commons.lang3.builder.MultilineRecursiveToStringStyleTest$WithArrays]@547d573[
  boolArra...> but was:<[]@547d573[
  boolArra...>
	at org.junit.Assert.assertEquals(Assert.java:115)
	at org.junit.Assert.assertEquals(Assert.java:144)
	at org.apache.commons.lang3.builder.MultilineRecursiveToStringStyleTest.intArray(MultilineRecursiveToStringStyleTest.java:149)

nestedAndArray(org.apache.commons.lang3.builder.MultilineRecursiveToStringStyleTest)  Time elapsed: 0.001 sec  <<< FAILURE!
org.junit.ComparisonFailure: expected:<[org.apache.commons.lang3.builder.MultilineRecursiveToStringStyleTest$Account@71e2cfdc[
  owner=<null>,
  transactions=java.util.ArrayList@61bcaeed{
    org.apache.commons.lang3.builder.MultilineRecursiveToStringStyleTest$Transaction@2a807bbc[
      amount=100.0,
      date=2014.10.14
    ],
    org.apache.commons.lang3.builder.MultilineRecursiveToStringStyleTest$Transaction]@593b8970[
      amo...> but was:<[@71e2cfdc[
  owner=<null>,
  transactions=@61bcaeed{
    @2a807bbc[
      amount=100.0,
      date=2014.10.14
    ],
    ]@593b8970[
      amo...>
	at org.junit.Assert.assertEquals(Assert.java:115)
	at org.junit.Assert.assertEquals(Assert.java:144)
	at org.apache.commons.lang3.builder.MultilineRecursiveToStringStyleTest.nestedAndArray(MultilineRecursiveToStringStyleTest.java:80)

charArray(org.apache.commons.lang3.builder.MultilineRecursiveToStringStyleTest)  Time elapsed: 0.001 sec  <<< FAILURE!
org.junit.ComparisonFailure: expected:<[org.apache.commons.lang3.builder.MultilineRecursiveToStringStyleTest$WithArrays]@2352fd52[
  boolArr...> but was:<[]@2352fd52[
  boolArr...>
	at org.junit.Assert.assertEquals(Assert.java:115)
	at org.junit.Assert.assertEquals(Assert.java:144)
	at org.apache.commons.lang3.builder.MultilineRecursiveToStringStyleTest.charArray(MultilineRecursiveToStringStyleTest.java:131)

nestedElements(org.apache.commons.lang3.builder.MultilineRecursiveToStringStyleTest)  Time elapsed: 0.001 sec  <<< FAILURE!
org.junit.ComparisonFailure: expected:<[org.apache.commons.lang3.builder.MultilineRecursiveToStringStyleTest$Customer@75b68cdf[
  name=Douglas Adams,
  bank=org.apache.commons.lang3.builder.MultilineRecursiveToStringStyleTest$Bank]@23dac0d9[
    name=...> but was:<[@75b68cdf[
  name=Douglas Adams,
  bank=]@23dac0d9[
    name=...>
	at org.junit.Assert.assertEquals(Assert.java:115)
	at org.junit.Assert.assertEquals(Assert.java:144)
	at org.apache.commons.lang3.builder.MultilineRecursiveToStringStyleTest.nestedElements(MultilineRecursiveToStringStyleTest.java:57)

boolArray(org.apache.commons.lang3.builder.MultilineRecursiveToStringStyleTest)  Time elapsed: 0 sec  <<< FAILURE!
org.junit.ComparisonFailure: expected:<[org.apache.commons.lang3.builder.MultilineRecursiveToStringStyleTest$WithArrays]@3435c7be[
  boolArr...> but was:<[]@3435c7be[
  boolArr...>
	at org.junit.Assert.assertEquals(Assert.java:115)
	at org.junit.Assert.assertEquals(Assert.java:144)
	at org.apache.commons.lang3.builder.MultilineRecursiveToStringStyleTest.boolArray(MultilineRecursiveToStringStyleTest.java:113)

noArray(org.apache.commons.lang3.builder.MultilineRecursiveToStringStyleTest)  Time elapsed: 0.001 sec  <<< FAILURE!
org.junit.ComparisonFailure: expected:<[org.apache.commons.lang3.builder.MultilineRecursiveToStringStyleTest$WithArrays]@359430ca[
  boolArr...> but was:<[]@359430ca[
  boolArr...>
	at org.junit.Assert.assertEquals(Assert.java:115)
	at org.junit.Assert.assertEquals(Assert.java:144)
	at org.apache.commons.lang3.builder.MultilineRecursiveToStringStyleTest.noArray(MultilineRecursiveToStringStyleTest.java:94)

Running org.apache.commons.lang3.builder.RecursiveToStringStyleTest
Tests run: 8, Failures: 8, Errors: 0, Skipped: 0, Time elapsed: 0.004 sec <<< FAILURE! - in org.apache.commons.lang3.builder.RecursiveToStringStyleTest
testObjectArray(org.apache.commons.lang3.builder.RecursiveToStringStyleTest)  Time elapsed: 0 sec  <<< FAILURE!
org.junit.ComparisonFailure: expected:<[java.lang.Integer]@dda4f7b[{<null>,5,{...> but was:<[]@dda4f7b[{<null>,5,{...>
	at org.junit.Assert.assertEquals(Assert.java:115)
	at org.junit.Assert.assertEquals(Assert.java:144)
	at org.apache.commons.lang3.builder.RecursiveToStringStyleTest.testObjectArray(RecursiveToStringStyleTest.java:107)

testBlank(org.apache.commons.lang3.builder.RecursiveToStringStyleTest)  Time elapsed: 0 sec  <<< FAILURE!
org.junit.ComparisonFailure: expected:<[java.lang.Integer]@dda4f7b[]> but was:<[]@dda4f7b[]>
	at org.junit.Assert.assertEquals(Assert.java:115)
	at org.junit.Assert.assertEquals(Assert.java:144)
	at org.apache.commons.lang3.builder.RecursiveToStringStyleTest.testBlank(RecursiveToStringStyleTest.java:52)

testLong(org.apache.commons.lang3.builder.RecursiveToStringStyleTest)  Time elapsed: 0 sec  <<< FAILURE!
org.junit.ComparisonFailure: expected:<[java.lang.Integer]@dda4f7b[3]> but was:<[]@dda4f7b[3]>
	at org.junit.Assert.assertEquals(Assert.java:115)
	at org.junit.Assert.assertEquals(Assert.java:144)
	at org.apache.commons.lang3.builder.RecursiveToStringStyleTest.testLong(RecursiveToStringStyleTest.java:99)

testLongArrayArray(org.apache.commons.lang3.builder.RecursiveToStringStyleTest)  Time elapsed: 0.001 sec  <<< FAILURE!
org.junit.ComparisonFailure: expected:<[java.lang.Integer]@dda4f7b[{{1,2},<nul...> but was:<[]@dda4f7b[{{1,2},<nul...>
	at org.junit.Assert.assertEquals(Assert.java:115)
	at org.junit.Assert.assertEquals(Assert.java:144)
	at org.apache.commons.lang3.builder.RecursiveToStringStyleTest.testLongArrayArray(RecursiveToStringStyleTest.java:127)

testLongArray(org.apache.commons.lang3.builder.RecursiveToStringStyleTest)  Time elapsed: 0 sec  <<< FAILURE!
org.junit.ComparisonFailure: expected:<[java.lang.Integer]@dda4f7b[{1,2,-3,4}]> but was:<[]@dda4f7b[{1,2,-3,4}]>
	at org.junit.Assert.assertEquals(Assert.java:115)
	at org.junit.Assert.assertEquals(Assert.java:144)
	at org.apache.commons.lang3.builder.RecursiveToStringStyleTest.testLongArray(RecursiveToStringStyleTest.java:117)

testObject(org.apache.commons.lang3.builder.RecursiveToStringStyleTest)  Time elapsed: 0.001 sec  <<< FAILURE!
org.junit.ComparisonFailure: expected:<[java.lang.Integer]@dda4f7b[<null>]> but was:<[]@dda4f7b[<null>]>
	at org.junit.Assert.assertEquals(Assert.java:115)
	at org.junit.Assert.assertEquals(Assert.java:144)
	at org.apache.commons.lang3.builder.RecursiveToStringStyleTest.testObject(RecursiveToStringStyleTest.java:69)

testPerson(org.apache.commons.lang3.builder.RecursiveToStringStyleTest)  Time elapsed: 0.001 sec  <<< FAILURE!
org.junit.ComparisonFailure: expected:<[org.apache.commons.lang3.builder.RecursiveToStringStyleTest$Person@17fe67e4[name=John Doe,age=33,smoker=false,job=org.apache.commons.lang3.builder.RecursiveToStringStyleTest$Job]@3f56b60a[title=Mana...> but was:<[@17fe67e4[name=John Doe,age=33,smoker=false,job=]@3f56b60a[title=Mana...>
	at org.junit.Assert.assertEquals(Assert.java:115)
	at org.junit.Assert.assertEquals(Assert.java:144)
	at org.apache.commons.lang3.builder.RecursiveToStringStyleTest.testPerson(RecursiveToStringStyleTest.java:93)

testAppendSuper(org.apache.commons.lang3.builder.RecursiveToStringStyleTest)  Time elapsed: 0 sec  <<< FAILURE!
org.junit.ComparisonFailure: expected:<[java.lang.Integer]@dda4f7b[]> but was:<[]@dda4f7b[]>
	at org.junit.Assert.assertEquals(Assert.java:115)
	at org.junit.Assert.assertEquals(Assert.java:144)
	at org.apache.commons.lang3.builder.RecursiveToStringStyleTest.testAppendSuper(RecursiveToStringStyleTest.java:57)

Running org.apache.commons.lang3.builder.DefaultToStringStyleTest
Tests run: 8, Failures: 8, Errors: 0, Skipped: 0, Time elapsed: 0.013 sec <<< FAILURE! - in org.apache.commons.lang3.builder.DefaultToStringStyleTest
testObjectArray(org.apache.commons.lang3.builder.DefaultToStringStyleTest)  Time elapsed: 0.002 sec  <<< FAILURE!
org.junit.ComparisonFailure: expected:<[java.lang.Integer]@dda4f7b[{<null>,5,{...> but was:<[]@dda4f7b[{<null>,5,{...>
	at org.junit.Assert.assertEquals(Assert.java:115)
	at org.junit.Assert.assertEquals(Assert.java:144)
	at org.apache.commons.lang3.builder.DefaultToStringStyleTest.testObjectArray(DefaultToStringStyleTest.java:104)

testBlank(org.apache.commons.lang3.builder.DefaultToStringStyleTest)  Time elapsed: 0 sec  <<< FAILURE!
org.junit.ComparisonFailure: expected:<[java.lang.Integer]@dda4f7b[]> but was:<[]@dda4f7b[]>
	at org.junit.Assert.assertEquals(Assert.java:115)
	at org.junit.Assert.assertEquals(Assert.java:144)
	at org.apache.commons.lang3.builder.DefaultToStringStyleTest.testBlank(DefaultToStringStyleTest.java:53)

testLong(org.apache.commons.lang3.builder.DefaultToStringStyleTest)  Time elapsed: 0 sec  <<< FAILURE!
org.junit.ComparisonFailure: expected:<[java.lang.Integer]@dda4f7b[3]> but was:<[]@dda4f7b[3]>
	at org.junit.Assert.assertEquals(Assert.java:115)
	at org.junit.Assert.assertEquals(Assert.java:144)
	at org.apache.commons.lang3.builder.DefaultToStringStyleTest.testLong(DefaultToStringStyleTest.java:96)

testLongArrayArray(org.apache.commons.lang3.builder.DefaultToStringStyleTest)  Time elapsed: 0.001 sec  <<< FAILURE!
org.junit.ComparisonFailure: expected:<[java.lang.Integer]@dda4f7b[{{1,2},<nul...> but was:<[]@dda4f7b[{{1,2},<nul...>
	at org.junit.Assert.assertEquals(Assert.java:115)
	at org.junit.Assert.assertEquals(Assert.java:144)
	at org.apache.commons.lang3.builder.DefaultToStringStyleTest.testLongArrayArray(DefaultToStringStyleTest.java:124)

testLongArray(org.apache.commons.lang3.builder.DefaultToStringStyleTest)  Time elapsed: 0.001 sec  <<< FAILURE!
org.junit.ComparisonFailure: expected:<[java.lang.Integer]@dda4f7b[{1,2,-3,4}]> but was:<[]@dda4f7b[{1,2,-3,4}]>
	at org.junit.Assert.assertEquals(Assert.java:115)
	at org.junit.Assert.assertEquals(Assert.java:144)
	at org.apache.commons.lang3.builder.DefaultToStringStyleTest.testLongArray(DefaultToStringStyleTest.java:114)

testObject(org.apache.commons.lang3.builder.DefaultToStringStyleTest)  Time elapsed: 0.001 sec  <<< FAILURE!
org.junit.ComparisonFailure: expected:<[java.lang.Integer]@dda4f7b[<null>]> but was:<[]@dda4f7b[<null>]>
	at org.junit.Assert.assertEquals(Assert.java:115)
	at org.junit.Assert.assertEquals(Assert.java:144)
	at org.apache.commons.lang3.builder.DefaultToStringStyleTest.testObject(DefaultToStringStyleTest.java:70)

testPerson(org.apache.commons.lang3.builder.DefaultToStringStyleTest)  Time elapsed: 0 sec  <<< FAILURE!
org.junit.ComparisonFailure: expected:<[org.apache.commons.lang3.builder.ToStringStyleTest$Person]@4260904e[name=John ...> but was:<[]@4260904e[name=John ...>
	at org.junit.Assert.assertEquals(Assert.java:115)
	at org.junit.Assert.assertEquals(Assert.java:144)
	at org.apache.commons.lang3.builder.DefaultToStringStyleTest.testPerson(DefaultToStringStyleTest.java:91)

testAppendSuper(org.apache.commons.lang3.builder.DefaultToStringStyleTest)  Time elapsed: 0.001 sec  <<< FAILURE!
org.junit.ComparisonFailure: expected:<[java.lang.Integer]@dda4f7b[]> but was:<[]@dda4f7b[]>
	at org.junit.Assert.assertEquals(Assert.java:115)
	at org.junit.Assert.assertEquals(Assert.java:144)
	at org.apache.commons.lang3.builder.DefaultToStringStyleTest.testAppendSuper(DefaultToStringStyleTest.java:58)

Running org.apache.commons.lang3.builder.ReflectionToStringBuilderExcludeTest
Tests run: 11, Failures: 0, Errors: 0, Skipped: 0, Time elapsed: 0.004 sec - in org.apache.commons.lang3.builder.ReflectionToStringBuilderExcludeTest
Running org.apache.commons.lang3.builder.StandardToStringStyleTest
Tests run: 8, Failures: 8, Errors: 0, Skipped: 0, Time elapsed: 0.001 sec <<< FAILURE! - in org.apache.commons.lang3.builder.StandardToStringStyleTest
testObjectArray(org.apache.commons.lang3.builder.StandardToStringStyleTest)  Time elapsed: 0 sec  <<< FAILURE!
org.junit.ComparisonFailure: expected:<[Integer][[%NULL%, 5, [3, 6]]...> but was:<[][[%NULL%, 5, [3, 6]]...>
	at org.junit.Assert.assertEquals(Assert.java:115)
	at org.junit.Assert.assertEquals(Assert.java:144)
	at org.apache.commons.lang3.builder.StandardToStringStyleTest.testObjectArray(StandardToStringStyleTest.java:119)

testBlank(org.apache.commons.lang3.builder.StandardToStringStyleTest)  Time elapsed: 0 sec  <<< FAILURE!
org.junit.ComparisonFailure: expected:<[Integer][]> but was:<[][]>
	at org.junit.Assert.assertEquals(Assert.java:115)
	at org.junit.Assert.assertEquals(Assert.java:144)
	at org.apache.commons.lang3.builder.StandardToStringStyleTest.testBlank(StandardToStringStyleTest.java:68)

testLong(org.apache.commons.lang3.builder.StandardToStringStyleTest)  Time elapsed: 0 sec  <<< FAILURE!
org.junit.ComparisonFailure: expected:<[Integer][3]> but was:<[][3]>
	at org.junit.Assert.assertEquals(Assert.java:115)
	at org.junit.Assert.assertEquals(Assert.java:144)
	at org.apache.commons.lang3.builder.StandardToStringStyleTest.testLong(StandardToStringStyleTest.java:111)

testLongArrayArray(org.apache.commons.lang3.builder.StandardToStringStyleTest)  Time elapsed: 0 sec  <<< FAILURE!
org.junit.ComparisonFailure: expected:<[Integer][[[1, 2], %NULL%, [5...> but was:<[][[[1, 2], %NULL%, [5...>
	at org.junit.Assert.assertEquals(Assert.java:115)
	at org.junit.Assert.assertEquals(Assert.java:144)
	at org.apache.commons.lang3.builder.StandardToStringStyleTest.testLongArrayArray(StandardToStringStyleTest.java:139)

testLongArray(org.apache.commons.lang3.builder.StandardToStringStyleTest)  Time elapsed: 0.001 sec  <<< FAILURE!
org.junit.ComparisonFailure: expected:<[Integer][[1, 2, -3, 4]]> but was:<[][[1, 2, -3, 4]]>
	at org.junit.Assert.assertEquals(Assert.java:115)
	at org.junit.Assert.assertEquals(Assert.java:144)
	at org.apache.commons.lang3.builder.StandardToStringStyleTest.testLongArray(StandardToStringStyleTest.java:129)

testObject(org.apache.commons.lang3.builder.StandardToStringStyleTest)  Time elapsed: 0 sec  <<< FAILURE!
org.junit.ComparisonFailure: expected:<[Integer][%NULL%]> but was:<[][%NULL%]>
	at org.junit.Assert.assertEquals(Assert.java:115)
	at org.junit.Assert.assertEquals(Assert.java:144)
	at org.apache.commons.lang3.builder.StandardToStringStyleTest.testObject(StandardToStringStyleTest.java:85)

testPerson(org.apache.commons.lang3.builder.StandardToStringStyleTest)  Time elapsed: 0 sec  <<< FAILURE!
org.junit.ComparisonFailure: expected:<[ToStringStyleTest.Person][name=Suzy Queue,age...> but was:<[][name=Suzy Queue,age...>
	at org.junit.Assert.assertEquals(Assert.java:115)
	at org.junit.Assert.assertEquals(Assert.java:144)
	at org.apache.commons.lang3.builder.StandardToStringStyleTest.testPerson(StandardToStringStyleTest.java:106)

testAppendSuper(org.apache.commons.lang3.builder.StandardToStringStyleTest)  Time elapsed: 0 sec  <<< FAILURE!
org.junit.ComparisonFailure: expected:<[Integer][]> but was:<[][]>
	at org.junit.Assert.assertEquals(Assert.java:115)
	at org.junit.Assert.assertEquals(Assert.java:144)
	at org.apache.commons.lang3.builder.StandardToStringStyleTest.testAppendSuper(StandardToStringStyleTest.java:73)

Running org.apache.commons.lang3.builder.ToStringStyleTest
Tests run: 12, Failures: 0, Errors: 0, Skipped: 0, Time elapsed: 0.001 sec - in org.apache.commons.lang3.builder.ToStringStyleTest
Running org.apache.commons.lang3.builder.DiffTest
Tests run: 4, Failures: 0, Errors: 0, Skipped: 0, Time elapsed: 0 sec - in org.apache.commons.lang3.builder.DiffTest
Running org.apache.commons.lang3.builder.SimpleToStringStyleTest
Tests run: 8, Failures: 0, Errors: 0, Skipped: 0, Time elapsed: 0.001 sec - in org.apache.commons.lang3.builder.SimpleToStringStyleTest
Running org.apache.commons.lang3.builder.MultiLineToStringStyleTest
Tests run: 8, Failures: 8, Errors: 0, Skipped: 0, Time elapsed: 0.001 sec <<< FAILURE! - in org.apache.commons.lang3.builder.MultiLineToStringStyleTest
testObjectArray(org.apache.commons.lang3.builder.MultiLineToStringStyleTest)  Time elapsed: 0 sec  <<< FAILURE!
org.junit.ComparisonFailure: expected:<[java.lang.Integer]@dda4f7b[
  {<null>,...> but was:<[]@dda4f7b[
  {<null>,...>
	at org.junit.Assert.assertEquals(Assert.java:115)
	at org.junit.Assert.assertEquals(Assert.java:144)
	at org.apache.commons.lang3.builder.MultiLineToStringStyleTest.testObjectArray(MultiLineToStringStyleTest.java:105)

testBlank(org.apache.commons.lang3.builder.MultiLineToStringStyleTest)  Time elapsed: 0 sec  <<< FAILURE!
org.junit.ComparisonFailure: expected:<[java.lang.Integer]@dda4f7b[
]> but was:<[]@dda4f7b[
]>
	at org.junit.Assert.assertEquals(Assert.java:115)
	at org.junit.Assert.assertEquals(Assert.java:144)
	at org.apache.commons.lang3.builder.MultiLineToStringStyleTest.testBlank(MultiLineToStringStyleTest.java:54)

testLong(org.apache.commons.lang3.builder.MultiLineToStringStyleTest)  Time elapsed: 0 sec  <<< FAILURE!
org.junit.ComparisonFailure: expected:<[java.lang.Integer]@dda4f7b[
  3
]> but was:<[]@dda4f7b[
  3
]>
	at org.junit.Assert.assertEquals(Assert.java:115)
	at org.junit.Assert.assertEquals(Assert.java:144)
	at org.apache.commons.lang3.builder.MultiLineToStringStyleTest.testLong(MultiLineToStringStyleTest.java:97)

testLongArrayArray(org.apache.commons.lang3.builder.MultiLineToStringStyleTest)  Time elapsed: 0 sec  <<< FAILURE!
org.junit.ComparisonFailure: expected:<[java.lang.Integer]@dda4f7b[
  {{1,2},<...> but was:<[]@dda4f7b[
  {{1,2},<...>
	at org.junit.Assert.assertEquals(Assert.java:115)
	at org.junit.Assert.assertEquals(Assert.java:144)
	at org.apache.commons.lang3.builder.MultiLineToStringStyleTest.testLongArrayArray(MultiLineToStringStyleTest.java:125)

testLongArray(org.apache.commons.lang3.builder.MultiLineToStringStyleTest)  Time elapsed: 0 sec  <<< FAILURE!
org.junit.ComparisonFailure: expected:<[java.lang.Integer]@dda4f7b[
  {1,2,-3,...> but was:<[]@dda4f7b[
  {1,2,-3,...>
	at org.junit.Assert.assertEquals(Assert.java:115)
	at org.junit.Assert.assertEquals(Assert.java:144)
	at org.apache.commons.lang3.builder.MultiLineToStringStyleTest.testLongArray(MultiLineToStringStyleTest.java:115)

testObject(org.apache.commons.lang3.builder.MultiLineToStringStyleTest)  Time elapsed: 0 sec  <<< FAILURE!
org.junit.ComparisonFailure: expected:<[java.lang.Integer]@dda4f7b[
  <null>
]> but was:<[]@dda4f7b[
  <null>
]>
	at org.junit.Assert.assertEquals(Assert.java:115)
	at org.junit.Assert.assertEquals(Assert.java:144)
	at org.apache.commons.lang3.builder.MultiLineToStringStyleTest.testObject(MultiLineToStringStyleTest.java:71)

testPerson(org.apache.commons.lang3.builder.MultiLineToStringStyleTest)  Time elapsed: 0 sec  <<< FAILURE!
org.junit.ComparisonFailure: expected:<[org.apache.commons.lang3.builder.ToStringStyleTest$Person]@112a39aa[
  name=Ja...> but was:<[]@112a39aa[
  name=Ja...>
	at org.junit.Assert.assertEquals(Assert.java:115)
	at org.junit.Assert.assertEquals(Assert.java:144)
	at org.apache.commons.lang3.builder.MultiLineToStringStyleTest.testPerson(MultiLineToStringStyleTest.java:92)

testAppendSuper(org.apache.commons.lang3.builder.MultiLineToStringStyleTest)  Time elapsed: 0 sec  <<< FAILURE!
org.junit.ComparisonFailure: expected:<[java.lang.Integer]@dda4f7b[
]> but was:<[]@dda4f7b[
]>
	at org.junit.Assert.assertEquals(Assert.java:115)
	at org.junit.Assert.assertEquals(Assert.java:144)
	at org.apache.commons.lang3.builder.MultiLineToStringStyleTest.testAppendSuper(MultiLineToStringStyleTest.java:59)

Running org.apache.commons.lang3.builder.ToStringStyleConcurrencyTest
Tests run: 3, Failures: 0, Errors: 0, Skipped: 0, Time elapsed: 3.776 sec - in org.apache.commons.lang3.builder.ToStringStyleConcurrencyTest
Running org.apache.commons.lang3.builder.ReflectionToStringBuilderMutateInspectConcurrencyTest
Tests run: 1, Failures: 0, Errors: 0, Skipped: 1, Time elapsed: 0 sec - in org.apache.commons.lang3.builder.ReflectionToStringBuilderMutateInspectConcurrencyTest
Running org.apache.commons.lang3.builder.ToStringBuilderTest
Tests run: 74, Failures: 64, Errors: 0, Skipped: 1, Time elapsed: 0.064 sec <<< FAILURE! - in org.apache.commons.lang3.builder.ToStringBuilderTest
testCharArray(org.apache.commons.lang3.builder.ToStringBuilderTest)  Time elapsed: 0.001 sec  <<< FAILURE!
org.junit.ComparisonFailure: expected:<[java.lang.Integer]@dda4f7b[{A,2,_,D}]> but was:<[]@dda4f7b[{A,2,_,D}]>
	at org.junit.Assert.assertEquals(Assert.java:115)
	at org.junit.Assert.assertEquals(Assert.java:144)
	at org.apache.commons.lang3.builder.ToStringBuilderTest.testCharArray(ToStringBuilderTest.java:767)

testDoubleArrayArray(org.apache.commons.lang3.builder.ToStringBuilderTest)  Time elapsed: 0 sec  <<< FAILURE!
org.junit.ComparisonFailure: expected:<[java.lang.Integer]@dda4f7b[{{1.0,2.296...> but was:<[]@dda4f7b[{{1.0,2.296...>
	at org.junit.Assert.assertEquals(Assert.java:115)
	at org.junit.Assert.assertEquals(Assert.java:144)
	at org.apache.commons.lang3.builder.ToStringBuilderTest.testDoubleArrayArray(ToStringBuilderTest.java:857)

testReflectionBoolean(org.apache.commons.lang3.builder.ToStringBuilderTest)  Time elapsed: 0.001 sec  <<< FAILURE!
org.junit.ComparisonFailure: expected:<[java.lang.Boolean]@f684bc0[value=true]> but was:<[]@f684bc0[value=true]>
	at org.junit.Assert.assertEquals(Assert.java:115)
	at org.junit.Assert.assertEquals(Assert.java:144)
	at org.apache.commons.lang3.builder.ToStringBuilderTest.testReflectionBoolean(ToStringBuilderTest.java:116)

testObjectArray(org.apache.commons.lang3.builder.ToStringBuilderTest)  Time elapsed: 0 sec  <<< FAILURE!
org.junit.ComparisonFailure: expected:<[java.lang.Integer]@dda4f7b[{<null>,5,{...> but was:<[]@dda4f7b[{<null>,5,{...>
	at org.junit.Assert.assertEquals(Assert.java:115)
	at org.junit.Assert.assertEquals(Assert.java:144)
	at org.apache.commons.lang3.builder.ToStringBuilderTest.testObjectArray(ToStringBuilderTest.java:717)

testObjectBuild(org.apache.commons.lang3.builder.ToStringBuilderTest)  Time elapsed: 0.001 sec  <<< FAILURE!
org.junit.ComparisonFailure: expected:<[java.lang.Integer]@dda4f7b[<null>]> but was:<[]@dda4f7b[<null>]>
	at org.junit.Assert.assertEquals(Assert.java:115)
	at org.junit.Assert.assertEquals(Assert.java:144)
	at org.apache.commons.lang3.builder.ToStringBuilderTest.testObjectBuild(ToStringBuilderTest.java:641)

testObjectCycle(org.apache.commons.lang3.builder.ToStringBuilderTest)  Time elapsed: 0.001 sec  <<< FAILURE!
org.junit.ComparisonFailure: expected:<[org.apache.commons.lang3.builder.ToStringBuilderTest$ObjectCycle@72f264c6[org.apache.commons.lang3.builder.ToStringBuilderTest$ObjectCycle]@7b63e1f[org.apache....> but was:<[@72f264c6[]@7b63e1f[org.apache....>
	at org.junit.Assert.assertEquals(Assert.java:115)
	at org.junit.Assert.assertEquals(Assert.java:144)
	at org.apache.commons.lang3.builder.ToStringBuilderTest.testObjectCycle(ToStringBuilderTest.java:892)

testReflectionHierarchy(org.apache.commons.lang3.builder.ToStringBuilderTest)  Time elapsed: 0.001 sec  <<< FAILURE!
org.junit.ComparisonFailure: expected:<[org.apache.commons.lang3.builder.ToStringBuilderTest$ReflectionTestFixtureA]@6b91312f[a=a]> but was:<[]@6b91312f[a=a]>
	at org.junit.Assert.assertEquals(Assert.java:115)
	at org.junit.Assert.assertEquals(Assert.java:144)
	at org.apache.commons.lang3.builder.ToStringBuilderTest.testReflectionHierarchy(ToStringBuilderTest.java:338)

testSelfInstanceTwoVarsReflectionObjectCycle(org.apache.commons.lang3.builder.ToStringBuilderTest)  Time elapsed: 0 sec  <<< FAILURE!
org.junit.ComparisonFailure: expected:<[org.apache.commons.lang3.builder.ToStringBuilderTest$SelfInstanceTwoVarsReflectionTestFixture]@ff7f824[typeIsSelf=...> but was:<[]@ff7f824[typeIsSelf=...>
	at org.junit.Assert.assertEquals(Assert.java:115)
	at org.junit.Assert.assertEquals(Assert.java:144)
	at org.apache.commons.lang3.builder.ToStringBuilderTest.testSelfInstanceTwoVarsReflectionObjectCycle(ToStringBuilderTest.java:549)

testShortArrayArray(org.apache.commons.lang3.builder.ToStringBuilderTest)  Time elapsed: 0 sec  <<< FAILURE!
org.junit.ComparisonFailure: expected:<[java.lang.Integer]@dda4f7b[{{1,2},<nul...> but was:<[]@dda4f7b[{{1,2},<nul...>
	at org.junit.Assert.assertEquals(Assert.java:115)
	at org.junit.Assert.assertEquals(Assert.java:144)
	at org.apache.commons.lang3.builder.ToStringBuilderTest.testShortArrayArray(ToStringBuilderTest.java:827)

testBooleanArrayArray(org.apache.commons.lang3.builder.ToStringBuilderTest)  Time elapsed: 0 sec  <<< FAILURE!
org.junit.ComparisonFailure: expected:<[java.lang.Integer]@dda4f7b[{{true,fals...> but was:<[]@dda4f7b[{{true,fals...>
	at org.junit.Assert.assertEquals(Assert.java:115)
	at org.junit.Assert.assertEquals(Assert.java:144)
	at org.apache.commons.lang3.builder.ToStringBuilderTest.testBooleanArrayArray(ToStringBuilderTest.java:877)

testFloatArray(org.apache.commons.lang3.builder.ToStringBuilderTest)  Time elapsed: 0.001 sec  <<< FAILURE!
org.junit.ComparisonFailure: expected:<[java.lang.Integer]@dda4f7b[{1.0,2.9876...> but was:<[]@dda4f7b[{1.0,2.9876...>
	at org.junit.Assert.assertEquals(Assert.java:115)
	at org.junit.Assert.assertEquals(Assert.java:144)
	at org.apache.commons.lang3.builder.ToStringBuilderTest.testFloatArray(ToStringBuilderTest.java:787)

testInt(org.apache.commons.lang3.builder.ToStringBuilderTest)  Time elapsed: 0.001 sec  <<< FAILURE!
org.junit.ComparisonFailure: expected:<[java.lang.Integer]@dda4f7b[3]> but was:<[]@dda4f7b[3]>
	at org.junit.Assert.assertEquals(Assert.java:115)
	at org.junit.Assert.assertEquals(Assert.java:144)
	at org.apache.commons.lang3.builder.ToStringBuilderTest.testInt(ToStringBuilderTest.java:665)

testByteArray(org.apache.commons.lang3.builder.ToStringBuilderTest)  Time elapsed: 0.001 sec  <<< FAILURE!
org.junit.ComparisonFailure: expected:<[java.lang.Integer]@dda4f7b[{1,2,-3,4}]> but was:<[]@dda4f7b[{1,2,-3,4}]>
	at org.junit.Assert.assertEquals(Assert.java:115)
	at org.junit.Assert.assertEquals(Assert.java:144)
	at org.apache.commons.lang3.builder.ToStringBuilderTest.testByteArray(ToStringBuilderTest.java:757)

testReflectionArrayCycle(org.apache.commons.lang3.builder.ToStringBuilderTest)  Time elapsed: 0.001 sec  <<< FAILURE!
org.junit.ComparisonFailure: expected:<[[Ljava.lang.Object;]@6d392fa5[{[Ljava.la...> but was:<[]@6d392fa5[{[Ljava.la...>
	at org.junit.Assert.assertEquals(Assert.java:115)
	at org.junit.Assert.assertEquals(Assert.java:144)
	at org.apache.commons.lang3.builder.ToStringBuilderTest.testReflectionArrayCycle(ToStringBuilderTest.java:402)

testReflectionLongArrayArray(org.apache.commons.lang3.builder.ToStringBuilderTest)  Time elapsed: 0 sec  <<< FAILURE!
org.junit.ComparisonFailure: expected:<[[[J]@456731a8[{{1,2},<nu...> but was:<[]@456731a8[{{1,2},<nu...>
	at org.junit.Assert.assertEquals(Assert.java:115)
	at org.junit.Assert.assertEquals(Assert.java:144)
	at org.apache.commons.lang3.builder.ToStringBuilderTest.testReflectionLongArrayArray(ToStringBuilderTest.java:253)

testBlank(org.apache.commons.lang3.builder.ToStringBuilderTest)  Time elapsed: 0 sec  <<< FAILURE!
org.junit.ComparisonFailure: expected:<[java.lang.Integer]@dda4f7b[]> but was:<[]@dda4f7b[]>
	at org.junit.Assert.assertEquals(Assert.java:115)
	at org.junit.Assert.assertEquals(Assert.java:144)
	at org.apache.commons.lang3.builder.ToStringBuilderTest.testBlank(ToStringBuilderTest.java:89)

testFloat(org.apache.commons.lang3.builder.ToStringBuilderTest)  Time elapsed: 0.001 sec  <<< FAILURE!
org.junit.ComparisonFailure: expected:<[java.lang.Integer]@dda4f7b[3.2]> but was:<[]@dda4f7b[3.2]>
	at org.junit.Assert.assertEquals(Assert.java:115)
	at org.junit.Assert.assertEquals(Assert.java:144)
	at org.apache.commons.lang3.builder.ToStringBuilderTest.testFloat(ToStringBuilderTest.java:701)

testShort(org.apache.commons.lang3.builder.ToStringBuilderTest)  Time elapsed: 0.001 sec  <<< FAILURE!
org.junit.ComparisonFailure: expected:<[java.lang.Integer]@dda4f7b[3]> but was:<[]@dda4f7b[3]>
	at org.junit.Assert.assertEquals(Assert.java:115)
	at org.junit.Assert.assertEquals(Assert.java:144)
	at org.apache.commons.lang3.builder.ToStringBuilderTest.testShort(ToStringBuilderTest.java:672)

testReflectionArrayArrayCycle(org.apache.commons.lang3.builder.ToStringBuilderTest)  Time elapsed: 0.001 sec  <<< FAILURE!
org.junit.ComparisonFailure: expected:<[[[Ljava.lang.Object;]@5d5ef3e7[{{[[Ljava....> but was:<[]@5d5ef3e7[{{[[Ljava....>
	at org.junit.Assert.assertEquals(Assert.java:115)
	at org.junit.Assert.assertEquals(Assert.java:144)
	at org.apache.commons.lang3.builder.ToStringBuilderTest.testReflectionArrayArrayCycle(ToStringBuilderTest.java:432)

testByte(org.apache.commons.lang3.builder.ToStringBuilderTest)  Time elapsed: 0.001 sec  <<< FAILURE!
org.junit.ComparisonFailure: expected:<[java.lang.Integer]@dda4f7b[3]> but was:<[]@dda4f7b[3]>
	at org.junit.Assert.assertEquals(Assert.java:115)
	at org.junit.Assert.assertEquals(Assert.java:144)
	at org.apache.commons.lang3.builder.ToStringBuilderTest.testByte(ToStringBuilderTest.java:686)

testChar(org.apache.commons.lang3.builder.ToStringBuilderTest)  Time elapsed: 0 sec  <<< FAILURE!
org.junit.ComparisonFailure: expected:<[java.lang.Integer]@dda4f7b[A]> but was:<[]@dda4f7b[A]>
	at org.junit.Assert.assertEquals(Assert.java:115)
	at org.junit.Assert.assertEquals(Assert.java:144)
	at org.apache.commons.lang3.builder.ToStringBuilderTest.testChar(ToStringBuilderTest.java:679)

testLong(org.apache.commons.lang3.builder.ToStringBuilderTest)  Time elapsed: 0 sec  <<< FAILURE!
org.junit.ComparisonFailure: expected:<[java.lang.Integer]@dda4f7b[3]> but was:<[]@dda4f7b[3]>
	at org.junit.Assert.assertEquals(Assert.java:115)
	at org.junit.Assert.assertEquals(Assert.java:144)
	at org.apache.commons.lang3.builder.ToStringBuilderTest.testLong(ToStringBuilderTest.java:657)

testReflectionFloatArray(org.apache.commons.lang3.builder.ToStringBuilderTest)  Time elapsed: 0.001 sec  <<< FAILURE!
org.junit.ComparisonFailure: expected:<[[F]@320a2593[{1.0,2.987...> but was:<[]@320a2593[{1.0,2.987...>
	at org.junit.Assert.assertEquals(Assert.java:115)
	at org.junit.Assert.assertEquals(Assert.java:144)
	at org.apache.commons.lang3.builder.ToStringBuilderTest.testReflectionFloatArray(ToStringBuilderTest.java:223)

testLongArrayArray(org.apache.commons.lang3.builder.ToStringBuilderTest)  Time elapsed: 0.001 sec  <<< FAILURE!
org.junit.ComparisonFailure: expected:<[java.lang.Integer]@dda4f7b[{{1,2},<nul...> but was:<[]@dda4f7b[{{1,2},<nul...>
	at org.junit.Assert.assertEquals(Assert.java:115)
	at org.junit.Assert.assertEquals(Assert.java:144)
	at org.apache.commons.lang3.builder.ToStringBuilderTest.testLongArrayArray(ToStringBuilderTest.java:807)

testBoolean(org.apache.commons.lang3.builder.ToStringBuilderTest)  Time elapsed: 0 sec  <<< FAILURE!
org.junit.ComparisonFailure: expected:<[java.lang.Integer]@dda4f7b[true]> but was:<[]@dda4f7b[true]>
	at org.junit.Assert.assertEquals(Assert.java:115)
	at org.junit.Assert.assertEquals(Assert.java:144)
	at org.apache.commons.lang3.builder.ToStringBuilderTest.testBoolean(ToStringBuilderTest.java:708)

testReflectionDoubleArrayArray(org.apache.commons.lang3.builder.ToStringBuilderTest)  Time elapsed: 0.001 sec  <<< FAILURE!
org.junit.ComparisonFailure: expected:<[[[D]@5dbd07dd[{{1.0,2.29...> but was:<[]@5dbd07dd[{{1.0,2.29...>
	at org.junit.Assert.assertEquals(Assert.java:115)
	at org.junit.Assert.assertEquals(Assert.java:144)
	at org.apache.commons.lang3.builder.ToStringBuilderTest.testReflectionDoubleArrayArray(ToStringBuilderTest.java:298)

testReflectionBooleanArray(org.apache.commons.lang3.builder.ToStringBuilderTest)  Time elapsed: 0.001 sec  <<< FAILURE!
org.junit.ComparisonFailure: expected:<[[Z]@3c536f11[{true,fals...> but was:<[]@3c536f11[{true,fals...>
	at org.junit.Assert.assertEquals(Assert.java:115)
	at org.junit.Assert.assertEquals(Assert.java:144)
	at org.apache.commons.lang3.builder.ToStringBuilderTest.testReflectionBooleanArray(ToStringBuilderTest.java:232)

testReflectionInteger(org.apache.commons.lang3.builder.ToStringBuilderTest)  Time elapsed: 0 sec  <<< FAILURE!
org.junit.ComparisonFailure: expected:<[java.lang.Integer]@dda4f7b[value=5]> but was:<[]@dda4f7b[value=5]>
	at org.junit.Assert.assertEquals(Assert.java:115)
	at org.junit.Assert.assertEquals(Assert.java:144)
	at org.apache.commons.lang3.builder.ToStringBuilderTest.testReflectionInteger(ToStringBuilderTest.java:97)

testBooleanArray(org.apache.commons.lang3.builder.ToStringBuilderTest)  Time elapsed: 0 sec  <<< FAILURE!
org.junit.ComparisonFailure: expected:<[java.lang.Integer]@dda4f7b[{true,false...> but was:<[]@dda4f7b[{true,false...>
	at org.junit.Assert.assertEquals(Assert.java:115)
	at org.junit.Assert.assertEquals(Assert.java:144)
	at org.apache.commons.lang3.builder.ToStringBuilderTest.testBooleanArray(ToStringBuilderTest.java:797)

testFloatArrayArray(org.apache.commons.lang3.builder.ToStringBuilderTest)  Time elapsed: 0.001 sec  <<< FAILURE!
org.junit.ComparisonFailure: expected:<[java.lang.Integer]@dda4f7b[{{1.0,2.296...> but was:<[]@dda4f7b[{{1.0,2.296...>
	at org.junit.Assert.assertEquals(Assert.java:115)
	at org.junit.Assert.assertEquals(Assert.java:144)
	at org.apache.commons.lang3.builder.ToStringBuilderTest.testFloatArrayArray(ToStringBuilderTest.java:867)

testReflectionyteArray(org.apache.commons.lang3.builder.ToStringBuilderTest)  Time elapsed: 0.001 sec  <<< FAILURE!
org.junit.ComparisonFailure: expected:<[[B]@2414b575[{1,2,-3,4}...> but was:<[]@2414b575[{1,2,-3,4}...>
	at org.junit.Assert.assertEquals(Assert.java:115)
	at org.junit.Assert.assertEquals(Assert.java:144)
	at org.apache.commons.lang3.builder.ToStringBuilderTest.testReflectionyteArray(ToStringBuilderTest.java:196)

testReflectionDoubleArray(org.apache.commons.lang3.builder.ToStringBuilderTest)  Time elapsed: 0 sec  <<< FAILURE!
org.junit.ComparisonFailure: expected:<[[D]@4b9526d4[{1.0,2.987...> but was:<[]@4b9526d4[{1.0,2.987...>
	at org.junit.Assert.assertEquals(Assert.java:115)
	at org.junit.Assert.assertEquals(Assert.java:144)
	at org.apache.commons.lang3.builder.ToStringBuilderTest.testReflectionDoubleArray(ToStringBuilderTest.java:214)

testReflectionIntArrayArray(org.apache.commons.lang3.builder.ToStringBuilderTest)  Time elapsed: 0.001 sec  <<< FAILURE!
org.junit.ComparisonFailure: expected:<[[[I]@2d284f10[{{1,2},<nu...> but was:<[]@2d284f10[{{1,2},<nu...>
	at org.junit.Assert.assertEquals(Assert.java:115)
	at org.junit.Assert.assertEquals(Assert.java:144)
	at org.apache.commons.lang3.builder.ToStringBuilderTest.testReflectionIntArrayArray(ToStringBuilderTest.java:262)

testSimpleReflectionStatics(org.apache.commons.lang3.builder.ToStringBuilderTest)  Time elapsed: 0.001 sec  <<< FAILURE!
org.junit.ComparisonFailure: expected:<[org.apache.commons.lang3.builder.ToStringBuilderTest$SimpleReflectionStaticFieldsFixture]@391b8a4c[staticStri...> but was:<[]@391b8a4c[staticStri...>
	at org.junit.Assert.assertEquals(Assert.java:115)
	at org.junit.Assert.assertEquals(Assert.java:144)
	at org.apache.commons.lang3.builder.ToStringBuilderTest.testSimpleReflectionStatics(ToStringBuilderTest.java:907)

testReflectionStatics(org.apache.commons.lang3.builder.ToStringBuilderTest)  Time elapsed: 0.001 sec  <<< FAILURE!
org.junit.ComparisonFailure: expected:<[org.apache.commons.lang3.builder.ToStringBuilderTest$ReflectionStaticFieldsFixture]@3d8290a3[staticStri...> but was:<[]@3d8290a3[staticStri...>
	at org.junit.Assert.assertEquals(Assert.java:115)
	at org.junit.Assert.assertEquals(Assert.java:144)
	at org.apache.commons.lang3.builder.ToStringBuilderTest.testReflectionStatics(ToStringBuilderTest.java:927)

testReflectionLongArray(org.apache.commons.lang3.builder.ToStringBuilderTest)  Time elapsed: 0.001 sec  <<< FAILURE!
org.junit.ComparisonFailure: expected:<[[J]@1d085c24[{1,2,-3,4}...> but was:<[]@1d085c24[{1,2,-3,4}...>
	at org.junit.Assert.assertEquals(Assert.java:115)
	at org.junit.Assert.assertEquals(Assert.java:144)
	at org.apache.commons.lang3.builder.ToStringBuilderTest.testReflectionLongArray(ToStringBuilderTest.java:169)

testReflectionhortArrayArray(org.apache.commons.lang3.builder.ToStringBuilderTest)  Time elapsed: 0 sec  <<< FAILURE!
org.junit.ComparisonFailure: expected:<[[[S]@fd94e60[{{1,2},<nul...> but was:<[]@fd94e60[{{1,2},<nul...>
	at org.junit.Assert.assertEquals(Assert.java:115)
	at org.junit.Assert.assertEquals(Assert.java:144)
	at org.apache.commons.lang3.builder.ToStringBuilderTest.testReflectionhortArrayArray(ToStringBuilderTest.java:271)

testReflectionObjectArray(org.apache.commons.lang3.builder.ToStringBuilderTest)  Time elapsed: 0 sec  <<< FAILURE!
org.junit.ComparisonFailure: expected:<[[Ljava.lang.Object;]@275a83d[{<null>,5,{...> but was:<[]@275a83d[{<null>,5,{...>
	at org.junit.Assert.assertEquals(Assert.java:115)
	at org.junit.Assert.assertEquals(Assert.java:144)
	at org.apache.commons.lang3.builder.ToStringBuilderTest.testReflectionObjectArray(ToStringBuilderTest.java:160)

testReflectionObjectCycle(org.apache.commons.lang3.builder.ToStringBuilderTest)  Time elapsed: 0.001 sec  <<< FAILURE!
org.junit.ComparisonFailure: expected:<[org.apache.commons.lang3.builder.ToStringBuilderTest$ReflectionTestCycleA@6c32064b[b=org.apache.commons.lang3.builder.ToStringBuilderTest$ReflectionTestCycleB]@483b5d6b[a=org.apac...> but was:<[@6c32064b[b=]@483b5d6b[a=org.apac...>
	at org.junit.Assert.assertEquals(Assert.java:115)
	at org.junit.Assert.assertEquals(Assert.java:144)
	at org.apache.commons.lang3.builder.ToStringBuilderTest.testReflectionObjectCycle(ToStringBuilderTest.java:562)

testReflectionBooleanArrayArray(org.apache.commons.lang3.builder.ToStringBuilderTest)  Time elapsed: 0 sec  <<< FAILURE!
org.junit.ComparisonFailure: expected:<[[[Z]@3b27402d[{{true,fal...> but was:<[]@3b27402d[{{true,fal...>
	at org.junit.Assert.assertEquals(Assert.java:115)
	at org.junit.Assert.assertEquals(Assert.java:144)
	at org.apache.commons.lang3.builder.ToStringBuilderTest.testReflectionBooleanArrayArray(ToStringBuilderTest.java:307)

testLongArray(org.apache.commons.lang3.builder.ToStringBuilderTest)  Time elapsed: 0 sec  <<< FAILURE!
org.junit.ComparisonFailure: expected:<[java.lang.Integer]@dda4f7b[{1,2,-3,4}]> but was:<[]@dda4f7b[{1,2,-3,4}]>
	at org.junit.Assert.assertEquals(Assert.java:115)
	at org.junit.Assert.assertEquals(Assert.java:144)
	at org.apache.commons.lang3.builder.ToStringBuilderTest.testLongArray(ToStringBuilderTest.java:727)

testSimpleReflectionObjectCycle(org.apache.commons.lang3.builder.ToStringBuilderTest)  Time elapsed: 0.001 sec  <<< FAILURE!
org.junit.ComparisonFailure: expected:<[org.apache.commons.lang3.builder.ToStringBuilderTest$SimpleReflectionTestFixture]@7040f445[o=org.apac...> but was:<[]@7040f445[o=org.apac...>
	at org.junit.Assert.assertEquals(Assert.java:115)
	at org.junit.Assert.assertEquals(Assert.java:144)
	at org.apache.commons.lang3.builder.ToStringBuilderTest.testSimpleReflectionObjectCycle(ToStringBuilderTest.java:530)

testShortArray(org.apache.commons.lang3.builder.ToStringBuilderTest)  Time elapsed: 0 sec  <<< FAILURE!
org.junit.ComparisonFailure: expected:<[java.lang.Integer]@dda4f7b[{1,2,-3,4}]> but was:<[]@dda4f7b[{1,2,-3,4}]>
	at org.junit.Assert.assertEquals(Assert.java:115)
	at org.junit.Assert.assertEquals(Assert.java:144)
	at org.apache.commons.lang3.builder.ToStringBuilderTest.testShortArray(ToStringBuilderTest.java:747)

testIntArrayArray(org.apache.commons.lang3.builder.ToStringBuilderTest)  Time elapsed: 0 sec  <<< FAILURE!
org.junit.ComparisonFailure: expected:<[java.lang.Integer]@dda4f7b[{{1,2},<nul...> but was:<[]@dda4f7b[{{1,2},<nul...>
	at org.junit.Assert.assertEquals(Assert.java:115)
	at org.junit.Assert.assertEquals(Assert.java:144)
	at org.apache.commons.lang3.builder.ToStringBuilderTest.testIntArrayArray(ToStringBuilderTest.java:817)

testInheritedReflectionStatics(org.apache.commons.lang3.builder.ToStringBuilderTest)  Time elapsed: 0.001 sec  <<< FAILURE!
org.junit.ComparisonFailure: expected:<[org.apache.commons.lang3.builder.ToStringBuilderTest$InheritedReflectionStaticFieldsFixture]@60f3d040[staticStri...> but was:<[]@60f3d040[staticStri...>
	at org.junit.Assert.assertEquals(Assert.java:115)
	at org.junit.Assert.assertEquals(Assert.java:144)
	at org.apache.commons.lang3.builder.ToStringBuilderTest.testInheritedReflectionStatics(ToStringBuilderTest.java:947)

testReflectionByteArrayArray(org.apache.commons.lang3.builder.ToStringBuilderTest)  Time elapsed: 0 sec  <<< FAILURE!
org.junit.ComparisonFailure: expected:<[[[B]@24f64a8d[{{1,2},<nu...> but was:<[]@24f64a8d[{{1,2},<nu...>
	at org.junit.Assert.assertEquals(Assert.java:115)
	at org.junit.Assert.assertEquals(Assert.java:144)
	at org.apache.commons.lang3.builder.ToStringBuilderTest.testReflectionByteArrayArray(ToStringBuilderTest.java:280)

testReflectionArrayCycleLevel2(org.apache.commons.lang3.builder.ToStringBuilderTest)  Time elapsed: 0 sec  <<< FAILURE!
org.junit.ComparisonFailure: expected:<[[Ljava.lang.Object;]@1594af77[{{[Ljava.l...> but was:<[]@1594af77[{{[Ljava.l...>
	at org.junit.Assert.assertEquals(Assert.java:115)
	at org.junit.Assert.assertEquals(Assert.java:144)
	at org.apache.commons.lang3.builder.ToStringBuilderTest.testReflectionArrayCycleLevel2(ToStringBuilderTest.java:416)

testAppendToString(org.apache.commons.lang3.builder.ToStringBuilderTest)  Time elapsed: 0 sec  <<< FAILURE!
org.junit.ComparisonFailure: expected:<[java.lang.Integer]@dda4f7b[]> but was:<[]@dda4f7b[]>
	at org.junit.Assert.assertEquals(Assert.java:115)
	at org.junit.Assert.assertEquals(Assert.java:144)
	at org.apache.commons.lang3.builder.ToStringBuilderTest.testAppendToString(ToStringBuilderTest.java:611)

testReflectionArrayAndObjectCycle(org.apache.commons.lang3.builder.ToStringBuilderTest)  Time elapsed: 0.001 sec  <<< FAILURE!
org.junit.ComparisonFailure: expected:<[[Ljava.lang.Object;@210ad97b[{org.apache.commons.lang3.builder.ToStringBuilderTest$SimpleReflectionTestFixture]@4f4c2b2f[o=[Ljava.l...> but was:<[@210ad97b[{]@4f4c2b2f[o=[Ljava.l...>
	at org.junit.Assert.assertEquals(Assert.java:115)
	at org.junit.Assert.assertEquals(Assert.java:144)
	at org.apache.commons.lang3.builder.ToStringBuilderTest.testReflectionArrayAndObjectCycle(ToStringBuilderTest.java:576)

testReflectionCharArrayArray(org.apache.commons.lang3.builder.ToStringBuilderTest)  Time elapsed: 0 sec  <<< FAILURE!
org.junit.ComparisonFailure: expected:<[[[C]@11a74355[{{A,B},<nu...> but was:<[]@11a74355[{{A,B},<nu...>
	at org.junit.Assert.assertEquals(Assert.java:115)
	at org.junit.Assert.assertEquals(Assert.java:144)
	at org.apache.commons.lang3.builder.ToStringBuilderTest.testReflectionCharArrayArray(ToStringBuilderTest.java:289)

testIntArray(org.apache.commons.lang3.builder.ToStringBuilderTest)  Time elapsed: 0.001 sec  <<< FAILURE!
org.junit.ComparisonFailure: expected:<[java.lang.Integer]@dda4f7b[{1,2,-3,4}]> but was:<[]@dda4f7b[{1,2,-3,4}]>
	at org.junit.Assert.assertEquals(Assert.java:115)
	at org.junit.Assert.assertEquals(Assert.java:144)
	at org.apache.commons.lang3.builder.ToStringBuilderTest.testIntArray(ToStringBuilderTest.java:737)

testDouble(org.apache.commons.lang3.builder.ToStringBuilderTest)  Time elapsed: 0 sec  <<< FAILURE!
org.junit.ComparisonFailure: expected:<[java.lang.Integer]@dda4f7b[3.2]> but was:<[]@dda4f7b[3.2]>
	at org.junit.Assert.assertEquals(Assert.java:115)
	at org.junit.Assert.assertEquals(Assert.java:144)
	at org.apache.commons.lang3.builder.ToStringBuilderTest.testDouble(ToStringBuilderTest.java:694)

testByteArrayArray(org.apache.commons.lang3.builder.ToStringBuilderTest)  Time elapsed: 0 sec  <<< FAILURE!
org.junit.ComparisonFailure: expected:<[java.lang.Integer]@dda4f7b[{{1,2},<nul...> but was:<[]@dda4f7b[{{1,2},<nul...>
	at org.junit.Assert.assertEquals(Assert.java:115)
	at org.junit.Assert.assertEquals(Assert.java:144)
	at org.apache.commons.lang3.builder.ToStringBuilderTest.testByteArrayArray(ToStringBuilderTest.java:837)

testReflectionShortArray(org.apache.commons.lang3.builder.ToStringBuilderTest)  Time elapsed: 0.001 sec  <<< FAILURE!
org.junit.ComparisonFailure: expected:<[[S]@8beab46[{1,2,-3,4}]> but was:<[]@8beab46[{1,2,-3,4}]>
	at org.junit.Assert.assertEquals(Assert.java:115)
	at org.junit.Assert.assertEquals(Assert.java:144)
	at org.apache.commons.lang3.builder.ToStringBuilderTest.testReflectionShortArray(ToStringBuilderTest.java:187)

testCharArrayArray(org.apache.commons.lang3.builder.ToStringBuilderTest)  Time elapsed: 0 sec  <<< FAILURE!
org.junit.ComparisonFailure: expected:<[java.lang.Integer]@dda4f7b[{{A,B},<nul...> but was:<[]@dda4f7b[{{A,B},<nul...>
	at org.junit.Assert.assertEquals(Assert.java:115)
	at org.junit.Assert.assertEquals(Assert.java:144)
	at org.apache.commons.lang3.builder.ToStringBuilderTest.testCharArrayArray(ToStringBuilderTest.java:847)

testSelfInstanceVarReflectionObjectCycle(org.apache.commons.lang3.builder.ToStringBuilderTest)  Time elapsed: 0.001 sec  <<< FAILURE!
org.junit.ComparisonFailure: expected:<[org.apache.commons.lang3.builder.ToStringBuilderTest$SelfInstanceVarReflectionTestFixture]@3a57c332[typeIsSelf...> but was:<[]@3a57c332[typeIsSelf...>
	at org.junit.Assert.assertEquals(Assert.java:115)
	at org.junit.Assert.assertEquals(Assert.java:144)
	at org.apache.commons.lang3.builder.ToStringBuilderTest.testSelfInstanceVarReflectionObjectCycle(ToStringBuilderTest.java:539)

testObject(org.apache.commons.lang3.builder.ToStringBuilderTest)  Time elapsed: 0 sec  <<< FAILURE!
org.junit.ComparisonFailure: expected:<[java.lang.Integer]@dda4f7b[<null>]> but was:<[]@dda4f7b[<null>]>
	at org.junit.Assert.assertEquals(Assert.java:115)
	at org.junit.Assert.assertEquals(Assert.java:144)
	at org.apache.commons.lang3.builder.ToStringBuilderTest.testObject(ToStringBuilderTest.java:623)

testAppendSuper(org.apache.commons.lang3.builder.ToStringBuilderTest)  Time elapsed: 0.001 sec  <<< FAILURE!
org.junit.ComparisonFailure: expected:<[java.lang.Integer]@dda4f7b[]> but was:<[]@dda4f7b[]>
	at org.junit.Assert.assertEquals(Assert.java:115)
	at org.junit.Assert.assertEquals(Assert.java:144)
	at org.apache.commons.lang3.builder.ToStringBuilderTest.testAppendSuper(ToStringBuilderTest.java:601)

testReflectionIntArray(org.apache.commons.lang3.builder.ToStringBuilderTest)  Time elapsed: 0 sec  <<< FAILURE!
org.junit.ComparisonFailure: expected:<[[I]@2250b410[{1,2,-3,4}...> but was:<[]@2250b410[{1,2,-3,4}...>
	at org.junit.Assert.assertEquals(Assert.java:115)
	at org.junit.Assert.assertEquals(Assert.java:144)
	at org.apache.commons.lang3.builder.ToStringBuilderTest.testReflectionIntArray(ToStringBuilderTest.java:178)

testReflectionCharArray(org.apache.commons.lang3.builder.ToStringBuilderTest)  Time elapsed: 0 sec  <<< FAILURE!
org.junit.ComparisonFailure: expected:<[[C]@605d9809[{A,2,_,D}]> but was:<[]@605d9809[{A,2,_,D}]>
	at org.junit.Assert.assertEquals(Assert.java:115)
	at org.junit.Assert.assertEquals(Assert.java:144)
	at org.apache.commons.lang3.builder.ToStringBuilderTest.testReflectionCharArray(ToStringBuilderTest.java:205)

testInnerClassReflection(org.apache.commons.lang3.builder.ToStringBuilderTest)  Time elapsed: 0 sec  <<< FAILURE!
org.junit.ComparisonFailure: expected:<[org.apache.commons.lang3.builder.ToStringBuilderTest$Outer@20c12654[inner=org.apache.commons.lang3.builder.ToStringBuilderTest$Outer$Inner]@68bb6598[]]> but was:<[@20c12654[inner=]@68bb6598[]]>
	at org.junit.Assert.assertEquals(Assert.java:115)
	at org.junit.Assert.assertEquals(Assert.java:144)
	at org.apache.commons.lang3.builder.ToStringBuilderTest.testInnerClassReflection(ToStringBuilderTest.java:376)

testReflectionCharacter(org.apache.commons.lang3.builder.ToStringBuilderTest)  Time elapsed: 0 sec  <<< FAILURE!
org.junit.ComparisonFailure: expected:<[java.lang.Character]@1de61363[value=A]> but was:<[]@1de61363[value=A]>
	at org.junit.Assert.assertEquals(Assert.java:115)
	at org.junit.Assert.assertEquals(Assert.java:144)
	at org.apache.commons.lang3.builder.ToStringBuilderTest.testReflectionCharacter(ToStringBuilderTest.java:106)

testDoubleArray(org.apache.commons.lang3.builder.ToStringBuilderTest)  Time elapsed: 0.001 sec  <<< FAILURE!
org.junit.ComparisonFailure: expected:<[java.lang.Integer]@dda4f7b[{1.0,2.9876...> but was:<[]@dda4f7b[{1.0,2.9876...>
	at org.junit.Assert.assertEquals(Assert.java:115)
	at org.junit.Assert.assertEquals(Assert.java:144)
	at org.apache.commons.lang3.builder.ToStringBuilderTest.testDoubleArray(ToStringBuilderTest.java:777)

testReflectionFloatArrayArray(org.apache.commons.lang3.builder.ToStringBuilderTest)  Time elapsed: 0 sec  <<< FAILURE!
org.junit.ComparisonFailure: expected:<[[[F]@6c02d7ea[{{1.0,2.29...> but was:<[]@6c02d7ea[{{1.0,2.29...>
	at org.junit.Assert.assertEquals(Assert.java:115)
	at org.junit.Assert.assertEquals(Assert.java:144)
	at org.apache.commons.lang3.builder.ToStringBuilderTest.testReflectionFloatArrayArray(ToStringBuilderTest.java:243)

Running org.apache.commons.lang3.builder.EqualsBuilderTest
Tests run: 48, Failures: 0, Errors: 0, Skipped: 0, Time elapsed: 0.011 sec - in org.apache.commons.lang3.builder.EqualsBuilderTest
Running org.apache.commons.lang3.builder.HashCodeBuilderAndEqualsBuilderTest
Tests run: 4, Failures: 0, Errors: 0, Skipped: 0, Time elapsed: 0.008 sec - in org.apache.commons.lang3.builder.HashCodeBuilderAndEqualsBuilderTest
Running org.apache.commons.lang3.builder.ReflectionToStringBuilderConcurrencyTest
Tests run: 3, Failures: 0, Errors: 0, Skipped: 3, Time elapsed: 0.001 sec - in org.apache.commons.lang3.builder.ReflectionToStringBuilderConcurrencyTest
Running org.apache.commons.lang3.builder.JsonToStringStyleTest
Tests run: 9, Failures: 0, Errors: 0, Skipped: 0, Time elapsed: 0.003 sec - in org.apache.commons.lang3.builder.JsonToStringStyleTest
Running org.apache.commons.lang3.builder.NoClassNameToStringStyleTest
Tests run: 8, Failures: 0, Errors: 0, Skipped: 0, Time elapsed: 0.003 sec - in org.apache.commons.lang3.builder.NoClassNameToStringStyleTest
Running org.apache.commons.lang3.builder.DiffBuilderTest
Tests run: 30, Failures: 0, Errors: 0, Skipped: 0, Time elapsed: 0.031 sec - in org.apache.commons.lang3.builder.DiffBuilderTest
Running org.apache.commons.lang3.builder.HashCodeBuilderTest
Tests run: 44, Failures: 0, Errors: 0, Skipped: 0, Time elapsed: 0.015 sec - in org.apache.commons.lang3.builder.HashCodeBuilderTest
Running org.apache.commons.lang3.concurrent.AtomicInitializerTest
Tests run: 3, Failures: 0, Errors: 0, Skipped: 0, Time elapsed: 0.008 sec - in org.apache.commons.lang3.concurrent.AtomicInitializerTest
Running org.apache.commons.lang3.concurrent.CallableBackgroundInitializerTest
Tests run: 4, Failures: 0, Errors: 0, Skipped: 0, Time elapsed: 0.003 sec - in org.apache.commons.lang3.concurrent.CallableBackgroundInitializerTest
Running org.apache.commons.lang3.concurrent.BackgroundInitializerTest
Tests run: 15, Failures: 0, Errors: 0, Skipped: 0, Time elapsed: 0.012 sec - in org.apache.commons.lang3.concurrent.BackgroundInitializerTest
Running org.apache.commons.lang3.concurrent.LazyInitializerTest
Tests run: 3, Failures: 0, Errors: 0, Skipped: 0, Time elapsed: 0.002 sec - in org.apache.commons.lang3.concurrent.LazyInitializerTest
Running org.apache.commons.lang3.concurrent.BasicThreadFactoryTest
Tests run: 15, Failures: 0, Errors: 0, Skipped: 0, Time elapsed: 0.033 sec - in org.apache.commons.lang3.concurrent.BasicThreadFactoryTest
Running org.apache.commons.lang3.concurrent.ConstantInitializerTest
Tests run: 7, Failures: 0, Errors: 0, Skipped: 0, Time elapsed: 0 sec - in org.apache.commons.lang3.concurrent.ConstantInitializerTest
Running org.apache.commons.lang3.concurrent.MultiBackgroundInitializerTest
Tests run: 17, Failures: 0, Errors: 0, Skipped: 0, Time elapsed: 0.063 sec - in org.apache.commons.lang3.concurrent.MultiBackgroundInitializerTest
Running org.apache.commons.lang3.concurrent.AtomicSafeInitializerTest
Tests run: 4, Failures: 0, Errors: 0, Skipped: 0, Time elapsed: 0.008 sec - in org.apache.commons.lang3.concurrent.AtomicSafeInitializerTest
Running org.apache.commons.lang3.concurrent.ConcurrentUtilsTest
Tests run: 40, Failures: 0, Errors: 0, Skipped: 0, Time elapsed: 0.016 sec - in org.apache.commons.lang3.concurrent.ConcurrentUtilsTest
Running org.apache.commons.lang3.concurrent.TimedSemaphoreTest
Tests run: 15, Failures: 0, Errors: 0, Skipped: 0, Time elapsed: 1.19 sec - in org.apache.commons.lang3.concurrent.TimedSemaphoreTest
Running org.apache.commons.lang3.StringUtilsSubstringTest
Tests run: 14, Failures: 0, Errors: 0, Skipped: 0, Time elapsed: 0.001 sec - in org.apache.commons.lang3.StringUtilsSubstringTest
Running org.apache.commons.lang3.SystemUtilsTest
Tests run: 12, Failures: 0, Errors: 0, Skipped: 0, Time elapsed: 0.001 sec - in org.apache.commons.lang3.SystemUtilsTest
Running org.apache.commons.lang3.CharRangeTest
Tests run: 16, Failures: 0, Errors: 0, Skipped: 0, Time elapsed: 0.02 sec - in org.apache.commons.lang3.CharRangeTest
Running org.apache.commons.lang3.CharSetTest
Tests run: 14, Failures: 0, Errors: 0, Skipped: 0, Time elapsed: 0.01 sec - in org.apache.commons.lang3.CharSetTest
Running org.apache.commons.lang3.StringUtilsStartsEndsWithTest
Tests run: 6, Failures: 0, Errors: 0, Skipped: 0, Time elapsed: 0.003 sec - in org.apache.commons.lang3.StringUtilsStartsEndsWithTest
Running org.apache.commons.lang3.RandomStringUtilsTest
Tests run: 11, Failures: 0, Errors: 0, Skipped: 0, Time elapsed: 0.033 sec - in org.apache.commons.lang3.RandomStringUtilsTest
Running org.apache.commons.lang3.SerializationUtilsTest
Tests run: 26, Failures: 0, Errors: 0, Skipped: 0, Time elapsed: 0.039 sec - in org.apache.commons.lang3.SerializationUtilsTest
Running org.apache.commons.lang3.time.StopWatchTest
Tests run: 8, Failures: 0, Errors: 0, Skipped: 0, Time elapsed: 4.763 sec - in org.apache.commons.lang3.time.StopWatchTest
Running org.apache.commons.lang3.time.DateUtilsRoundingTest
Tests run: 22, Failures: 0, Errors: 0, Skipped: 0, Time elapsed: 0.157 sec - in org.apache.commons.lang3.time.DateUtilsRoundingTest
Running org.apache.commons.lang3.time.FastDateParserTest
Tests run: 33, Failures: 0, Errors: 0, Skipped: 0, Time elapsed: 2.111 sec - in org.apache.commons.lang3.time.FastDateParserTest
Running org.apache.commons.lang3.time.FastDateFormat_ParserTest
Tests run: 33, Failures: 0, Errors: 0, Skipped: 0, Time elapsed: 0.688 sec - in org.apache.commons.lang3.time.FastDateFormat_ParserTest
Running org.apache.commons.lang3.time.DurationFormatUtilsTest
Tests run: 25, Failures: 0, Errors: 0, Skipped: 0, Time elapsed: 0.735 sec - in org.apache.commons.lang3.time.DurationFormatUtilsTest
Running org.apache.commons.lang3.time.DateFormatUtilsTest
Tests run: 10, Failures: 0, Errors: 0, Skipped: 0, Time elapsed: 0.002 sec - in org.apache.commons.lang3.time.DateFormatUtilsTest
Running org.apache.commons.lang3.time.DateUtilsFragmentTest
Tests run: 57, Failures: 0, Errors: 0, Skipped: 0, Time elapsed: 0.01 sec - in org.apache.commons.lang3.time.DateUtilsFragmentTest
Running org.apache.commons.lang3.time.FastDatePrinterTimeZonesTest
Tests run: 617, Failures: 0, Errors: 0, Skipped: 0, Time elapsed: 0.229 sec - in org.apache.commons.lang3.time.FastDatePrinterTimeZonesTest
Running org.apache.commons.lang3.time.FastDateFormatTest
>>FastDateFormatTest: FastDateParser:36689  SimpleDateFormat:3493
Tests run: 14, Failures: 0, Errors: 0, Skipped: 0, Time elapsed: 4.375 sec - in org.apache.commons.lang3.time.FastDateFormatTest
Running org.apache.commons.lang3.time.FastDateFormat_PrinterTest
Tests run: 17, Failures: 0, Errors: 0, Skipped: 0, Time elapsed: 0.007 sec - in org.apache.commons.lang3.time.FastDateFormat_PrinterTest
Running org.apache.commons.lang3.time.FastDatePrinterTest
Tests run: 17, Failures: 0, Errors: 0, Skipped: 0, Time elapsed: 0.004 sec - in org.apache.commons.lang3.time.FastDatePrinterTest
Running org.apache.commons.lang3.time.FastDateParserSDFTest
Tests run: 276, Failures: 0, Errors: 0, Skipped: 92, Time elapsed: 0.06 sec - in org.apache.commons.lang3.time.FastDateParserSDFTest
Running org.apache.commons.lang3.time.DateUtilsTest
DateUtilsTest: Default Locale=en_US
Tests run: 38, Failures: 0, Errors: 0, Skipped: 0, Time elapsed: 0.019 sec - in org.apache.commons.lang3.time.DateUtilsTest
Running org.apache.commons.lang3.reflect.InheritanceUtilsTest
Tests run: 9, Failures: 0, Errors: 0, Skipped: 0, Time elapsed: 0.008 sec - in org.apache.commons.lang3.reflect.InheritanceUtilsTest
Running org.apache.commons.lang3.reflect.MethodUtilsTest
Tests run: 23, Failures: 0, Errors: 0, Skipped: 0, Time elapsed: 0.024 sec - in org.apache.commons.lang3.reflect.MethodUtilsTest
Running org.apache.commons.lang3.reflect.ConstructorUtilsTest
Tests run: 7, Failures: 0, Errors: 0, Skipped: 0, Time elapsed: 0.004 sec - in org.apache.commons.lang3.reflect.ConstructorUtilsTest
Running org.apache.commons.lang3.reflect.FieldUtilsTest
Tests run: 64, Failures: 0, Errors: 0, Skipped: 0, Time elapsed: 0.026 sec - in org.apache.commons.lang3.reflect.FieldUtilsTest
Running org.apache.commons.lang3.reflect.TypeLiteralTest
Tests run: 4, Failures: 0, Errors: 0, Skipped: 0, Time elapsed: 0.005 sec - in org.apache.commons.lang3.reflect.TypeLiteralTest
Running org.apache.commons.lang3.reflect.TypeUtilsTest
Tests run: 19, Failures: 0, Errors: 0, Skipped: 0, Time elapsed: 0.046 sec - in org.apache.commons.lang3.reflect.TypeUtilsTest
Running org.apache.commons.lang3.mutable.MutableByteTest
Tests run: 17, Failures: 0, Errors: 0, Skipped: 0, Time elapsed: 0.002 sec - in org.apache.commons.lang3.mutable.MutableByteTest
Running org.apache.commons.lang3.mutable.MutableShortTest
Tests run: 14, Failures: 0, Errors: 0, Skipped: 0, Time elapsed: 0.002 sec - in org.apache.commons.lang3.mutable.MutableShortTest
Running org.apache.commons.lang3.mutable.MutableIntTest
Tests run: 17, Failures: 0, Errors: 0, Skipped: 0, Time elapsed: 0.002 sec - in org.apache.commons.lang3.mutable.MutableIntTest
Running org.apache.commons.lang3.mutable.MutableDoubleTest
Tests run: 18, Failures: 0, Errors: 0, Skipped: 0, Time elapsed: 0.003 sec - in org.apache.commons.lang3.mutable.MutableDoubleTest
Running org.apache.commons.lang3.mutable.MutableFloatTest
Tests run: 18, Failures: 0, Errors: 0, Skipped: 0, Time elapsed: 0.004 sec - in org.apache.commons.lang3.mutable.MutableFloatTest
Running org.apache.commons.lang3.mutable.MutableLongTest
Tests run: 17, Failures: 0, Errors: 0, Skipped: 0, Time elapsed: 0.004 sec - in org.apache.commons.lang3.mutable.MutableLongTest
Running org.apache.commons.lang3.mutable.MutableBooleanTest
Tests run: 9, Failures: 0, Errors: 0, Skipped: 0, Time elapsed: 0.004 sec - in org.apache.commons.lang3.mutable.MutableBooleanTest
Running org.apache.commons.lang3.mutable.MutableObjectTest
Tests run: 5, Failures: 0, Errors: 0, Skipped: 0, Time elapsed: 0 sec - in org.apache.commons.lang3.mutable.MutableObjectTest
Running org.apache.commons.lang3.text.translate.UnicodeEscaperTest
Tests run: 3, Failures: 0, Errors: 0, Skipped: 0, Time elapsed: 0 sec - in org.apache.commons.lang3.text.translate.UnicodeEscaperTest
Running org.apache.commons.lang3.text.translate.EntityArraysTest
Tests run: 3, Failures: 0, Errors: 0, Skipped: 0, Time elapsed: 0 sec - in org.apache.commons.lang3.text.translate.EntityArraysTest
Running org.apache.commons.lang3.text.translate.UnicodeUnpairedSurrogateRemoverTest
Tests run: 2, Failures: 0, Errors: 0, Skipped: 0, Time elapsed: 0.001 sec - in org.apache.commons.lang3.text.translate.UnicodeUnpairedSurrogateRemoverTest
Running org.apache.commons.lang3.text.translate.NumericEntityUnescaperTest
Tests run: 3, Failures: 0, Errors: 0, Skipped: 0, Time elapsed: 0 sec - in org.apache.commons.lang3.text.translate.NumericEntityUnescaperTest
Running org.apache.commons.lang3.text.translate.NumericEntityEscaperTest
Tests run: 4, Failures: 0, Errors: 0, Skipped: 0, Time elapsed: 0.001 sec - in org.apache.commons.lang3.text.translate.NumericEntityEscaperTest
Running org.apache.commons.lang3.text.translate.LookupTranslatorTest
Tests run: 2, Failures: 0, Errors: 0, Skipped: 0, Time elapsed: 0 sec - in org.apache.commons.lang3.text.translate.LookupTranslatorTest
Running org.apache.commons.lang3.text.translate.UnicodeUnescaperTest
Tests run: 3, Failures: 0, Errors: 0, Skipped: 0, Time elapsed: 0.001 sec - in org.apache.commons.lang3.text.translate.UnicodeUnescaperTest
Running org.apache.commons.lang3.text.translate.OctalUnescaperTest
Tests run: 1, Failures: 0, Errors: 0, Skipped: 0, Time elapsed: 0 sec - in org.apache.commons.lang3.text.translate.OctalUnescaperTest
Running org.apache.commons.lang3.text.StrMatcherTest
Tests run: 14, Failures: 0, Errors: 0, Skipped: 0, Time elapsed: 0.003 sec - in org.apache.commons.lang3.text.StrMatcherTest
Running org.apache.commons.lang3.text.StrTokenizerTest
Tests run: 55, Failures: 0, Errors: 0, Skipped: 0, Time elapsed: 0.011 sec - in org.apache.commons.lang3.text.StrTokenizerTest
Running org.apache.commons.lang3.text.FormattableUtilsTest
Tests run: 5, Failures: 0, Errors: 0, Skipped: 0, Time elapsed: 0 sec - in org.apache.commons.lang3.text.FormattableUtilsTest
Running org.apache.commons.lang3.text.CompositeFormatTest
Tests run: 2, Failures: 0, Errors: 0, Skipped: 0, Time elapsed: 0 sec - in org.apache.commons.lang3.text.CompositeFormatTest
Running org.apache.commons.lang3.text.WordUtilsTest
Tests run: 12, Failures: 0, Errors: 0, Skipped: 0, Time elapsed: 0.003 sec - in org.apache.commons.lang3.text.WordUtilsTest
Running org.apache.commons.lang3.text.StrLookupTest
Tests run: 5, Failures: 0, Errors: 0, Skipped: 0, Time elapsed: 0.002 sec - in org.apache.commons.lang3.text.StrLookupTest
Running org.apache.commons.lang3.text.StrBuilderAppendInsertTest
Tests run: 51, Failures: 0, Errors: 0, Skipped: 0, Time elapsed: 0.009 sec - in org.apache.commons.lang3.text.StrBuilderAppendInsertTest
Running org.apache.commons.lang3.text.ExtendedMessageFormatTest
Tests run: 10, Failures: 0, Errors: 0, Skipped: 0, Time elapsed: 0.758 sec - in org.apache.commons.lang3.text.ExtendedMessageFormatTest
Running org.apache.commons.lang3.text.StrSubstitutorTest
Tests run: 40, Failures: 0, Errors: 0, Skipped: 0, Time elapsed: 0.031 sec - in org.apache.commons.lang3.text.StrSubstitutorTest
Running org.apache.commons.lang3.text.StrBuilderTest
Tests run: 90, Failures: 0, Errors: 0, Skipped: 0, Time elapsed: 0.042 sec - in org.apache.commons.lang3.text.StrBuilderTest
Running org.apache.commons.lang3.StringEscapeUtilsTest
Tests run: 28, Failures: 0, Errors: 0, Skipped: 0, Time elapsed: 0.386 sec - in org.apache.commons.lang3.StringEscapeUtilsTest
Running org.apache.commons.lang3.AnnotationUtilsTest
Tests run: 10, Failures: 1, Errors: 0, Skipped: 0, Time elapsed: 0.023 sec <<< FAILURE! - in org.apache.commons.lang3.AnnotationUtilsTest
testToString(org.apache.commons.lang3.AnnotationUtilsTest)  Time elapsed: 0.002 sec  <<< FAILURE!
java.lang.AssertionError: null
	at org.junit.Assert.fail(Assert.java:86)
	at org.junit.Assert.assertTrue(Assert.java:41)
	at org.junit.Assert.assertTrue(Assert.java:52)
	at org.apache.commons.lang3.AnnotationUtilsTest.testToString(AnnotationUtilsTest.java:501)

Running org.apache.commons.lang3.ConversionTest
Tests run: 42, Failures: 0, Errors: 0, Skipped: 0, Time elapsed: 0.014 sec - in org.apache.commons.lang3.ConversionTest
Running org.apache.commons.lang3.StringUtilsTrimEmptyTest
Tests run: 15, Failures: 0, Errors: 0, Skipped: 0, Time elapsed: 0.005 sec - in org.apache.commons.lang3.StringUtilsTrimEmptyTest
Running org.apache.commons.lang3.EnumUtilsTest
Tests run: 34, Failures: 0, Errors: 0, Skipped: 0, Time elapsed: 0.008 sec - in org.apache.commons.lang3.EnumUtilsTest
Running org.apache.commons.lang3.exception.ExceptionUtilsTest
Tests run: 28, Failures: 0, Errors: 0, Skipped: 0, Time elapsed: 0.023 sec - in org.apache.commons.lang3.exception.ExceptionUtilsTest
Running org.apache.commons.lang3.exception.DefaultExceptionContextTest
Tests run: 8, Failures: 0, Errors: 0, Skipped: 0, Time elapsed: 0.004 sec - in org.apache.commons.lang3.exception.DefaultExceptionContextTest
Running org.apache.commons.lang3.exception.ContextedExceptionTest
Tests run: 14, Failures: 0, Errors: 0, Skipped: 0, Time elapsed: 0.009 sec - in org.apache.commons.lang3.exception.ContextedExceptionTest
Running org.apache.commons.lang3.exception.ContextedRuntimeExceptionTest
Tests run: 14, Failures: 0, Errors: 0, Skipped: 0, Time elapsed: 0.01 sec - in org.apache.commons.lang3.exception.ContextedRuntimeExceptionTest
Running org.apache.commons.lang3.BitFieldTest
Tests run: 15, Failures: 0, Errors: 0, Skipped: 0, Time elapsed: 0.002 sec - in org.apache.commons.lang3.BitFieldTest
Running org.apache.commons.lang3.ArrayUtilsRemoveMultipleTest
Tests run: 55, Failures: 0, Errors: 0, Skipped: 0, Time elapsed: 0.014 sec - in org.apache.commons.lang3.ArrayUtilsRemoveMultipleTest
Running org.apache.commons.lang3.HashSetvBitSetTest
Ratio=8% array=100 count=1 extract=24420190 bitset=1992798
Ratio=14% array=100 count=10 extract=13182236 bitset=1891119
Ratio=9% array=100 count=50 extract=6353048 bitset=578417
Ratio=4% array=100 count=100 extract=9728099 bitset=417171
Ratio=82% array=1000 count=10 extract=5680369 bitset=4696887
Ratio=32% array=1000 count=100 extract=14685533 bitset=4775410
Ratio=7% array=1000 count=500 extract=41917023 bitset=3186743
Ratio=1% array=1000 count=1000 extract=68961785 bitset=731102
Ratio=3% count=0 hash=3698387 bits=131933
Ratio=32% count=5 hash=594832 bits=194050
Ratio=31% count=10 hash=904087 bits=284728
Ratio=22% count=200 hash=18177249 bits=4133878
Ratio=20% count=50 hash=6371610 bits=1333721
Ratio=21% count=100 hash=14623446 bits=3122928
Ratio=19% count=1000 hash=81862880 bits=15834517
Ratio=21% count=2000 hash=144644468 bits=31220719
Tests run: 2, Failures: 0, Errors: 0, Skipped: 0, Time elapsed: 0.633 sec - in org.apache.commons.lang3.HashSetvBitSetTest
Running org.apache.commons.lang3.StringUtilsTest
Tests run: 124, Failures: 0, Errors: 0, Skipped: 0, Time elapsed: 0.159 sec - in org.apache.commons.lang3.StringUtilsTest
Running org.apache.commons.lang3.ArrayUtilsRemoveTest
Tests run: 19, Failures: 0, Errors: 0, Skipped: 0, Time elapsed: 0.002 sec - in org.apache.commons.lang3.ArrayUtilsRemoveTest
Running org.apache.commons.lang3.ObjectUtilsTest
Tests run: 36, Failures: 0, Errors: 0, Skipped: 0, Time elapsed: 0.015 sec - in org.apache.commons.lang3.ObjectUtilsTest
Running org.apache.commons.lang3.ClassPathUtilsTest
Tests run: 13, Failures: 0, Errors: 0, Skipped: 0, Time elapsed: 0.003 sec - in org.apache.commons.lang3.ClassPathUtilsTest
Running org.apache.commons.lang3.math.NumberUtilsTest
Tests run: 91, Failures: 0, Errors: 0, Skipped: 0, Time elapsed: 0.035 sec - in org.apache.commons.lang3.math.NumberUtilsTest
Running org.apache.commons.lang3.math.IEEE754rUtilsTest
Tests run: 3, Failures: 0, Errors: 0, Skipped: 0, Time elapsed: 0.001 sec - in org.apache.commons.lang3.math.IEEE754rUtilsTest
Running org.apache.commons.lang3.math.FractionTest
Tests run: 25, Failures: 0, Errors: 0, Skipped: 0, Time elapsed: 0.328 sec - in org.apache.commons.lang3.math.FractionTest
Running org.apache.commons.lang3.BooleanUtilsTest
Tests run: 72, Failures: 0, Errors: 0, Skipped: 0, Time elapsed: 0.009 sec - in org.apache.commons.lang3.BooleanUtilsTest
Running org.apache.commons.lang3.CharSequenceUtilsTest
Tests run: 2, Failures: 0, Errors: 0, Skipped: 0, Time elapsed: 0 sec - in org.apache.commons.lang3.CharSequenceUtilsTest
Running org.apache.commons.lang3.CharSetUtilsTest
Tests run: 11, Failures: 0, Errors: 0, Skipped: 0, Time elapsed: 0.007 sec - in org.apache.commons.lang3.CharSetUtilsTest
Running org.apache.commons.lang3.ArrayUtilsAddTest
Tests run: 13, Failures: 0, Errors: 0, Skipped: 0, Time elapsed: 0.008 sec - in org.apache.commons.lang3.ArrayUtilsAddTest
Running org.apache.commons.lang3.CharEncodingTest
Tests run: 6, Failures: 0, Errors: 0, Skipped: 0, Time elapsed: 0.013 sec - in org.apache.commons.lang3.CharEncodingTest
Running org.apache.commons.lang3.ClassUtilsTest
Tests run: 57, Failures: 0, Errors: 0, Skipped: 0, Time elapsed: 0.021 sec - in org.apache.commons.lang3.ClassUtilsTest
Running org.apache.commons.lang3.RangeTest
Tests run: 24, Failures: 0, Errors: 0, Skipped: 0, Time elapsed: 0.006 sec - in org.apache.commons.lang3.RangeTest
Running org.apache.commons.lang3.event.EventUtilsTest
Tests run: 8, Failures: 0, Errors: 0, Skipped: 0, Time elapsed: 0.017 sec - in org.apache.commons.lang3.event.EventUtilsTest
Running org.apache.commons.lang3.event.EventListenerSupportTest
Tests run: 9, Failures: 0, Errors: 0, Skipped: 0, Time elapsed: 0.02 sec - in org.apache.commons.lang3.event.EventListenerSupportTest
Running org.apache.commons.lang3.ArrayUtilsTest
Tests run: 205, Failures: 0, Errors: 0, Skipped: 0, Time elapsed: 0.046 sec - in org.apache.commons.lang3.ArrayUtilsTest
Running org.apache.commons.lang3.CharUtilsTest
Tests run: 24, Failures: 0, Errors: 0, Skipped: 0, Time elapsed: 0.001 sec - in org.apache.commons.lang3.CharUtilsTest
Running org.apache.commons.lang3.NotImplementedExceptionTest
Tests run: 1, Failures: 0, Errors: 0, Skipped: 0, Time elapsed: 0 sec - in org.apache.commons.lang3.NotImplementedExceptionTest
Running org.apache.commons.lang3.StringUtilsEqualsIndexOfTest
Tests run: 50, Failures: 0, Errors: 0, Skipped: 0, Time elapsed: 0.006 sec - in org.apache.commons.lang3.StringUtilsEqualsIndexOfTest
Running org.apache.commons.lang3.RandomUtilsTest
Tests run: 23, Failures: 0, Errors: 0, Skipped: 0, Time elapsed: 0.001 sec - in org.apache.commons.lang3.RandomUtilsTest

Results :

Failed tests: 
  AnnotationUtilsTest.testToString:501 null
  DefaultToStringStyleTest.testAppendSuper:58 expected:<[java.lang.Integer]@dda4f7b[]> but was:<[]@dda4f7b[]>
  DefaultToStringStyleTest.testBlank:53 expected:<[java.lang.Integer]@dda4f7b[]> but was:<[]@dda4f7b[]>
  DefaultToStringStyleTest.testLong:96 expected:<[java.lang.Integer]@dda4f7b[3]> but was:<[]@dda4f7b[3]>
  DefaultToStringStyleTest.testLongArray:114 expected:<[java.lang.Integer]@dda4f7b[{1,2,-3,4}]> but was:<[]@dda4f7b[{1,2,-3,4}]>
  DefaultToStringStyleTest.testLongArrayArray:124 expected:<[java.lang.Integer]@dda4f7b[{{1,2},<nul...> but was:<[]@dda4f7b[{{1,2},<nul...>
  DefaultToStringStyleTest.testObject:70 expected:<[java.lang.Integer]@dda4f7b[<null>]> but was:<[]@dda4f7b[<null>]>
  DefaultToStringStyleTest.testObjectArray:104 expected:<[java.lang.Integer]@dda4f7b[{<null>,5,{...> but was:<[]@dda4f7b[{<null>,5,{...>
  DefaultToStringStyleTest.testPerson:91 expected:<[org.apache.commons.lang3.builder.ToStringStyleTest$Person]@4260904e[name=John ...> but was:<[]@4260904e[name=John ...>
  DiffResultTest.testToStringOutput:95 expected:<[DiffResultTest.EmptyClass[test=false] differs from DiffResultTest.EmptyClass][test=true]> but was:<[[test=false] differs from ][test=true]>
  MultiLineToStringStyleTest.testAppendSuper:59 expected:<[java.lang.Integer]@dda4f7b[
]> but was:<[]@dda4f7b[
]>
  MultiLineToStringStyleTest.testBlank:54 expected:<[java.lang.Integer]@dda4f7b[
]> but was:<[]@dda4f7b[
]>
  MultiLineToStringStyleTest.testLong:97 expected:<[java.lang.Integer]@dda4f7b[
  3
]> but was:<[]@dda4f7b[
  3
]>
  MultiLineToStringStyleTest.testLongArray:115 expected:<[java.lang.Integer]@dda4f7b[
  {1,2,-3,...> but was:<[]@dda4f7b[
  {1,2,-3,...>
  MultiLineToStringStyleTest.testLongArrayArray:125 expected:<[java.lang.Integer]@dda4f7b[
  {{1,2},<...> but was:<[]@dda4f7b[
  {{1,2},<...>
  MultiLineToStringStyleTest.testObject:71 expected:<[java.lang.Integer]@dda4f7b[
  <null>
]> but was:<[]@dda4f7b[
  <null>
]>
  MultiLineToStringStyleTest.testObjectArray:105 expected:<[java.lang.Integer]@dda4f7b[
  {<null>,...> but was:<[]@dda4f7b[
  {<null>,...>
  MultiLineToStringStyleTest.testPerson:92 expected:<[org.apache.commons.lang3.builder.ToStringStyleTest$Person]@112a39aa[
  name=Ja...> but was:<[]@112a39aa[
  name=Ja...>
  MultilineRecursiveToStringStyleTest.boolArray:113 expected:<[org.apache.commons.lang3.builder.MultilineRecursiveToStringStyleTest$WithArrays]@3435c7be[
  boolArr...> but was:<[]@3435c7be[
  boolArr...>
  MultilineRecursiveToStringStyleTest.charArray:131 expected:<[org.apache.commons.lang3.builder.MultilineRecursiveToStringStyleTest$WithArrays]@2352fd52[
  boolArr...> but was:<[]@2352fd52[
  boolArr...>
  MultilineRecursiveToStringStyleTest.doubleArray:167 expected:<[org.apache.commons.lang3.builder.MultilineRecursiveToStringStyleTest$WithArrays]@44d74990[
  boolArr...> but was:<[]@44d74990[
  boolArr...>
  MultilineRecursiveToStringStyleTest.intArray:149 expected:<[org.apache.commons.lang3.builder.MultilineRecursiveToStringStyleTest$WithArrays]@547d573[
  boolArra...> but was:<[]@547d573[
  boolArra...>
  MultilineRecursiveToStringStyleTest.longArray:185 expected:<[org.apache.commons.lang3.builder.MultilineRecursiveToStringStyleTest$WithArrays]@3096f94[
  boolArra...> but was:<[]@3096f94[
  boolArra...>
  MultilineRecursiveToStringStyleTest.nestedAndArray:80 expected:<[org.apache.commons.lang3.builder.MultilineRecursiveToStringStyleTest$Account@71e2cfdc[
  owner=<null>,
  transactions=java.util.ArrayList@61bcaeed{
    org.apache.commons.lang3.builder.MultilineRecursiveToStringStyleTest$Transaction@2a807bbc[
      amount=100.0,
      date=2014.10.14
    ],
    org.apache.commons.lang3.builder.MultilineRecursiveToStringStyleTest$Transaction]@593b8970[
      amo...> but was:<[@71e2cfdc[
  owner=<null>,
  transactions=@61bcaeed{
    @2a807bbc[
      amount=100.0,
      date=2014.10.14
    ],
    ]@593b8970[
      amo...>
  MultilineRecursiveToStringStyleTest.nestedElements:57 expected:<[org.apache.commons.lang3.builder.MultilineRecursiveToStringStyleTest$Customer@75b68cdf[
  name=Douglas Adams,
  bank=org.apache.commons.lang3.builder.MultilineRecursiveToStringStyleTest$Bank]@23dac0d9[
    name=...> but was:<[@75b68cdf[
  name=Douglas Adams,
  bank=]@23dac0d9[
    name=...>
  MultilineRecursiveToStringStyleTest.noArray:94 expected:<[org.apache.commons.lang3.builder.MultilineRecursiveToStringStyleTest$WithArrays]@359430ca[
  boolArr...> but was:<[]@359430ca[
  boolArr...>
  MultilineRecursiveToStringStyleTest.simpleObject:42 expected:<[org.apache.commons.lang3.builder.MultilineRecursiveToStringStyleTest$Transaction]@445ebf88[
  amount=...> but was:<[]@445ebf88[
  amount=...>
  MultilineRecursiveToStringStyleTest.stringArray:203 expected:<[org.apache.commons.lang3.builder.MultilineRecursiveToStringStyleTest$WithArrays]@496d6956[
  boolArr...> but was:<[]@496d6956[
  boolArr...>
  NoFieldNamesToStringStyleTest.testAppendSuper:58 expected:<[java.lang.Integer]@dda4f7b[]> but was:<[]@dda4f7b[]>
  NoFieldNamesToStringStyleTest.testBlank:53 expected:<[java.lang.Integer]@dda4f7b[]> but was:<[]@dda4f7b[]>
  NoFieldNamesToStringStyleTest.testLong:96 expected:<[java.lang.Integer]@dda4f7b[3]> but was:<[]@dda4f7b[3]>
  NoFieldNamesToStringStyleTest.testLongArray:114 expected:<[java.lang.Integer]@dda4f7b[{1,2,-3,4}]> but was:<[]@dda4f7b[{1,2,-3,4}]>
  NoFieldNamesToStringStyleTest.testLongArrayArray:124 expected:<[java.lang.Integer]@dda4f7b[{{1,2},<nul...> but was:<[]@dda4f7b[{{1,2},<nul...>
  NoFieldNamesToStringStyleTest.testObject:70 expected:<[java.lang.Integer]@dda4f7b[<null>]> but was:<[]@dda4f7b[<null>]>
  NoFieldNamesToStringStyleTest.testObjectArray:104 expected:<[java.lang.Integer]@dda4f7b[{<null>,5,{...> but was:<[]@dda4f7b[{<null>,5,{...>
  NoFieldNamesToStringStyleTest.testPerson:91 expected:<[org.apache.commons.lang3.builder.ToStringStyleTest$Person]@7707d6ae[Ron Paul,7...> but was:<[]@7707d6ae[Ron Paul,7...>
  RecursiveToStringStyleTest.testAppendSuper:57 expected:<[java.lang.Integer]@dda4f7b[]> but was:<[]@dda4f7b[]>
  RecursiveToStringStyleTest.testBlank:52 expected:<[java.lang.Integer]@dda4f7b[]> but was:<[]@dda4f7b[]>
  RecursiveToStringStyleTest.testLong:99 expected:<[java.lang.Integer]@dda4f7b[3]> but was:<[]@dda4f7b[3]>
  RecursiveToStringStyleTest.testLongArray:117 expected:<[java.lang.Integer]@dda4f7b[{1,2,-3,4}]> but was:<[]@dda4f7b[{1,2,-3,4}]>
  RecursiveToStringStyleTest.testLongArrayArray:127 expected:<[java.lang.Integer]@dda4f7b[{{1,2},<nul...> but was:<[]@dda4f7b[{{1,2},<nul...>
  RecursiveToStringStyleTest.testObject:69 expected:<[java.lang.Integer]@dda4f7b[<null>]> but was:<[]@dda4f7b[<null>]>
  RecursiveToStringStyleTest.testObjectArray:107 expected:<[java.lang.Integer]@dda4f7b[{<null>,5,{...> but was:<[]@dda4f7b[{<null>,5,{...>
  RecursiveToStringStyleTest.testPerson:93 expected:<[org.apache.commons.lang3.builder.RecursiveToStringStyleTest$Person@17fe67e4[name=John Doe,age=33,smoker=false,job=org.apache.commons.lang3.builder.RecursiveToStringStyleTest$Job]@3f56b60a[title=Mana...> but was:<[@17fe67e4[name=John Doe,age=33,smoker=false,job=]@3f56b60a[title=Mana...>
  ShortPrefixToStringStyleTest.testAppendSuper:58 expected:<[Integer][]> but was:<[][]>
  ShortPrefixToStringStyleTest.testBlank:53 expected:<[Integer][]> but was:<[][]>
  ShortPrefixToStringStyleTest.testLong:96 expected:<[Integer][3]> but was:<[][3]>
  ShortPrefixToStringStyleTest.testLongArray:114 expected:<[Integer][{1,2,-3,4}]> but was:<[][{1,2,-3,4}]>
  ShortPrefixToStringStyleTest.testLongArrayArray:124 expected:<[Integer][{{1,2},<null>,{5}}]> but was:<[][{{1,2},<null>,{5}}]>
  ShortPrefixToStringStyleTest.testObject:70 expected:<[Integer][<null>]> but was:<[][<null>]>
  ShortPrefixToStringStyleTest.testObjectArray:104 expected:<[Integer][{<null>,5,{3,6}}]> but was:<[][{<null>,5,{3,6}}]>
  ShortPrefixToStringStyleTest.testPerson:91 expected:<[ToStringStyleTest.Person][name=John Q. Public...> but was:<[][name=John Q. Public...>
  StandardToStringStyleTest.testAppendSuper:73 expected:<[Integer][]> but was:<[][]>
  StandardToStringStyleTest.testBlank:68 expected:<[Integer][]> but was:<[][]>
  StandardToStringStyleTest.testLong:111 expected:<[Integer][3]> but was:<[][3]>
  StandardToStringStyleTest.testLongArray:129 expected:<[Integer][[1, 2, -3, 4]]> but was:<[][[1, 2, -3, 4]]>
  StandardToStringStyleTest.testLongArrayArray:139 expected:<[Integer][[[1, 2], %NULL%, [5...> but was:<[][[[1, 2], %NULL%, [5...>
  StandardToStringStyleTest.testObject:85 expected:<[Integer][%NULL%]> but was:<[][%NULL%]>
  StandardToStringStyleTest.testObjectArray:119 expected:<[Integer][[%NULL%, 5, [3, 6]]...> but was:<[][[%NULL%, 5, [3, 6]]...>
  StandardToStringStyleTest.testPerson:106 expected:<[ToStringStyleTest.Person][name=Suzy Queue,age...> but was:<[][name=Suzy Queue,age...>
  ToStringBuilderTest.testAppendSuper:601 expected:<[java.lang.Integer]@dda4f7b[]> but was:<[]@dda4f7b[]>
  ToStringBuilderTest.testAppendToString:611 expected:<[java.lang.Integer]@dda4f7b[]> but was:<[]@dda4f7b[]>
  ToStringBuilderTest.testBlank:89 expected:<[java.lang.Integer]@dda4f7b[]> but was:<[]@dda4f7b[]>
  ToStringBuilderTest.testBoolean:708 expected:<[java.lang.Integer]@dda4f7b[true]> but was:<[]@dda4f7b[true]>
  ToStringBuilderTest.testBooleanArray:797 expected:<[java.lang.Integer]@dda4f7b[{true,false...> but was:<[]@dda4f7b[{true,false...>
  ToStringBuilderTest.testBooleanArrayArray:877 expected:<[java.lang.Integer]@dda4f7b[{{true,fals...> but was:<[]@dda4f7b[{{true,fals...>
  ToStringBuilderTest.testByte:686 expected:<[java.lang.Integer]@dda4f7b[3]> but was:<[]@dda4f7b[3]>
  ToStringBuilderTest.testByteArray:757 expected:<[java.lang.Integer]@dda4f7b[{1,2,-3,4}]> but was:<[]@dda4f7b[{1,2,-3,4}]>
  ToStringBuilderTest.testByteArrayArray:837 expected:<[java.lang.Integer]@dda4f7b[{{1,2},<nul...> but was:<[]@dda4f7b[{{1,2},<nul...>
  ToStringBuilderTest.testChar:679 expected:<[java.lang.Integer]@dda4f7b[A]> but was:<[]@dda4f7b[A]>
  ToStringBuilderTest.testCharArray:767 expected:<[java.lang.Integer]@dda4f7b[{A,2,_,D}]> but was:<[]@dda4f7b[{A,2,_,D}]>
  ToStringBuilderTest.testCharArrayArray:847 expected:<[java.lang.Integer]@dda4f7b[{{A,B},<nul...> but was:<[]@dda4f7b[{{A,B},<nul...>
  ToStringBuilderTest.testDouble:694 expected:<[java.lang.Integer]@dda4f7b[3.2]> but was:<[]@dda4f7b[3.2]>
  ToStringBuilderTest.testDoubleArray:777 expected:<[java.lang.Integer]@dda4f7b[{1.0,2.9876...> but was:<[]@dda4f7b[{1.0,2.9876...>
  ToStringBuilderTest.testDoubleArrayArray:857 expected:<[java.lang.Integer]@dda4f7b[{{1.0,2.296...> but was:<[]@dda4f7b[{{1.0,2.296...>
  ToStringBuilderTest.testFloat:701 expected:<[java.lang.Integer]@dda4f7b[3.2]> but was:<[]@dda4f7b[3.2]>
  ToStringBuilderTest.testFloatArray:787 expected:<[java.lang.Integer]@dda4f7b[{1.0,2.9876...> but was:<[]@dda4f7b[{1.0,2.9876...>
  ToStringBuilderTest.testFloatArrayArray:867 expected:<[java.lang.Integer]@dda4f7b[{{1.0,2.296...> but was:<[]@dda4f7b[{{1.0,2.296...>
  ToStringBuilderTest.testInheritedReflectionStatics:947 expected:<[org.apache.commons.lang3.builder.ToStringBuilderTest$InheritedReflectionStaticFieldsFixture]@60f3d040[staticStri...> but was:<[]@60f3d040[staticStri...>
  ToStringBuilderTest.testInnerClassReflection:376 expected:<[org.apache.commons.lang3.builder.ToStringBuilderTest$Outer@20c12654[inner=org.apache.commons.lang3.builder.ToStringBuilderTest$Outer$Inner]@68bb6598[]]> but was:<[@20c12654[inner=]@68bb6598[]]>
  ToStringBuilderTest.testInt:665 expected:<[java.lang.Integer]@dda4f7b[3]> but was:<[]@dda4f7b[3]>
  ToStringBuilderTest.testIntArray:737 expected:<[java.lang.Integer]@dda4f7b[{1,2,-3,4}]> but was:<[]@dda4f7b[{1,2,-3,4}]>
  ToStringBuilderTest.testIntArrayArray:817 expected:<[java.lang.Integer]@dda4f7b[{{1,2},<nul...> but was:<[]@dda4f7b[{{1,2},<nul...>
  ToStringBuilderTest.testLong:657 expected:<[java.lang.Integer]@dda4f7b[3]> but was:<[]@dda4f7b[3]>
  ToStringBuilderTest.testLongArray:727 expected:<[java.lang.Integer]@dda4f7b[{1,2,-3,4}]> but was:<[]@dda4f7b[{1,2,-3,4}]>
  ToStringBuilderTest.testLongArrayArray:807 expected:<[java.lang.Integer]@dda4f7b[{{1,2},<nul...> but was:<[]@dda4f7b[{{1,2},<nul...>
  ToStringBuilderTest.testObject:623 expected:<[java.lang.Integer]@dda4f7b[<null>]> but was:<[]@dda4f7b[<null>]>
  ToStringBuilderTest.testObjectArray:717 expected:<[java.lang.Integer]@dda4f7b[{<null>,5,{...> but was:<[]@dda4f7b[{<null>,5,{...>
  ToStringBuilderTest.testObjectBuild:641 expected:<[java.lang.Integer]@dda4f7b[<null>]> but was:<[]@dda4f7b[<null>]>
  ToStringBuilderTest.testObjectCycle:892 expected:<[org.apache.commons.lang3.builder.ToStringBuilderTest$ObjectCycle@72f264c6[org.apache.commons.lang3.builder.ToStringBuilderTest$ObjectCycle]@7b63e1f[org.apache....> but was:<[@72f264c6[]@7b63e1f[org.apache....>
  ToStringBuilderTest.testReflectionArrayAndObjectCycle:576 expected:<[[Ljava.lang.Object;@210ad97b[{org.apache.commons.lang3.builder.ToStringBuilderTest$SimpleReflectionTestFixture]@4f4c2b2f[o=[Ljava.l...> but was:<[@210ad97b[{]@4f4c2b2f[o=[Ljava.l...>
  ToStringBuilderTest.testReflectionArrayArrayCycle:432 expected:<[[[Ljava.lang.Object;]@5d5ef3e7[{{[[Ljava....> but was:<[]@5d5ef3e7[{{[[Ljava....>
  ToStringBuilderTest.testReflectionArrayCycle:402 expected:<[[Ljava.lang.Object;]@6d392fa5[{[Ljava.la...> but was:<[]@6d392fa5[{[Ljava.la...>
  ToStringBuilderTest.testReflectionArrayCycleLevel2:416 expected:<[[Ljava.lang.Object;]@1594af77[{{[Ljava.l...> but was:<[]@1594af77[{{[Ljava.l...>
  ToStringBuilderTest.testReflectionBoolean:116 expected:<[java.lang.Boolean]@f684bc0[value=true]> but was:<[]@f684bc0[value=true]>
  ToStringBuilderTest.testReflectionBooleanArray:232 expected:<[[Z]@3c536f11[{true,fals...> but was:<[]@3c536f11[{true,fals...>
  ToStringBuilderTest.testReflectionBooleanArrayArray:307 expected:<[[[Z]@3b27402d[{{true,fal...> but was:<[]@3b27402d[{{true,fal...>
  ToStringBuilderTest.testReflectionByteArrayArray:280 expected:<[[[B]@24f64a8d[{{1,2},<nu...> but was:<[]@24f64a8d[{{1,2},<nu...>
  ToStringBuilderTest.testReflectionCharArray:205 expected:<[[C]@605d9809[{A,2,_,D}]> but was:<[]@605d9809[{A,2,_,D}]>
  ToStringBuilderTest.testReflectionCharArrayArray:289 expected:<[[[C]@11a74355[{{A,B},<nu...> but was:<[]@11a74355[{{A,B},<nu...>
  ToStringBuilderTest.testReflectionCharacter:106 expected:<[java.lang.Character]@1de61363[value=A]> but was:<[]@1de61363[value=A]>
  ToStringBuilderTest.testReflectionDoubleArray:214 expected:<[[D]@4b9526d4[{1.0,2.987...> but was:<[]@4b9526d4[{1.0,2.987...>
  ToStringBuilderTest.testReflectionDoubleArrayArray:298 expected:<[[[D]@5dbd07dd[{{1.0,2.29...> but was:<[]@5dbd07dd[{{1.0,2.29...>
  ToStringBuilderTest.testReflectionFloatArray:223 expected:<[[F]@320a2593[{1.0,2.987...> but was:<[]@320a2593[{1.0,2.987...>
  ToStringBuilderTest.testReflectionFloatArrayArray:243 expected:<[[[F]@6c02d7ea[{{1.0,2.29...> but was:<[]@6c02d7ea[{{1.0,2.29...>
  ToStringBuilderTest.testReflectionHierarchy:338 expected:<[org.apache.commons.lang3.builder.ToStringBuilderTest$ReflectionTestFixtureA]@6b91312f[a=a]> but was:<[]@6b91312f[a=a]>
  ToStringBuilderTest.testReflectionIntArray:178 expected:<[[I]@2250b410[{1,2,-3,4}...> but was:<[]@2250b410[{1,2,-3,4}...>
  ToStringBuilderTest.testReflectionIntArrayArray:262 expected:<[[[I]@2d284f10[{{1,2},<nu...> but was:<[]@2d284f10[{{1,2},<nu...>
  ToStringBuilderTest.testReflectionInteger:97 expected:<[java.lang.Integer]@dda4f7b[value=5]> but was:<[]@dda4f7b[value=5]>
  ToStringBuilderTest.testReflectionLongArray:169 expected:<[[J]@1d085c24[{1,2,-3,4}...> but was:<[]@1d085c24[{1,2,-3,4}...>
  ToStringBuilderTest.testReflectionLongArrayArray:253 expected:<[[[J]@456731a8[{{1,2},<nu...> but was:<[]@456731a8[{{1,2},<nu...>
  ToStringBuilderTest.testReflectionObjectArray:160 expected:<[[Ljava.lang.Object;]@275a83d[{<null>,5,{...> but was:<[]@275a83d[{<null>,5,{...>
  ToStringBuilderTest.testReflectionObjectCycle:562 expected:<[org.apache.commons.lang3.builder.ToStringBuilderTest$ReflectionTestCycleA@6c32064b[b=org.apache.commons.lang3.builder.ToStringBuilderTest$ReflectionTestCycleB]@483b5d6b[a=org.apac...> but was:<[@6c32064b[b=]@483b5d6b[a=org.apac...>
  ToStringBuilderTest.testReflectionShortArray:187 expected:<[[S]@8beab46[{1,2,-3,4}]> but was:<[]@8beab46[{1,2,-3,4}]>
  ToStringBuilderTest.testReflectionStatics:927 expected:<[org.apache.commons.lang3.builder.ToStringBuilderTest$ReflectionStaticFieldsFixture]@3d8290a3[staticStri...> but was:<[]@3d8290a3[staticStri...>
  ToStringBuilderTest.testReflectionhortArrayArray:271 expected:<[[[S]@fd94e60[{{1,2},<nul...> but was:<[]@fd94e60[{{1,2},<nul...>
  ToStringBuilderTest.testReflectionyteArray:196 expected:<[[B]@2414b575[{1,2,-3,4}...> but was:<[]@2414b575[{1,2,-3,4}...>
  ToStringBuilderTest.testSelfInstanceTwoVarsReflectionObjectCycle:549 expected:<[org.apache.commons.lang3.builder.ToStringBuilderTest$SelfInstanceTwoVarsReflectionTestFixture]@ff7f824[typeIsSelf=...> but was:<[]@ff7f824[typeIsSelf=...>
  ToStringBuilderTest.testSelfInstanceVarReflectionObjectCycle:539 expected:<[org.apache.commons.lang3.builder.ToStringBuilderTest$SelfInstanceVarReflectionTestFixture]@3a57c332[typeIsSelf...> but was:<[]@3a57c332[typeIsSelf...>
  ToStringBuilderTest.testShort:672 expected:<[java.lang.Integer]@dda4f7b[3]> but was:<[]@dda4f7b[3]>
  ToStringBuilderTest.testShortArray:747 expected:<[java.lang.Integer]@dda4f7b[{1,2,-3,4}]> but was:<[]@dda4f7b[{1,2,-3,4}]>
  ToStringBuilderTest.testShortArrayArray:827 expected:<[java.lang.Integer]@dda4f7b[{{1,2},<nul...> but was:<[]@dda4f7b[{{1,2},<nul...>
  ToStringBuilderTest.testSimpleReflectionObjectCycle:530 expected:<[org.apache.commons.lang3.builder.ToStringBuilderTest$SimpleReflectionTestFixture]@7040f445[o=org.apac...> but was:<[]@7040f445[o=org.apac...>
  ToStringBuilderTest.testSimpleReflectionStatics:907 expected:<[org.apache.commons.lang3.builder.ToStringBuilderTest$SimpleReflectionStaticFieldsFixture]@391b8a4c[staticStri...> but was:<[]@391b8a4c[staticStri...>



Tests run: 3526, Failures: 124, Errors: 0, Skipped: 97

[INFO] ------------------------------------------------------------------------
[INFO] BUILD FAILURE
[INFO] ------------------------------------------------------------------------
[INFO] Total time: 34.365s
[INFO] Finished at: Tue Aug 04 08:45:31 BST 2015
[INFO] Final Memory: 23M/414M
[INFO] ------------------------------------------------------------------------
[ERROR] Failed to execute goal org.apache.maven.plugins:maven-surefire-plugin:2.18:test (default-test) on project commons-lang3: There are test failures.
[ERROR] 
[ERROR] Please refer to /home/perham/Study/LittleDarwin/Cases/commons-lang3-3.4-src/target/surefire-reports for the individual test results.
[ERROR] -> [Help 1]
[ERROR] 
[ERROR] To see the full stack trace of the errors, re-run Maven with the -e switch.
[ERROR] Re-run Maven using the -X switch to enable full debug logging.
[ERROR] 
[ERROR] For more information about the errors and possible solutions, please read the following articles:
[ERROR] [Help 1] http://cwiki.apache.org/confluence/display/MAVEN/MojoFailureException
