[INFO] Scanning for projects...
[INFO]                                                                         
[INFO] ------------------------------------------------------------------------
[INFO] Building Apache Commons Lang 3.4
[INFO] ------------------------------------------------------------------------
[INFO] 
[INFO] --- maven-enforcer-plugin:1.3.1:enforce (enforce-maven-3) @ commons-lang3 ---
[INFO] 
[INFO] --- build-helper-maven-plugin:1.8:parse-version (parse-version) @ commons-lang3 ---
[INFO] 
[INFO] --- maven-antrun-plugin:1.8:run (javadoc.resources) @ commons-lang3 ---
[INFO] Executing tasks

main:
[INFO] Executed tasks
[INFO] 
[INFO] --- maven-remote-resources-plugin:1.5:process (default) @ commons-lang3 ---
[INFO] 
[INFO] --- buildnumber-maven-plugin:1.3:create (default) @ commons-lang3 ---
[INFO] Executing: /bin/sh -c cd /home/perham/Study/LittleDarwin/Cases/commons-lang3-3.4-src && svn --non-interactive info
[INFO] Working directory: /home/perham/Study/LittleDarwin/Cases/commons-lang3-3.4-src
[INFO] Storing buildNumber: ?????? at timestamp: 1438674263391
[INFO] Executing: /bin/sh -c cd /home/perham/Study/LittleDarwin/Cases/commons-lang3-3.4-src && svn --non-interactive info
[INFO] Working directory: /home/perham/Study/LittleDarwin/Cases/commons-lang3-3.4-src
[INFO] Storing buildScmBranch: UNKNOWN_BRANCH
[INFO] 
[INFO] --- maven-resources-plugin:2.7:resources (default-resources) @ commons-lang3 ---
[INFO] Using 'ISO-8859-1' encoding to copy filtered resources.
[INFO] Copying 0 resource
[INFO] Copying 2 resources to META-INF
[INFO] 
[INFO] --- maven-compiler-plugin:3.2:compile (default-compile) @ commons-lang3 ---
[INFO] Changes detected - recompiling the module!
[INFO] Compiling 133 source files to /home/perham/Study/LittleDarwin/Cases/commons-lang3-3.4-src/target/classes
[INFO] /home/perham/Study/LittleDarwin/Cases/commons-lang3-3.4-src/src/main/java/org/apache/commons/lang3/SerializationUtils.java: /home/perham/Study/LittleDarwin/Cases/commons-lang3-3.4-src/src/main/java/org/apache/commons/lang3/SerializationUtils.java uses unchecked or unsafe operations.
[INFO] /home/perham/Study/LittleDarwin/Cases/commons-lang3-3.4-src/src/main/java/org/apache/commons/lang3/SerializationUtils.java: Recompile with -Xlint:unchecked for details.
[INFO] 
[INFO] --- maven-bundle-plugin:2.5.3:manifest (bundle-manifest) @ commons-lang3 ---
[INFO] 
[INFO] --- animal-sniffer-maven-plugin:1.13:check (checkAPIcompatibility) @ commons-lang3 ---
[INFO] Checking unresolved references to org.codehaus.mojo.signature:java16:1.0
[INFO] 
[INFO] --- maven-resources-plugin:2.7:testResources (default-testResources) @ commons-lang3 ---
[INFO] Using 'ISO-8859-1' encoding to copy filtered resources.
[INFO] Copying 2 resources
[INFO] Copying 2 resources to META-INF
[INFO] 
[INFO] --- maven-compiler-plugin:3.2:testCompile (default-testCompile) @ commons-lang3 ---
[INFO] Nothing to compile - all classes are up to date
[INFO] 
[INFO] --- maven-surefire-plugin:2.18:test (default-test) @ commons-lang3 ---
[INFO] Surefire report directory: /home/perham/Study/LittleDarwin/Cases/commons-lang3-3.4-src/target/surefire-reports

-------------------------------------------------------
 T E S T S
-------------------------------------------------------
Running org.apache.commons.lang3.ValidateTest
Tests run: 63, Failures: 0, Errors: 0, Skipped: 0, Time elapsed: 0.039 sec - in org.apache.commons.lang3.ValidateTest
Running org.apache.commons.lang3.LocaleUtilsTest
Tests run: 15, Failures: 0, Errors: 0, Skipped: 0, Time elapsed: 0.021 sec - in org.apache.commons.lang3.LocaleUtilsTest
Running org.apache.commons.lang3.tuple.MutableTripleTest
Tests run: 8, Failures: 0, Errors: 0, Skipped: 0, Time elapsed: 0.009 sec - in org.apache.commons.lang3.tuple.MutableTripleTest
Running org.apache.commons.lang3.tuple.TripleTest
Tests run: 10, Failures: 0, Errors: 0, Skipped: 0, Time elapsed: 0.005 sec - in org.apache.commons.lang3.tuple.TripleTest
Running org.apache.commons.lang3.tuple.ImmutablePairTest
Tests run: 6, Failures: 0, Errors: 0, Skipped: 0, Time elapsed: 0 sec - in org.apache.commons.lang3.tuple.ImmutablePairTest
Running org.apache.commons.lang3.tuple.MutablePairTest
Tests run: 8, Failures: 0, Errors: 0, Skipped: 0, Time elapsed: 0.001 sec - in org.apache.commons.lang3.tuple.MutablePairTest
Running org.apache.commons.lang3.tuple.ImmutableTripleTest
Tests run: 6, Failures: 0, Errors: 0, Skipped: 0, Time elapsed: 0 sec - in org.apache.commons.lang3.tuple.ImmutableTripleTest
Running org.apache.commons.lang3.tuple.PairTest
Tests run: 9, Failures: 0, Errors: 0, Skipped: 0, Time elapsed: 0.001 sec - in org.apache.commons.lang3.tuple.PairTest
Running org.apache.commons.lang3.StringUtilsIsTest
Tests run: 8, Failures: 0, Errors: 0, Skipped: 0, Time elapsed: 0.009 sec - in org.apache.commons.lang3.StringUtilsIsTest
Running org.apache.commons.lang3.JavaVersionTest
Tests run: 3, Failures: 0, Errors: 0, Skipped: 0, Time elapsed: 0 sec - in org.apache.commons.lang3.JavaVersionTest
Running org.apache.commons.lang3.builder.NoFieldNamesToStringStyleTest
Tests run: 8, Failures: 8, Errors: 0, Skipped: 0, Time elapsed: 0.006 sec <<< FAILURE! - in org.apache.commons.lang3.builder.NoFieldNamesToStringStyleTest
testObjectArray(org.apache.commons.lang3.builder.NoFieldNamesToStringStyleTest)  Time elapsed: 0.002 sec  <<< FAILURE!
org.junit.ComparisonFailure: expected:<java.lang.Integer[@dda4f7b][{<null>,5,{3,6}}]> but was:<java.lang.Integer[][{<null>,5,{3,6}}]>
	at org.junit.Assert.assertEquals(Assert.java:115)
	at org.junit.Assert.assertEquals(Assert.java:144)
	at org.apache.commons.lang3.builder.NoFieldNamesToStringStyleTest.testObjectArray(NoFieldNamesToStringStyleTest.java:104)

testBlank(org.apache.commons.lang3.builder.NoFieldNamesToStringStyleTest)  Time elapsed: 0 sec  <<< FAILURE!
org.junit.ComparisonFailure: expected:<java.lang.Integer[@dda4f7b][]> but was:<java.lang.Integer[][]>
	at org.junit.Assert.assertEquals(Assert.java:115)
	at org.junit.Assert.assertEquals(Assert.java:144)
	at org.apache.commons.lang3.builder.NoFieldNamesToStringStyleTest.testBlank(NoFieldNamesToStringStyleTest.java:53)

testLong(org.apache.commons.lang3.builder.NoFieldNamesToStringStyleTest)  Time elapsed: 0 sec  <<< FAILURE!
org.junit.ComparisonFailure: expected:<java.lang.Integer[@dda4f7b][3]> but was:<java.lang.Integer[][3]>
	at org.junit.Assert.assertEquals(Assert.java:115)
	at org.junit.Assert.assertEquals(Assert.java:144)
	at org.apache.commons.lang3.builder.NoFieldNamesToStringStyleTest.testLong(NoFieldNamesToStringStyleTest.java:96)

testLongArrayArray(org.apache.commons.lang3.builder.NoFieldNamesToStringStyleTest)  Time elapsed: 0.001 sec  <<< FAILURE!
org.junit.ComparisonFailure: expected:<java.lang.Integer[@dda4f7b][{{1,2},<null>,{5}}]> but was:<java.lang.Integer[][{{1,2},<null>,{5}}]>
	at org.junit.Assert.assertEquals(Assert.java:115)
	at org.junit.Assert.assertEquals(Assert.java:144)
	at org.apache.commons.lang3.builder.NoFieldNamesToStringStyleTest.testLongArrayArray(NoFieldNamesToStringStyleTest.java:124)

testLongArray(org.apache.commons.lang3.builder.NoFieldNamesToStringStyleTest)  Time elapsed: 0 sec  <<< FAILURE!
org.junit.ComparisonFailure: expected:<java.lang.Integer[@dda4f7b][{1,2,-3,4}]> but was:<java.lang.Integer[][{1,2,-3,4}]>
	at org.junit.Assert.assertEquals(Assert.java:115)
	at org.junit.Assert.assertEquals(Assert.java:144)
	at org.apache.commons.lang3.builder.NoFieldNamesToStringStyleTest.testLongArray(NoFieldNamesToStringStyleTest.java:114)

testObject(org.apache.commons.lang3.builder.NoFieldNamesToStringStyleTest)  Time elapsed: 0 sec  <<< FAILURE!
org.junit.ComparisonFailure: expected:<java.lang.Integer[@dda4f7b][<null>]> but was:<java.lang.Integer[][<null>]>
	at org.junit.Assert.assertEquals(Assert.java:115)
	at org.junit.Assert.assertEquals(Assert.java:144)
	at org.apache.commons.lang3.builder.NoFieldNamesToStringStyleTest.testObject(NoFieldNamesToStringStyleTest.java:70)

testPerson(org.apache.commons.lang3.builder.NoFieldNamesToStringStyleTest)  Time elapsed: 0.001 sec  <<< FAILURE!
org.junit.ComparisonFailure: expected:<...ringStyleTest$Person[@7707d6ae][Ron Paul,72,false]> but was:<...ringStyleTest$Person[][Ron Paul,72,false]>
	at org.junit.Assert.assertEquals(Assert.java:115)
	at org.junit.Assert.assertEquals(Assert.java:144)
	at org.apache.commons.lang3.builder.NoFieldNamesToStringStyleTest.testPerson(NoFieldNamesToStringStyleTest.java:91)

testAppendSuper(org.apache.commons.lang3.builder.NoFieldNamesToStringStyleTest)  Time elapsed: 0 sec  <<< FAILURE!
org.junit.ComparisonFailure: expected:<java.lang.Integer[@dda4f7b][]> but was:<java.lang.Integer[][]>
	at org.junit.Assert.assertEquals(Assert.java:115)
	at org.junit.Assert.assertEquals(Assert.java:144)
	at org.apache.commons.lang3.builder.NoFieldNamesToStringStyleTest.testAppendSuper(NoFieldNamesToStringStyleTest.java:58)

Running org.apache.commons.lang3.builder.ShortPrefixToStringStyleTest
Tests run: 8, Failures: 0, Errors: 0, Skipped: 0, Time elapsed: 0.004 sec - in org.apache.commons.lang3.builder.ShortPrefixToStringStyleTest
Running org.apache.commons.lang3.builder.DiffResultTest
Tests run: 9, Failures: 0, Errors: 0, Skipped: 0, Time elapsed: 0.008 sec - in org.apache.commons.lang3.builder.DiffResultTest
Running org.apache.commons.lang3.builder.CompareToBuilderTest
Tests run: 48, Failures: 0, Errors: 0, Skipped: 0, Time elapsed: 0.021 sec - in org.apache.commons.lang3.builder.CompareToBuilderTest
Running org.apache.commons.lang3.builder.MultilineRecursiveToStringStyleTest
Tests run: 10, Failures: 10, Errors: 0, Skipped: 0, Time elapsed: 0.009 sec <<< FAILURE! - in org.apache.commons.lang3.builder.MultilineRecursiveToStringStyleTest
doubleArray(org.apache.commons.lang3.builder.MultilineRecursiveToStringStyleTest)  Time elapsed: 0 sec  <<< FAILURE!
org.junit.ComparisonFailure: expected:<...StyleTest$WithArrays[@3bbce0d6][
  boolArray=<null>...> but was:<...StyleTest$WithArrays[][
  boolArray=<null>...>
	at org.junit.Assert.assertEquals(Assert.java:115)
	at org.junit.Assert.assertEquals(Assert.java:144)
	at org.apache.commons.lang3.builder.MultilineRecursiveToStringStyleTest.doubleArray(MultilineRecursiveToStringStyleTest.java:167)

stringArray(org.apache.commons.lang3.builder.MultilineRecursiveToStringStyleTest)  Time elapsed: 0 sec  <<< FAILURE!
org.junit.ComparisonFailure: expected:<...StyleTest$WithArrays[@3096f94][
  boolArray=<null>...> but was:<...StyleTest$WithArrays[][
  boolArray=<null>...>
	at org.junit.Assert.assertEquals(Assert.java:115)
	at org.junit.Assert.assertEquals(Assert.java:144)
	at org.apache.commons.lang3.builder.MultilineRecursiveToStringStyleTest.stringArray(MultilineRecursiveToStringStyleTest.java:203)

simpleObject(org.apache.commons.lang3.builder.MultilineRecursiveToStringStyleTest)  Time elapsed: 0.001 sec  <<< FAILURE!
org.junit.ComparisonFailure: expected:<...tyleTest$Transaction[@5dcfd078][
  amount=100.0,
  ...> but was:<...tyleTest$Transaction[][
  amount=100.0,
  ...>
	at org.junit.Assert.assertEquals(Assert.java:115)
	at org.junit.Assert.assertEquals(Assert.java:144)
	at org.apache.commons.lang3.builder.MultilineRecursiveToStringStyleTest.simpleObject(MultilineRecursiveToStringStyleTest.java:42)

longArray(org.apache.commons.lang3.builder.MultilineRecursiveToStringStyleTest)  Time elapsed: 0.001 sec  <<< FAILURE!
org.junit.ComparisonFailure: expected:<...StyleTest$WithArrays[@61bcaeed][
  boolArray=<null>...> but was:<...StyleTest$WithArrays[][
  boolArray=<null>...>
	at org.junit.Assert.assertEquals(Assert.java:115)
	at org.junit.Assert.assertEquals(Assert.java:144)
	at org.apache.commons.lang3.builder.MultilineRecursiveToStringStyleTest.longArray(MultilineRecursiveToStringStyleTest.java:185)

intArray(org.apache.commons.lang3.builder.MultilineRecursiveToStringStyleTest)  Time elapsed: 0.001 sec  <<< FAILURE!
org.junit.ComparisonFailure: expected:<...StyleTest$WithArrays[@593b8970][
  boolArray=<null>...> but was:<...StyleTest$WithArrays[][
  boolArray=<null>...>
	at org.junit.Assert.assertEquals(Assert.java:115)
	at org.junit.Assert.assertEquals(Assert.java:144)
	at org.apache.commons.lang3.builder.MultilineRecursiveToStringStyleTest.intArray(MultilineRecursiveToStringStyleTest.java:149)

nestedAndArray(org.apache.commons.lang3.builder.MultilineRecursiveToStringStyleTest)  Time elapsed: 0.002 sec  <<< FAILURE!
org.junit.ComparisonFailure: expected:<...ingStyleTest$Account[@1d75249c[
  owner=<null>,
  transactions=java.util.ArrayList@75b68cdf{
    org.apache.commons.lang3.builder.MultilineRecursiveToStringStyleTest$Transaction@23dac0d9[
      amount=100.0,
      date=2014.10.14
    ],
    org.apache.commons.lang3.builder.MultilineRecursiveToStringStyleTest$Transaction@6eaaf8f2][
      amount=50.0,...> but was:<...ingStyleTest$Account[[
  owner=<null>,
  transactions=java.util.ArrayList{
    org.apache.commons.lang3.builder.MultilineRecursiveToStringStyleTest$Transaction[
      amount=100.0,
      date=2014.10.14
    ],
    org.apache.commons.lang3.builder.MultilineRecursiveToStringStyleTest$Transaction][
      amount=50.0,...>
	at org.junit.Assert.assertEquals(Assert.java:115)
	at org.junit.Assert.assertEquals(Assert.java:144)
	at org.apache.commons.lang3.builder.MultilineRecursiveToStringStyleTest.nestedAndArray(MultilineRecursiveToStringStyleTest.java:80)

charArray(org.apache.commons.lang3.builder.MultilineRecursiveToStringStyleTest)  Time elapsed: 0 sec  <<< FAILURE!
org.junit.ComparisonFailure: expected:<...StyleTest$WithArrays[@359430ca][
  boolArray=<null>...> but was:<...StyleTest$WithArrays[][
  boolArray=<null>...>
	at org.junit.Assert.assertEquals(Assert.java:115)
	at org.junit.Assert.assertEquals(Assert.java:144)
	at org.apache.commons.lang3.builder.MultilineRecursiveToStringStyleTest.charArray(MultilineRecursiveToStringStyleTest.java:131)

nestedElements(org.apache.commons.lang3.builder.MultilineRecursiveToStringStyleTest)  Time elapsed: 0.002 sec  <<< FAILURE!
org.junit.ComparisonFailure: expected:<...ngStyleTest$Customer[@7377e4b0[
  name=Douglas Adams,
  bank=org.apache.commons.lang3.builder.MultilineRecursiveToStringStyleTest$Bank@44471a09][
    name=ASF Bank
...> but was:<...ngStyleTest$Customer[[
  name=Douglas Adams,
  bank=org.apache.commons.lang3.builder.MultilineRecursiveToStringStyleTest$Bank][
    name=ASF Bank
...>
	at org.junit.Assert.assertEquals(Assert.java:115)
	at org.junit.Assert.assertEquals(Assert.java:144)
	at org.apache.commons.lang3.builder.MultilineRecursiveToStringStyleTest.nestedElements(MultilineRecursiveToStringStyleTest.java:57)

boolArray(org.apache.commons.lang3.builder.MultilineRecursiveToStringStyleTest)  Time elapsed: 0 sec  <<< FAILURE!
org.junit.ComparisonFailure: expected:<...StyleTest$WithArrays[@55c96b02][
  boolArray={
    ...> but was:<...StyleTest$WithArrays[][
  boolArray={
    ...>
	at org.junit.Assert.assertEquals(Assert.java:115)
	at org.junit.Assert.assertEquals(Assert.java:144)
	at org.apache.commons.lang3.builder.MultilineRecursiveToStringStyleTest.boolArray(MultilineRecursiveToStringStyleTest.java:113)

noArray(org.apache.commons.lang3.builder.MultilineRecursiveToStringStyleTest)  Time elapsed: 0.001 sec  <<< FAILURE!
org.junit.ComparisonFailure: expected:<...StyleTest$WithArrays[@3d0f282][
  boolArray=<null>...> but was:<...StyleTest$WithArrays[][
  boolArray=<null>...>
	at org.junit.Assert.assertEquals(Assert.java:115)
	at org.junit.Assert.assertEquals(Assert.java:144)
	at org.apache.commons.lang3.builder.MultilineRecursiveToStringStyleTest.noArray(MultilineRecursiveToStringStyleTest.java:94)

Running org.apache.commons.lang3.builder.RecursiveToStringStyleTest
Tests run: 8, Failures: 8, Errors: 0, Skipped: 0, Time elapsed: 0.003 sec <<< FAILURE! - in org.apache.commons.lang3.builder.RecursiveToStringStyleTest
testObjectArray(org.apache.commons.lang3.builder.RecursiveToStringStyleTest)  Time elapsed: 0 sec  <<< FAILURE!
org.junit.ComparisonFailure: expected:<java.lang.Integer[@dda4f7b][{<null>,5,{3,6}}]> but was:<java.lang.Integer[][{<null>,5,{3,6}}]>
	at org.junit.Assert.assertEquals(Assert.java:115)
	at org.junit.Assert.assertEquals(Assert.java:144)
	at org.apache.commons.lang3.builder.RecursiveToStringStyleTest.testObjectArray(RecursiveToStringStyleTest.java:107)

testBlank(org.apache.commons.lang3.builder.RecursiveToStringStyleTest)  Time elapsed: 0 sec  <<< FAILURE!
org.junit.ComparisonFailure: expected:<java.lang.Integer[@dda4f7b][]> but was:<java.lang.Integer[][]>
	at org.junit.Assert.assertEquals(Assert.java:115)
	at org.junit.Assert.assertEquals(Assert.java:144)
	at org.apache.commons.lang3.builder.RecursiveToStringStyleTest.testBlank(RecursiveToStringStyleTest.java:52)

testLong(org.apache.commons.lang3.builder.RecursiveToStringStyleTest)  Time elapsed: 0 sec  <<< FAILURE!
org.junit.ComparisonFailure: expected:<java.lang.Integer[@dda4f7b][3]> but was:<java.lang.Integer[][3]>
	at org.junit.Assert.assertEquals(Assert.java:115)
	at org.junit.Assert.assertEquals(Assert.java:144)
	at org.apache.commons.lang3.builder.RecursiveToStringStyleTest.testLong(RecursiveToStringStyleTest.java:99)

testLongArrayArray(org.apache.commons.lang3.builder.RecursiveToStringStyleTest)  Time elapsed: 0 sec  <<< FAILURE!
org.junit.ComparisonFailure: expected:<java.lang.Integer[@dda4f7b][{{1,2},<null>,{5}}]> but was:<java.lang.Integer[][{{1,2},<null>,{5}}]>
	at org.junit.Assert.assertEquals(Assert.java:115)
	at org.junit.Assert.assertEquals(Assert.java:144)
	at org.apache.commons.lang3.builder.RecursiveToStringStyleTest.testLongArrayArray(RecursiveToStringStyleTest.java:127)

testLongArray(org.apache.commons.lang3.builder.RecursiveToStringStyleTest)  Time elapsed: 0 sec  <<< FAILURE!
org.junit.ComparisonFailure: expected:<java.lang.Integer[@dda4f7b][{1,2,-3,4}]> but was:<java.lang.Integer[][{1,2,-3,4}]>
	at org.junit.Assert.assertEquals(Assert.java:115)
	at org.junit.Assert.assertEquals(Assert.java:144)
	at org.apache.commons.lang3.builder.RecursiveToStringStyleTest.testLongArray(RecursiveToStringStyleTest.java:117)

testObject(org.apache.commons.lang3.builder.RecursiveToStringStyleTest)  Time elapsed: 0 sec  <<< FAILURE!
org.junit.ComparisonFailure: expected:<java.lang.Integer[@dda4f7b][<null>]> but was:<java.lang.Integer[][<null>]>
	at org.junit.Assert.assertEquals(Assert.java:115)
	at org.junit.Assert.assertEquals(Assert.java:144)
	at org.apache.commons.lang3.builder.RecursiveToStringStyleTest.testObject(RecursiveToStringStyleTest.java:69)

testPerson(org.apache.commons.lang3.builder.RecursiveToStringStyleTest)  Time elapsed: 0 sec  <<< FAILURE!
org.junit.ComparisonFailure: expected:<...ringStyleTest$Person[@574ff50a[name=John Doe,age=33,smoker=false,job=org.apache.commons.lang3.builder.RecursiveToStringStyleTest$Job@4260904e][title=Manager]]> but was:<...ringStyleTest$Person[[name=John Doe,age=33,smoker=false,job=org.apache.commons.lang3.builder.RecursiveToStringStyleTest$Job][title=Manager]]>
	at org.junit.Assert.assertEquals(Assert.java:115)
	at org.junit.Assert.assertEquals(Assert.java:144)
	at org.apache.commons.lang3.builder.RecursiveToStringStyleTest.testPerson(RecursiveToStringStyleTest.java:93)

testAppendSuper(org.apache.commons.lang3.builder.RecursiveToStringStyleTest)  Time elapsed: 0 sec  <<< FAILURE!
org.junit.ComparisonFailure: expected:<java.lang.Integer[@dda4f7b][]> but was:<java.lang.Integer[][]>
	at org.junit.Assert.assertEquals(Assert.java:115)
	at org.junit.Assert.assertEquals(Assert.java:144)
	at org.apache.commons.lang3.builder.RecursiveToStringStyleTest.testAppendSuper(RecursiveToStringStyleTest.java:57)

Running org.apache.commons.lang3.builder.DefaultToStringStyleTest
Tests run: 8, Failures: 8, Errors: 0, Skipped: 0, Time elapsed: 0.001 sec <<< FAILURE! - in org.apache.commons.lang3.builder.DefaultToStringStyleTest
testObjectArray(org.apache.commons.lang3.builder.DefaultToStringStyleTest)  Time elapsed: 0 sec  <<< FAILURE!
org.junit.ComparisonFailure: expected:<java.lang.Integer[@dda4f7b][{<null>,5,{3,6}}]> but was:<java.lang.Integer[][{<null>,5,{3,6}}]>
	at org.junit.Assert.assertEquals(Assert.java:115)
	at org.junit.Assert.assertEquals(Assert.java:144)
	at org.apache.commons.lang3.builder.DefaultToStringStyleTest.testObjectArray(DefaultToStringStyleTest.java:104)

testBlank(org.apache.commons.lang3.builder.DefaultToStringStyleTest)  Time elapsed: 0 sec  <<< FAILURE!
org.junit.ComparisonFailure: expected:<java.lang.Integer[@dda4f7b][]> but was:<java.lang.Integer[][]>
	at org.junit.Assert.assertEquals(Assert.java:115)
	at org.junit.Assert.assertEquals(Assert.java:144)
	at org.apache.commons.lang3.builder.DefaultToStringStyleTest.testBlank(DefaultToStringStyleTest.java:53)

testLong(org.apache.commons.lang3.builder.DefaultToStringStyleTest)  Time elapsed: 0 sec  <<< FAILURE!
org.junit.ComparisonFailure: expected:<java.lang.Integer[@dda4f7b][3]> but was:<java.lang.Integer[][3]>
	at org.junit.Assert.assertEquals(Assert.java:115)
	at org.junit.Assert.assertEquals(Assert.java:144)
	at org.apache.commons.lang3.builder.DefaultToStringStyleTest.testLong(DefaultToStringStyleTest.java:96)

testLongArrayArray(org.apache.commons.lang3.builder.DefaultToStringStyleTest)  Time elapsed: 0 sec  <<< FAILURE!
org.junit.ComparisonFailure: expected:<java.lang.Integer[@dda4f7b][{{1,2},<null>,{5}}]> but was:<java.lang.Integer[][{{1,2},<null>,{5}}]>
	at org.junit.Assert.assertEquals(Assert.java:115)
	at org.junit.Assert.assertEquals(Assert.java:144)
	at org.apache.commons.lang3.builder.DefaultToStringStyleTest.testLongArrayArray(DefaultToStringStyleTest.java:124)

testLongArray(org.apache.commons.lang3.builder.DefaultToStringStyleTest)  Time elapsed: 0 sec  <<< FAILURE!
org.junit.ComparisonFailure: expected:<java.lang.Integer[@dda4f7b][{1,2,-3,4}]> but was:<java.lang.Integer[][{1,2,-3,4}]>
	at org.junit.Assert.assertEquals(Assert.java:115)
	at org.junit.Assert.assertEquals(Assert.java:144)
	at org.apache.commons.lang3.builder.DefaultToStringStyleTest.testLongArray(DefaultToStringStyleTest.java:114)

testObject(org.apache.commons.lang3.builder.DefaultToStringStyleTest)  Time elapsed: 0 sec  <<< FAILURE!
org.junit.ComparisonFailure: expected:<java.lang.Integer[@dda4f7b][<null>]> but was:<java.lang.Integer[][<null>]>
	at org.junit.Assert.assertEquals(Assert.java:115)
	at org.junit.Assert.assertEquals(Assert.java:144)
	at org.apache.commons.lang3.builder.DefaultToStringStyleTest.testObject(DefaultToStringStyleTest.java:70)

testPerson(org.apache.commons.lang3.builder.DefaultToStringStyleTest)  Time elapsed: 0 sec  <<< FAILURE!
org.junit.ComparisonFailure: expected:<...ringStyleTest$Person[@37b79249][name=John Doe,age=3...> but was:<...ringStyleTest$Person[][name=John Doe,age=3...>
	at org.junit.Assert.assertEquals(Assert.java:115)
	at org.junit.Assert.assertEquals(Assert.java:144)
	at org.apache.commons.lang3.builder.DefaultToStringStyleTest.testPerson(DefaultToStringStyleTest.java:91)

testAppendSuper(org.apache.commons.lang3.builder.DefaultToStringStyleTest)  Time elapsed: 0 sec  <<< FAILURE!
org.junit.ComparisonFailure: expected:<java.lang.Integer[@dda4f7b][]> but was:<java.lang.Integer[][]>
	at org.junit.Assert.assertEquals(Assert.java:115)
	at org.junit.Assert.assertEquals(Assert.java:144)
	at org.apache.commons.lang3.builder.DefaultToStringStyleTest.testAppendSuper(DefaultToStringStyleTest.java:58)

Running org.apache.commons.lang3.builder.ReflectionToStringBuilderExcludeTest
Tests run: 11, Failures: 0, Errors: 0, Skipped: 0, Time elapsed: 0.001 sec - in org.apache.commons.lang3.builder.ReflectionToStringBuilderExcludeTest
Running org.apache.commons.lang3.builder.StandardToStringStyleTest
Tests run: 8, Failures: 0, Errors: 0, Skipped: 0, Time elapsed: 0.001 sec - in org.apache.commons.lang3.builder.StandardToStringStyleTest
Running org.apache.commons.lang3.builder.ToStringStyleTest
Tests run: 12, Failures: 0, Errors: 0, Skipped: 0, Time elapsed: 0.001 sec - in org.apache.commons.lang3.builder.ToStringStyleTest
Running org.apache.commons.lang3.builder.DiffTest
Tests run: 4, Failures: 0, Errors: 0, Skipped: 0, Time elapsed: 0 sec - in org.apache.commons.lang3.builder.DiffTest
Running org.apache.commons.lang3.builder.SimpleToStringStyleTest
Tests run: 8, Failures: 0, Errors: 0, Skipped: 0, Time elapsed: 0.001 sec - in org.apache.commons.lang3.builder.SimpleToStringStyleTest
Running org.apache.commons.lang3.builder.MultiLineToStringStyleTest
Tests run: 8, Failures: 8, Errors: 0, Skipped: 0, Time elapsed: 0 sec <<< FAILURE! - in org.apache.commons.lang3.builder.MultiLineToStringStyleTest
testObjectArray(org.apache.commons.lang3.builder.MultiLineToStringStyleTest)  Time elapsed: 0 sec  <<< FAILURE!
org.junit.ComparisonFailure: expected:<java.lang.Integer[@dda4f7b][
  {<null>,5,{3,6}}...> but was:<java.lang.Integer[][
  {<null>,5,{3,6}}...>
	at org.junit.Assert.assertEquals(Assert.java:115)
	at org.junit.Assert.assertEquals(Assert.java:144)
	at org.apache.commons.lang3.builder.MultiLineToStringStyleTest.testObjectArray(MultiLineToStringStyleTest.java:105)

testBlank(org.apache.commons.lang3.builder.MultiLineToStringStyleTest)  Time elapsed: 0 sec  <<< FAILURE!
org.junit.ComparisonFailure: expected:<java.lang.Integer[@dda4f7b][
]> but was:<java.lang.Integer[][
]>
	at org.junit.Assert.assertEquals(Assert.java:115)
	at org.junit.Assert.assertEquals(Assert.java:144)
	at org.apache.commons.lang3.builder.MultiLineToStringStyleTest.testBlank(MultiLineToStringStyleTest.java:54)

testLong(org.apache.commons.lang3.builder.MultiLineToStringStyleTest)  Time elapsed: 0 sec  <<< FAILURE!
org.junit.ComparisonFailure: expected:<java.lang.Integer[@dda4f7b][
  3
]> but was:<java.lang.Integer[][
  3
]>
	at org.junit.Assert.assertEquals(Assert.java:115)
	at org.junit.Assert.assertEquals(Assert.java:144)
	at org.apache.commons.lang3.builder.MultiLineToStringStyleTest.testLong(MultiLineToStringStyleTest.java:97)

testLongArrayArray(org.apache.commons.lang3.builder.MultiLineToStringStyleTest)  Time elapsed: 0 sec  <<< FAILURE!
org.junit.ComparisonFailure: expected:<java.lang.Integer[@dda4f7b][
  {{1,2},<null>,{5...> but was:<java.lang.Integer[][
  {{1,2},<null>,{5...>
	at org.junit.Assert.assertEquals(Assert.java:115)
	at org.junit.Assert.assertEquals(Assert.java:144)
	at org.apache.commons.lang3.builder.MultiLineToStringStyleTest.testLongArrayArray(MultiLineToStringStyleTest.java:125)

testLongArray(org.apache.commons.lang3.builder.MultiLineToStringStyleTest)  Time elapsed: 0 sec  <<< FAILURE!
org.junit.ComparisonFailure: expected:<java.lang.Integer[@dda4f7b][
  {1,2,-3,4}
]> but was:<java.lang.Integer[][
  {1,2,-3,4}
]>
	at org.junit.Assert.assertEquals(Assert.java:115)
	at org.junit.Assert.assertEquals(Assert.java:144)
	at org.apache.commons.lang3.builder.MultiLineToStringStyleTest.testLongArray(MultiLineToStringStyleTest.java:115)

testObject(org.apache.commons.lang3.builder.MultiLineToStringStyleTest)  Time elapsed: 0 sec  <<< FAILURE!
org.junit.ComparisonFailure: expected:<java.lang.Integer[@dda4f7b][
  <null>
]> but was:<java.lang.Integer[][
  <null>
]>
	at org.junit.Assert.assertEquals(Assert.java:115)
	at org.junit.Assert.assertEquals(Assert.java:144)
	at org.apache.commons.lang3.builder.MultiLineToStringStyleTest.testObject(MultiLineToStringStyleTest.java:71)

testPerson(org.apache.commons.lang3.builder.MultiLineToStringStyleTest)  Time elapsed: 0 sec  <<< FAILURE!
org.junit.ComparisonFailure: expected:<...ringStyleTest$Person[@42eb40fe][
  name=Jane Doe
  ...> but was:<...ringStyleTest$Person[][
  name=Jane Doe
  ...>
	at org.junit.Assert.assertEquals(Assert.java:115)
	at org.junit.Assert.assertEquals(Assert.java:144)
	at org.apache.commons.lang3.builder.MultiLineToStringStyleTest.testPerson(MultiLineToStringStyleTest.java:92)

testAppendSuper(org.apache.commons.lang3.builder.MultiLineToStringStyleTest)  Time elapsed: 0 sec  <<< FAILURE!
org.junit.ComparisonFailure: expected:<java.lang.Integer[@dda4f7b][
]> but was:<java.lang.Integer[][
]>
	at org.junit.Assert.assertEquals(Assert.java:115)
	at org.junit.Assert.assertEquals(Assert.java:144)
	at org.apache.commons.lang3.builder.MultiLineToStringStyleTest.testAppendSuper(MultiLineToStringStyleTest.java:59)

Running org.apache.commons.lang3.builder.ToStringStyleConcurrencyTest
Tests run: 3, Failures: 0, Errors: 0, Skipped: 0, Time elapsed: 3.947 sec - in org.apache.commons.lang3.builder.ToStringStyleConcurrencyTest
Running org.apache.commons.lang3.builder.ReflectionToStringBuilderMutateInspectConcurrencyTest
Tests run: 1, Failures: 0, Errors: 0, Skipped: 1, Time elapsed: 0.001 sec - in org.apache.commons.lang3.builder.ReflectionToStringBuilderMutateInspectConcurrencyTest
Running org.apache.commons.lang3.builder.ToStringBuilderTest
Tests run: 74, Failures: 64, Errors: 0, Skipped: 1, Time elapsed: 0.07 sec <<< FAILURE! - in org.apache.commons.lang3.builder.ToStringBuilderTest
testCharArray(org.apache.commons.lang3.builder.ToStringBuilderTest)  Time elapsed: 0.001 sec  <<< FAILURE!
org.junit.ComparisonFailure: expected:<java.lang.Integer[@dda4f7b][{A,2,_,D}]> but was:<java.lang.Integer[][{A,2,_,D}]>
	at org.junit.Assert.assertEquals(Assert.java:115)
	at org.junit.Assert.assertEquals(Assert.java:144)
	at org.apache.commons.lang3.builder.ToStringBuilderTest.testCharArray(ToStringBuilderTest.java:767)

testDoubleArrayArray(org.apache.commons.lang3.builder.ToStringBuilderTest)  Time elapsed: 0 sec  <<< FAILURE!
org.junit.ComparisonFailure: expected:<java.lang.Integer[@dda4f7b][{{1.0,2.29686},<nul...> but was:<java.lang.Integer[][{{1.0,2.29686},<nul...>
	at org.junit.Assert.assertEquals(Assert.java:115)
	at org.junit.Assert.assertEquals(Assert.java:144)
	at org.apache.commons.lang3.builder.ToStringBuilderTest.testDoubleArrayArray(ToStringBuilderTest.java:857)

testReflectionBoolean(org.apache.commons.lang3.builder.ToStringBuilderTest)  Time elapsed: 0 sec  <<< FAILURE!
org.junit.ComparisonFailure: expected:<java.lang.Boolean[@6b6a4b18][value=true]> but was:<java.lang.Boolean[][value=true]>
	at org.junit.Assert.assertEquals(Assert.java:115)
	at org.junit.Assert.assertEquals(Assert.java:144)
	at org.apache.commons.lang3.builder.ToStringBuilderTest.testReflectionBoolean(ToStringBuilderTest.java:116)

testObjectArray(org.apache.commons.lang3.builder.ToStringBuilderTest)  Time elapsed: 0.001 sec  <<< FAILURE!
org.junit.ComparisonFailure: expected:<java.lang.Integer[@dda4f7b][{<null>,5,{3,6}}]> but was:<java.lang.Integer[][{<null>,5,{3,6}}]>
	at org.junit.Assert.assertEquals(Assert.java:115)
	at org.junit.Assert.assertEquals(Assert.java:144)
	at org.apache.commons.lang3.builder.ToStringBuilderTest.testObjectArray(ToStringBuilderTest.java:717)

testObjectBuild(org.apache.commons.lang3.builder.ToStringBuilderTest)  Time elapsed: 0 sec  <<< FAILURE!
org.junit.ComparisonFailure: expected:<java.lang.Integer[@dda4f7b][<null>]> but was:<java.lang.Integer[][<null>]>
	at org.junit.Assert.assertEquals(Assert.java:115)
	at org.junit.Assert.assertEquals(Assert.java:144)
	at org.apache.commons.lang3.builder.ToStringBuilderTest.testObjectBuild(ToStringBuilderTest.java:641)

testObjectCycle(org.apache.commons.lang3.builder.ToStringBuilderTest)  Time elapsed: 0.001 sec  <<< FAILURE!
org.junit.ComparisonFailure: expected:<...lderTest$ObjectCycle[@73c87405[org.apache.commons.lang3.builder.ToStringBuilderTest$ObjectCycle@6d392fa5][org.apache.commons....> but was:<...lderTest$ObjectCycle[[org.apache.commons.lang3.builder.ToStringBuilderTest$ObjectCycle][org.apache.commons....>
	at org.junit.Assert.assertEquals(Assert.java:115)
	at org.junit.Assert.assertEquals(Assert.java:144)
	at org.apache.commons.lang3.builder.ToStringBuilderTest.testObjectCycle(ToStringBuilderTest.java:892)

testReflectionHierarchy(org.apache.commons.lang3.builder.ToStringBuilderTest)  Time elapsed: 0.001 sec  <<< FAILURE!
org.junit.ComparisonFailure: expected:<...flectionTestFixtureA[@79ed3030][a=a]> but was:<...flectionTestFixtureA[][a=a]>
	at org.junit.Assert.assertEquals(Assert.java:115)
	at org.junit.Assert.assertEquals(Assert.java:144)
	at org.apache.commons.lang3.builder.ToStringBuilderTest.testReflectionHierarchy(ToStringBuilderTest.java:338)

testSelfInstanceTwoVarsReflectionObjectCycle(org.apache.commons.lang3.builder.ToStringBuilderTest)  Time elapsed: 0.001 sec  <<< FAILURE!
org.junit.ComparisonFailure: expected:<...eflectionTestFixture[@3828ef8f][typeIsSelf=org.apac...> but was:<...eflectionTestFixture[][typeIsSelf=org.apac...>
	at org.junit.Assert.assertEquals(Assert.java:115)
	at org.junit.Assert.assertEquals(Assert.java:144)
	at org.apache.commons.lang3.builder.ToStringBuilderTest.testSelfInstanceTwoVarsReflectionObjectCycle(ToStringBuilderTest.java:549)

testShortArrayArray(org.apache.commons.lang3.builder.ToStringBuilderTest)  Time elapsed: 0 sec  <<< FAILURE!
org.junit.ComparisonFailure: expected:<java.lang.Integer[@dda4f7b][{{1,2},<null>,{5}}]> but was:<java.lang.Integer[][{{1,2},<null>,{5}}]>
	at org.junit.Assert.assertEquals(Assert.java:115)
	at org.junit.Assert.assertEquals(Assert.java:144)
	at org.apache.commons.lang3.builder.ToStringBuilderTest.testShortArrayArray(ToStringBuilderTest.java:827)

testBooleanArrayArray(org.apache.commons.lang3.builder.ToStringBuilderTest)  Time elapsed: 0 sec  <<< FAILURE!
org.junit.ComparisonFailure: expected:<java.lang.Integer[@dda4f7b][{{true,false},<null...> but was:<java.lang.Integer[][{{true,false},<null...>
	at org.junit.Assert.assertEquals(Assert.java:115)
	at org.junit.Assert.assertEquals(Assert.java:144)
	at org.apache.commons.lang3.builder.ToStringBuilderTest.testBooleanArrayArray(ToStringBuilderTest.java:877)

testFloatArray(org.apache.commons.lang3.builder.ToStringBuilderTest)  Time elapsed: 0.001 sec  <<< FAILURE!
org.junit.ComparisonFailure: expected:<java.lang.Integer[@dda4f7b][{1.0,2.9876,-3.0000...> but was:<java.lang.Integer[][{1.0,2.9876,-3.0000...>
	at org.junit.Assert.assertEquals(Assert.java:115)
	at org.junit.Assert.assertEquals(Assert.java:144)
	at org.apache.commons.lang3.builder.ToStringBuilderTest.testFloatArray(ToStringBuilderTest.java:787)

testInt(org.apache.commons.lang3.builder.ToStringBuilderTest)  Time elapsed: 0.001 sec  <<< FAILURE!
org.junit.ComparisonFailure: expected:<java.lang.Integer[@dda4f7b][3]> but was:<java.lang.Integer[][3]>
	at org.junit.Assert.assertEquals(Assert.java:115)
	at org.junit.Assert.assertEquals(Assert.java:144)
	at org.apache.commons.lang3.builder.ToStringBuilderTest.testInt(ToStringBuilderTest.java:665)

testByteArray(org.apache.commons.lang3.builder.ToStringBuilderTest)  Time elapsed: 0 sec  <<< FAILURE!
org.junit.ComparisonFailure: expected:<java.lang.Integer[@dda4f7b][{1,2,-3,4}]> but was:<java.lang.Integer[][{1,2,-3,4}]>
	at org.junit.Assert.assertEquals(Assert.java:115)
	at org.junit.Assert.assertEquals(Assert.java:144)
	at org.apache.commons.lang3.builder.ToStringBuilderTest.testByteArray(ToStringBuilderTest.java:757)

testReflectionArrayCycle(org.apache.commons.lang3.builder.ToStringBuilderTest)  Time elapsed: 0 sec  <<< FAILURE!
org.junit.ComparisonFailure: expected:<[Ljava.lang.Object;[@422cac21][{[Ljava.lang.Object...> but was:<[Ljava.lang.Object;[][{[Ljava.lang.Object...>
	at org.junit.Assert.assertEquals(Assert.java:115)
	at org.junit.Assert.assertEquals(Assert.java:144)
	at org.apache.commons.lang3.builder.ToStringBuilderTest.testReflectionArrayCycle(ToStringBuilderTest.java:402)

testReflectionLongArrayArray(org.apache.commons.lang3.builder.ToStringBuilderTest)  Time elapsed: 0.004 sec  <<< FAILURE!
org.junit.ComparisonFailure: expected:<[[J[@2d8cc78][{{1,2},<null>,{5}}]> but was:<[[J[][{{1,2},<null>,{5}}]>
	at org.junit.Assert.assertEquals(Assert.java:115)
	at org.junit.Assert.assertEquals(Assert.java:144)
	at org.apache.commons.lang3.builder.ToStringBuilderTest.testReflectionLongArrayArray(ToStringBuilderTest.java:253)

testBlank(org.apache.commons.lang3.builder.ToStringBuilderTest)  Time elapsed: 0 sec  <<< FAILURE!
org.junit.ComparisonFailure: expected:<java.lang.Integer[@dda4f7b][]> but was:<java.lang.Integer[][]>
	at org.junit.Assert.assertEquals(Assert.java:115)
	at org.junit.Assert.assertEquals(Assert.java:144)
	at org.apache.commons.lang3.builder.ToStringBuilderTest.testBlank(ToStringBuilderTest.java:89)

testFloat(org.apache.commons.lang3.builder.ToStringBuilderTest)  Time elapsed: 0 sec  <<< FAILURE!
org.junit.ComparisonFailure: expected:<java.lang.Integer[@dda4f7b][3.2]> but was:<java.lang.Integer[][3.2]>
	at org.junit.Assert.assertEquals(Assert.java:115)
	at org.junit.Assert.assertEquals(Assert.java:144)
	at org.apache.commons.lang3.builder.ToStringBuilderTest.testFloat(ToStringBuilderTest.java:701)

testShort(org.apache.commons.lang3.builder.ToStringBuilderTest)  Time elapsed: 0 sec  <<< FAILURE!
org.junit.ComparisonFailure: expected:<java.lang.Integer[@dda4f7b][3]> but was:<java.lang.Integer[][3]>
	at org.junit.Assert.assertEquals(Assert.java:115)
	at org.junit.Assert.assertEquals(Assert.java:144)
	at org.apache.commons.lang3.builder.ToStringBuilderTest.testShort(ToStringBuilderTest.java:672)

testReflectionArrayArrayCycle(org.apache.commons.lang3.builder.ToStringBuilderTest)  Time elapsed: 0 sec  <<< FAILURE!
org.junit.ComparisonFailure: expected:<[[Ljava.lang.Object;[@3f14a0de][{{[[Ljava.lang.Obje...> but was:<[[Ljava.lang.Object;[][{{[[Ljava.lang.Obje...>
	at org.junit.Assert.assertEquals(Assert.java:115)
	at org.junit.Assert.assertEquals(Assert.java:144)
	at org.apache.commons.lang3.builder.ToStringBuilderTest.testReflectionArrayArrayCycle(ToStringBuilderTest.java:432)

testByte(org.apache.commons.lang3.builder.ToStringBuilderTest)  Time elapsed: 0.001 sec  <<< FAILURE!
org.junit.ComparisonFailure: expected:<java.lang.Integer[@dda4f7b][3]> but was:<java.lang.Integer[][3]>
	at org.junit.Assert.assertEquals(Assert.java:115)
	at org.junit.Assert.assertEquals(Assert.java:144)
	at org.apache.commons.lang3.builder.ToStringBuilderTest.testByte(ToStringBuilderTest.java:686)

testChar(org.apache.commons.lang3.builder.ToStringBuilderTest)  Time elapsed: 0 sec  <<< FAILURE!
org.junit.ComparisonFailure: expected:<java.lang.Integer[@dda4f7b][A]> but was:<java.lang.Integer[][A]>
	at org.junit.Assert.assertEquals(Assert.java:115)
	at org.junit.Assert.assertEquals(Assert.java:144)
	at org.apache.commons.lang3.builder.ToStringBuilderTest.testChar(ToStringBuilderTest.java:679)

testLong(org.apache.commons.lang3.builder.ToStringBuilderTest)  Time elapsed: 0 sec  <<< FAILURE!
org.junit.ComparisonFailure: expected:<java.lang.Integer[@dda4f7b][3]> but was:<java.lang.Integer[][3]>
	at org.junit.Assert.assertEquals(Assert.java:115)
	at org.junit.Assert.assertEquals(Assert.java:144)
	at org.apache.commons.lang3.builder.ToStringBuilderTest.testLong(ToStringBuilderTest.java:657)

testReflectionFloatArray(org.apache.commons.lang3.builder.ToStringBuilderTest)  Time elapsed: 0.001 sec  <<< FAILURE!
org.junit.ComparisonFailure: expected:<[F[@42ed8181][{1.0,2.9876,-3.0000...> but was:<[F[][{1.0,2.9876,-3.0000...>
	at org.junit.Assert.assertEquals(Assert.java:115)
	at org.junit.Assert.assertEquals(Assert.java:144)
	at org.apache.commons.lang3.builder.ToStringBuilderTest.testReflectionFloatArray(ToStringBuilderTest.java:223)

testLongArrayArray(org.apache.commons.lang3.builder.ToStringBuilderTest)  Time elapsed: 0.001 sec  <<< FAILURE!
org.junit.ComparisonFailure: expected:<java.lang.Integer[@dda4f7b][{{1,2},<null>,{5}}]> but was:<java.lang.Integer[][{{1,2},<null>,{5}}]>
	at org.junit.Assert.assertEquals(Assert.java:115)
	at org.junit.Assert.assertEquals(Assert.java:144)
	at org.apache.commons.lang3.builder.ToStringBuilderTest.testLongArrayArray(ToStringBuilderTest.java:807)

testBoolean(org.apache.commons.lang3.builder.ToStringBuilderTest)  Time elapsed: 0 sec  <<< FAILURE!
org.junit.ComparisonFailure: expected:<java.lang.Integer[@dda4f7b][true]> but was:<java.lang.Integer[][true]>
	at org.junit.Assert.assertEquals(Assert.java:115)
	at org.junit.Assert.assertEquals(Assert.java:144)
	at org.apache.commons.lang3.builder.ToStringBuilderTest.testBoolean(ToStringBuilderTest.java:708)

testReflectionDoubleArrayArray(org.apache.commons.lang3.builder.ToStringBuilderTest)  Time elapsed: 0 sec  <<< FAILURE!
org.junit.ComparisonFailure: expected:<[[D[@741e9d69][{{1.0,2.29686},<nul...> but was:<[[D[][{{1.0,2.29686},<nul...>
	at org.junit.Assert.assertEquals(Assert.java:115)
	at org.junit.Assert.assertEquals(Assert.java:144)
	at org.apache.commons.lang3.builder.ToStringBuilderTest.testReflectionDoubleArrayArray(ToStringBuilderTest.java:298)

testReflectionBooleanArray(org.apache.commons.lang3.builder.ToStringBuilderTest)  Time elapsed: 0.001 sec  <<< FAILURE!
org.junit.ComparisonFailure: expected:<[Z[@3d8290a3][{true,false,false}]> but was:<[Z[][{true,false,false}]>
	at org.junit.Assert.assertEquals(Assert.java:115)
	at org.junit.Assert.assertEquals(Assert.java:144)
	at org.apache.commons.lang3.builder.ToStringBuilderTest.testReflectionBooleanArray(ToStringBuilderTest.java:232)

testReflectionInteger(org.apache.commons.lang3.builder.ToStringBuilderTest)  Time elapsed: 0.001 sec  <<< FAILURE!
org.junit.ComparisonFailure: expected:<java.lang.Integer[@dda4f7b][value=5]> but was:<java.lang.Integer[][value=5]>
	at org.junit.Assert.assertEquals(Assert.java:115)
	at org.junit.Assert.assertEquals(Assert.java:144)
	at org.apache.commons.lang3.builder.ToStringBuilderTest.testReflectionInteger(ToStringBuilderTest.java:97)

testBooleanArray(org.apache.commons.lang3.builder.ToStringBuilderTest)  Time elapsed: 0.001 sec  <<< FAILURE!
org.junit.ComparisonFailure: expected:<java.lang.Integer[@dda4f7b][{true,false,false}]> but was:<java.lang.Integer[][{true,false,false}]>
	at org.junit.Assert.assertEquals(Assert.java:115)
	at org.junit.Assert.assertEquals(Assert.java:144)
	at org.apache.commons.lang3.builder.ToStringBuilderTest.testBooleanArray(ToStringBuilderTest.java:797)

testFloatArrayArray(org.apache.commons.lang3.builder.ToStringBuilderTest)  Time elapsed: 0.001 sec  <<< FAILURE!
org.junit.ComparisonFailure: expected:<java.lang.Integer[@dda4f7b][{{1.0,2.29686},<nul...> but was:<java.lang.Integer[][{{1.0,2.29686},<nul...>
	at org.junit.Assert.assertEquals(Assert.java:115)
	at org.junit.Assert.assertEquals(Assert.java:144)
	at org.apache.commons.lang3.builder.ToStringBuilderTest.testFloatArrayArray(ToStringBuilderTest.java:867)

testReflectionyteArray(org.apache.commons.lang3.builder.ToStringBuilderTest)  Time elapsed: 0 sec  <<< FAILURE!
org.junit.ComparisonFailure: expected:<[B[@fd94e60][{1,2,-3,4}]> but was:<[B[][{1,2,-3,4}]>
	at org.junit.Assert.assertEquals(Assert.java:115)
	at org.junit.Assert.assertEquals(Assert.java:144)
	at org.apache.commons.lang3.builder.ToStringBuilderTest.testReflectionyteArray(ToStringBuilderTest.java:196)

testReflectionDoubleArray(org.apache.commons.lang3.builder.ToStringBuilderTest)  Time elapsed: 0 sec  <<< FAILURE!
org.junit.ComparisonFailure: expected:<[D[@3a888c1][{1.0,2.9876,-3.0000...> but was:<[D[][{1.0,2.9876,-3.0000...>
	at org.junit.Assert.assertEquals(Assert.java:115)
	at org.junit.Assert.assertEquals(Assert.java:144)
	at org.apache.commons.lang3.builder.ToStringBuilderTest.testReflectionDoubleArray(ToStringBuilderTest.java:214)

testReflectionIntArrayArray(org.apache.commons.lang3.builder.ToStringBuilderTest)  Time elapsed: 0 sec  <<< FAILURE!
org.junit.ComparisonFailure: expected:<[[I[@2daa38c7][{{1,2},<null>,{5}}]> but was:<[[I[][{{1,2},<null>,{5}}]>
	at org.junit.Assert.assertEquals(Assert.java:115)
	at org.junit.Assert.assertEquals(Assert.java:144)
	at org.apache.commons.lang3.builder.ToStringBuilderTest.testReflectionIntArrayArray(ToStringBuilderTest.java:262)

testSimpleReflectionStatics(org.apache.commons.lang3.builder.ToStringBuilderTest)  Time elapsed: 0.002 sec  <<< FAILURE!
org.junit.ComparisonFailure: expected:<...nStaticFieldsFixture[@317240d9][staticString=static...> but was:<...nStaticFieldsFixture[][staticString=static...>
	at org.junit.Assert.assertEquals(Assert.java:115)
	at org.junit.Assert.assertEquals(Assert.java:144)
	at org.apache.commons.lang3.builder.ToStringBuilderTest.testSimpleReflectionStatics(ToStringBuilderTest.java:907)

testReflectionStatics(org.apache.commons.lang3.builder.ToStringBuilderTest)  Time elapsed: 0.002 sec  <<< FAILURE!
org.junit.ComparisonFailure: expected:<...nStaticFieldsFixture[@409c799b][staticString=static...> but was:<...nStaticFieldsFixture[][staticString=static...>
	at org.junit.Assert.assertEquals(Assert.java:115)
	at org.junit.Assert.assertEquals(Assert.java:144)
	at org.apache.commons.lang3.builder.ToStringBuilderTest.testReflectionStatics(ToStringBuilderTest.java:927)

testReflectionLongArray(org.apache.commons.lang3.builder.ToStringBuilderTest)  Time elapsed: 0.001 sec  <<< FAILURE!
org.junit.ComparisonFailure: expected:<[J[@26ed4b7a][{1,2,-3,4}]> but was:<[J[][{1,2,-3,4}]>
	at org.junit.Assert.assertEquals(Assert.java:115)
	at org.junit.Assert.assertEquals(Assert.java:144)
	at org.apache.commons.lang3.builder.ToStringBuilderTest.testReflectionLongArray(ToStringBuilderTest.java:169)

testReflectionhortArrayArray(org.apache.commons.lang3.builder.ToStringBuilderTest)  Time elapsed: 0.001 sec  <<< FAILURE!
org.junit.ComparisonFailure: expected:<[[S[@24f64a8d][{{1,2},<null>,{5}}]> but was:<[[S[][{{1,2},<null>,{5}}]>
	at org.junit.Assert.assertEquals(Assert.java:115)
	at org.junit.Assert.assertEquals(Assert.java:144)
	at org.apache.commons.lang3.builder.ToStringBuilderTest.testReflectionhortArrayArray(ToStringBuilderTest.java:271)

testReflectionObjectArray(org.apache.commons.lang3.builder.ToStringBuilderTest)  Time elapsed: 0 sec  <<< FAILURE!
org.junit.ComparisonFailure: expected:<[Ljava.lang.Object;[@1594af77][{<null>,5,{3,6}}]> but was:<[Ljava.lang.Object;[][{<null>,5,{3,6}}]>
	at org.junit.Assert.assertEquals(Assert.java:115)
	at org.junit.Assert.assertEquals(Assert.java:144)
	at org.apache.commons.lang3.builder.ToStringBuilderTest.testReflectionObjectArray(ToStringBuilderTest.java:160)

testReflectionObjectCycle(org.apache.commons.lang3.builder.ToStringBuilderTest)  Time elapsed: 0.002 sec  <<< FAILURE!
org.junit.ComparisonFailure: expected:<...ReflectionTestCycleA[@210ad97b[b=org.apache.commons.lang3.builder.ToStringBuilderTest$ReflectionTestCycleB@4f4c2b2f][a=org.apache.common...> but was:<...ReflectionTestCycleA[[b=org.apache.commons.lang3.builder.ToStringBuilderTest$ReflectionTestCycleB][a=org.apache.common...>
	at org.junit.Assert.assertEquals(Assert.java:115)
	at org.junit.Assert.assertEquals(Assert.java:144)
	at org.apache.commons.lang3.builder.ToStringBuilderTest.testReflectionObjectCycle(ToStringBuilderTest.java:562)

testReflectionBooleanArrayArray(org.apache.commons.lang3.builder.ToStringBuilderTest)  Time elapsed: 0 sec  <<< FAILURE!
org.junit.ComparisonFailure: expected:<[[Z[@1f181935][{{true,false},<null...> but was:<[[Z[][{{true,false},<null...>
	at org.junit.Assert.assertEquals(Assert.java:115)
	at org.junit.Assert.assertEquals(Assert.java:144)
	at org.apache.commons.lang3.builder.ToStringBuilderTest.testReflectionBooleanArrayArray(ToStringBuilderTest.java:307)

testLongArray(org.apache.commons.lang3.builder.ToStringBuilderTest)  Time elapsed: 0 sec  <<< FAILURE!
org.junit.ComparisonFailure: expected:<java.lang.Integer[@dda4f7b][{1,2,-3,4}]> but was:<java.lang.Integer[][{1,2,-3,4}]>
	at org.junit.Assert.assertEquals(Assert.java:115)
	at org.junit.Assert.assertEquals(Assert.java:144)
	at org.apache.commons.lang3.builder.ToStringBuilderTest.testLongArray(ToStringBuilderTest.java:727)

testSimpleReflectionObjectCycle(org.apache.commons.lang3.builder.ToStringBuilderTest)  Time elapsed: 0.002 sec  <<< FAILURE!
org.junit.ComparisonFailure: expected:<...eflectionTestFixture[@8beab46][o=org.apache.common...> but was:<...eflectionTestFixture[][o=org.apache.common...>
	at org.junit.Assert.assertEquals(Assert.java:115)
	at org.junit.Assert.assertEquals(Assert.java:144)
	at org.apache.commons.lang3.builder.ToStringBuilderTest.testSimpleReflectionObjectCycle(ToStringBuilderTest.java:530)

testShortArray(org.apache.commons.lang3.builder.ToStringBuilderTest)  Time elapsed: 0 sec  <<< FAILURE!
org.junit.ComparisonFailure: expected:<java.lang.Integer[@dda4f7b][{1,2,-3,4}]> but was:<java.lang.Integer[][{1,2,-3,4}]>
	at org.junit.Assert.assertEquals(Assert.java:115)
	at org.junit.Assert.assertEquals(Assert.java:144)
	at org.apache.commons.lang3.builder.ToStringBuilderTest.testShortArray(ToStringBuilderTest.java:747)

testIntArrayArray(org.apache.commons.lang3.builder.ToStringBuilderTest)  Time elapsed: 0 sec  <<< FAILURE!
org.junit.ComparisonFailure: expected:<java.lang.Integer[@dda4f7b][{{1,2},<null>,{5}}]> but was:<java.lang.Integer[][{{1,2},<null>,{5}}]>
	at org.junit.Assert.assertEquals(Assert.java:115)
	at org.junit.Assert.assertEquals(Assert.java:144)
	at org.apache.commons.lang3.builder.ToStringBuilderTest.testIntArrayArray(ToStringBuilderTest.java:817)

testInheritedReflectionStatics(org.apache.commons.lang3.builder.ToStringBuilderTest)  Time elapsed: 0.002 sec  <<< FAILURE!
org.junit.ComparisonFailure: expected:<...nStaticFieldsFixture[@605d9809][staticString2=stati...> but was:<...nStaticFieldsFixture[][staticString2=stati...>
	at org.junit.Assert.assertEquals(Assert.java:115)
	at org.junit.Assert.assertEquals(Assert.java:144)
	at org.apache.commons.lang3.builder.ToStringBuilderTest.testInheritedReflectionStatics(ToStringBuilderTest.java:947)

testReflectionByteArrayArray(org.apache.commons.lang3.builder.ToStringBuilderTest)  Time elapsed: 0.001 sec  <<< FAILURE!
org.junit.ComparisonFailure: expected:<[[B[@20c12654][{{1,2},<null>,{5}}]> but was:<[[B[][{{1,2},<null>,{5}}]>
	at org.junit.Assert.assertEquals(Assert.java:115)
	at org.junit.Assert.assertEquals(Assert.java:144)
	at org.apache.commons.lang3.builder.ToStringBuilderTest.testReflectionByteArrayArray(ToStringBuilderTest.java:280)

testReflectionArrayCycleLevel2(org.apache.commons.lang3.builder.ToStringBuilderTest)  Time elapsed: 0 sec  <<< FAILURE!
org.junit.ComparisonFailure: expected:<[Ljava.lang.Object;[@845ca53][{{[Ljava.lang.Objec...> but was:<[Ljava.lang.Object;[][{{[Ljava.lang.Objec...>
	at org.junit.Assert.assertEquals(Assert.java:115)
	at org.junit.Assert.assertEquals(Assert.java:144)
	at org.apache.commons.lang3.builder.ToStringBuilderTest.testReflectionArrayCycleLevel2(ToStringBuilderTest.java:416)

testAppendToString(org.apache.commons.lang3.builder.ToStringBuilderTest)  Time elapsed: 0 sec  <<< FAILURE!
org.junit.ComparisonFailure: expected:<java.lang.Integer[@dda4f7b][]> but was:<java.lang.Integer[][]>
	at org.junit.Assert.assertEquals(Assert.java:115)
	at org.junit.Assert.assertEquals(Assert.java:144)
	at org.apache.commons.lang3.builder.ToStringBuilderTest.testAppendToString(ToStringBuilderTest.java:611)

testReflectionArrayAndObjectCycle(org.apache.commons.lang3.builder.ToStringBuilderTest)  Time elapsed: 0.001 sec  <<< FAILURE!
org.junit.ComparisonFailure: expected:<[Ljava.lang.Object;[@6c02d7ea[{org.apache.commons.lang3.builder.ToStringBuilderTest$SimpleReflectionTestFixture@2ead7b0c][o=[Ljava.lang.Objec...> but was:<[Ljava.lang.Object;[[{org.apache.commons.lang3.builder.ToStringBuilderTest$SimpleReflectionTestFixture][o=[Ljava.lang.Objec...>
	at org.junit.Assert.assertEquals(Assert.java:115)
	at org.junit.Assert.assertEquals(Assert.java:144)
	at org.apache.commons.lang3.builder.ToStringBuilderTest.testReflectionArrayAndObjectCycle(ToStringBuilderTest.java:576)

testReflectionCharArrayArray(org.apache.commons.lang3.builder.ToStringBuilderTest)  Time elapsed: 0.001 sec  <<< FAILURE!
org.junit.ComparisonFailure: expected:<[[C[@7f6968c4][{{A,B},<null>,{p}}]> but was:<[[C[][{{A,B},<null>,{p}}]>
	at org.junit.Assert.assertEquals(Assert.java:115)
	at org.junit.Assert.assertEquals(Assert.java:144)
	at org.apache.commons.lang3.builder.ToStringBuilderTest.testReflectionCharArrayArray(ToStringBuilderTest.java:289)

testIntArray(org.apache.commons.lang3.builder.ToStringBuilderTest)  Time elapsed: 0.001 sec  <<< FAILURE!
org.junit.ComparisonFailure: expected:<java.lang.Integer[@dda4f7b][{1,2,-3,4}]> but was:<java.lang.Integer[][{1,2,-3,4}]>
	at org.junit.Assert.assertEquals(Assert.java:115)
	at org.junit.Assert.assertEquals(Assert.java:144)
	at org.apache.commons.lang3.builder.ToStringBuilderTest.testIntArray(ToStringBuilderTest.java:737)

testDouble(org.apache.commons.lang3.builder.ToStringBuilderTest)  Time elapsed: 0 sec  <<< FAILURE!
org.junit.ComparisonFailure: expected:<java.lang.Integer[@dda4f7b][3.2]> but was:<java.lang.Integer[][3.2]>
	at org.junit.Assert.assertEquals(Assert.java:115)
	at org.junit.Assert.assertEquals(Assert.java:144)
	at org.apache.commons.lang3.builder.ToStringBuilderTest.testDouble(ToStringBuilderTest.java:694)

testByteArrayArray(org.apache.commons.lang3.builder.ToStringBuilderTest)  Time elapsed: 0.001 sec  <<< FAILURE!
org.junit.ComparisonFailure: expected:<java.lang.Integer[@dda4f7b][{{1,2},<null>,{5}}]> but was:<java.lang.Integer[][{{1,2},<null>,{5}}]>
	at org.junit.Assert.assertEquals(Assert.java:115)
	at org.junit.Assert.assertEquals(Assert.java:144)
	at org.apache.commons.lang3.builder.ToStringBuilderTest.testByteArrayArray(ToStringBuilderTest.java:837)

testReflectionShortArray(org.apache.commons.lang3.builder.ToStringBuilderTest)  Time elapsed: 0.001 sec  <<< FAILURE!
org.junit.ComparisonFailure: expected:<[S[@6ed0cc34][{1,2,-3,4}]> but was:<[S[][{1,2,-3,4}]>
	at org.junit.Assert.assertEquals(Assert.java:115)
	at org.junit.Assert.assertEquals(Assert.java:144)
	at org.apache.commons.lang3.builder.ToStringBuilderTest.testReflectionShortArray(ToStringBuilderTest.java:187)

testCharArrayArray(org.apache.commons.lang3.builder.ToStringBuilderTest)  Time elapsed: 0 sec  <<< FAILURE!
org.junit.ComparisonFailure: expected:<java.lang.Integer[@dda4f7b][{{A,B},<null>,{p}}]> but was:<java.lang.Integer[][{{A,B},<null>,{p}}]>
	at org.junit.Assert.assertEquals(Assert.java:115)
	at org.junit.Assert.assertEquals(Assert.java:144)
	at org.apache.commons.lang3.builder.ToStringBuilderTest.testCharArrayArray(ToStringBuilderTest.java:847)

testSelfInstanceVarReflectionObjectCycle(org.apache.commons.lang3.builder.ToStringBuilderTest)  Time elapsed: 0.001 sec  <<< FAILURE!
org.junit.ComparisonFailure: expected:<...eflectionTestFixture[@517a564][typeIsSelf=org.apac...> but was:<...eflectionTestFixture[][typeIsSelf=org.apac...>
	at org.junit.Assert.assertEquals(Assert.java:115)
	at org.junit.Assert.assertEquals(Assert.java:144)
	at org.apache.commons.lang3.builder.ToStringBuilderTest.testSelfInstanceVarReflectionObjectCycle(ToStringBuilderTest.java:539)

testObject(org.apache.commons.lang3.builder.ToStringBuilderTest)  Time elapsed: 0.001 sec  <<< FAILURE!
org.junit.ComparisonFailure: expected:<java.lang.Integer[@dda4f7b][<null>]> but was:<java.lang.Integer[][<null>]>
	at org.junit.Assert.assertEquals(Assert.java:115)
	at org.junit.Assert.assertEquals(Assert.java:144)
	at org.apache.commons.lang3.builder.ToStringBuilderTest.testObject(ToStringBuilderTest.java:623)

testAppendSuper(org.apache.commons.lang3.builder.ToStringBuilderTest)  Time elapsed: 0 sec  <<< FAILURE!
org.junit.ComparisonFailure: expected:<java.lang.Integer[@dda4f7b][]> but was:<java.lang.Integer[][]>
	at org.junit.Assert.assertEquals(Assert.java:115)
	at org.junit.Assert.assertEquals(Assert.java:144)
	at org.apache.commons.lang3.builder.ToStringBuilderTest.testAppendSuper(ToStringBuilderTest.java:601)

testReflectionIntArray(org.apache.commons.lang3.builder.ToStringBuilderTest)  Time elapsed: 0 sec  <<< FAILURE!
org.junit.ComparisonFailure: expected:<[I[@28fed5b1][{1,2,-3,4}]> but was:<[I[][{1,2,-3,4}]>
	at org.junit.Assert.assertEquals(Assert.java:115)
	at org.junit.Assert.assertEquals(Assert.java:144)
	at org.apache.commons.lang3.builder.ToStringBuilderTest.testReflectionIntArray(ToStringBuilderTest.java:178)

testReflectionCharArray(org.apache.commons.lang3.builder.ToStringBuilderTest)  Time elapsed: 0.001 sec  <<< FAILURE!
org.junit.ComparisonFailure: expected:<[C[@727f6c7d][{A,2,_,D}]> but was:<[C[][{A,2,_,D}]>
	at org.junit.Assert.assertEquals(Assert.java:115)
	at org.junit.Assert.assertEquals(Assert.java:144)
	at org.apache.commons.lang3.builder.ToStringBuilderTest.testReflectionCharArray(ToStringBuilderTest.java:205)

testInnerClassReflection(org.apache.commons.lang3.builder.ToStringBuilderTest)  Time elapsed: 0.002 sec  <<< FAILURE!
org.junit.ComparisonFailure: expected:<...ingBuilderTest$Outer[@381702ff[inner=org.apache.commons.lang3.builder.ToStringBuilderTest$Outer$Inner@6ec5d01d][]]> but was:<...ingBuilderTest$Outer[[inner=org.apache.commons.lang3.builder.ToStringBuilderTest$Outer$Inner][]]>
	at org.junit.Assert.assertEquals(Assert.java:115)
	at org.junit.Assert.assertEquals(Assert.java:144)
	at org.apache.commons.lang3.builder.ToStringBuilderTest.testInnerClassReflection(ToStringBuilderTest.java:376)

testReflectionCharacter(org.apache.commons.lang3.builder.ToStringBuilderTest)  Time elapsed: 0.001 sec  <<< FAILURE!
org.junit.ComparisonFailure: expected:<java.lang.Character[@45ef3510][value=A]> but was:<java.lang.Character[][value=A]>
	at org.junit.Assert.assertEquals(Assert.java:115)
	at org.junit.Assert.assertEquals(Assert.java:144)
	at org.apache.commons.lang3.builder.ToStringBuilderTest.testReflectionCharacter(ToStringBuilderTest.java:106)

testDoubleArray(org.apache.commons.lang3.builder.ToStringBuilderTest)  Time elapsed: 0 sec  <<< FAILURE!
org.junit.ComparisonFailure: expected:<java.lang.Integer[@dda4f7b][{1.0,2.9876,-3.0000...> but was:<java.lang.Integer[][{1.0,2.9876,-3.0000...>
	at org.junit.Assert.assertEquals(Assert.java:115)
	at org.junit.Assert.assertEquals(Assert.java:144)
	at org.apache.commons.lang3.builder.ToStringBuilderTest.testDoubleArray(ToStringBuilderTest.java:777)

testReflectionFloatArrayArray(org.apache.commons.lang3.builder.ToStringBuilderTest)  Time elapsed: 0 sec  <<< FAILURE!
org.junit.ComparisonFailure: expected:<[[F[@5b84d14e][{{1.0,2.29686},<nul...> but was:<[[F[][{{1.0,2.29686},<nul...>
	at org.junit.Assert.assertEquals(Assert.java:115)
	at org.junit.Assert.assertEquals(Assert.java:144)
	at org.apache.commons.lang3.builder.ToStringBuilderTest.testReflectionFloatArrayArray(ToStringBuilderTest.java:243)

Running org.apache.commons.lang3.builder.EqualsBuilderTest
Tests run: 48, Failures: 0, Errors: 0, Skipped: 0, Time elapsed: 0.017 sec - in org.apache.commons.lang3.builder.EqualsBuilderTest
Running org.apache.commons.lang3.builder.HashCodeBuilderAndEqualsBuilderTest
Tests run: 4, Failures: 0, Errors: 0, Skipped: 0, Time elapsed: 0.008 sec - in org.apache.commons.lang3.builder.HashCodeBuilderAndEqualsBuilderTest
Running org.apache.commons.lang3.builder.ReflectionToStringBuilderConcurrencyTest
Tests run: 3, Failures: 0, Errors: 0, Skipped: 3, Time elapsed: 0 sec - in org.apache.commons.lang3.builder.ReflectionToStringBuilderConcurrencyTest
Running org.apache.commons.lang3.builder.JsonToStringStyleTest
Tests run: 9, Failures: 0, Errors: 0, Skipped: 0, Time elapsed: 0.003 sec - in org.apache.commons.lang3.builder.JsonToStringStyleTest
Running org.apache.commons.lang3.builder.NoClassNameToStringStyleTest
Tests run: 8, Failures: 0, Errors: 0, Skipped: 0, Time elapsed: 0.002 sec - in org.apache.commons.lang3.builder.NoClassNameToStringStyleTest
Running org.apache.commons.lang3.builder.DiffBuilderTest
Tests run: 30, Failures: 0, Errors: 0, Skipped: 0, Time elapsed: 0.025 sec - in org.apache.commons.lang3.builder.DiffBuilderTest
Running org.apache.commons.lang3.builder.HashCodeBuilderTest
Tests run: 44, Failures: 0, Errors: 0, Skipped: 0, Time elapsed: 0.012 sec - in org.apache.commons.lang3.builder.HashCodeBuilderTest
Running org.apache.commons.lang3.concurrent.AtomicInitializerTest
Tests run: 3, Failures: 0, Errors: 0, Skipped: 0, Time elapsed: 0.002 sec - in org.apache.commons.lang3.concurrent.AtomicInitializerTest
Running org.apache.commons.lang3.concurrent.CallableBackgroundInitializerTest
Tests run: 4, Failures: 0, Errors: 0, Skipped: 0, Time elapsed: 0.002 sec - in org.apache.commons.lang3.concurrent.CallableBackgroundInitializerTest
Running org.apache.commons.lang3.concurrent.BackgroundInitializerTest
Tests run: 15, Failures: 0, Errors: 0, Skipped: 0, Time elapsed: 0.016 sec - in org.apache.commons.lang3.concurrent.BackgroundInitializerTest
Running org.apache.commons.lang3.concurrent.LazyInitializerTest
Tests run: 3, Failures: 0, Errors: 0, Skipped: 0, Time elapsed: 0.008 sec - in org.apache.commons.lang3.concurrent.LazyInitializerTest
Running org.apache.commons.lang3.concurrent.BasicThreadFactoryTest
Tests run: 15, Failures: 0, Errors: 0, Skipped: 0, Time elapsed: 0.036 sec - in org.apache.commons.lang3.concurrent.BasicThreadFactoryTest
Running org.apache.commons.lang3.concurrent.ConstantInitializerTest
Tests run: 7, Failures: 0, Errors: 0, Skipped: 0, Time elapsed: 0 sec - in org.apache.commons.lang3.concurrent.ConstantInitializerTest
Running org.apache.commons.lang3.concurrent.MultiBackgroundInitializerTest
Tests run: 17, Failures: 0, Errors: 0, Skipped: 0, Time elapsed: 0.055 sec - in org.apache.commons.lang3.concurrent.MultiBackgroundInitializerTest
Running org.apache.commons.lang3.concurrent.AtomicSafeInitializerTest
Tests run: 4, Failures: 0, Errors: 0, Skipped: 0, Time elapsed: 0.016 sec - in org.apache.commons.lang3.concurrent.AtomicSafeInitializerTest
Running org.apache.commons.lang3.concurrent.ConcurrentUtilsTest
Tests run: 40, Failures: 0, Errors: 0, Skipped: 0, Time elapsed: 0.011 sec - in org.apache.commons.lang3.concurrent.ConcurrentUtilsTest
Running org.apache.commons.lang3.concurrent.TimedSemaphoreTest
Tests run: 15, Failures: 0, Errors: 0, Skipped: 0, Time elapsed: 1.185 sec - in org.apache.commons.lang3.concurrent.TimedSemaphoreTest
Running org.apache.commons.lang3.StringUtilsSubstringTest
Tests run: 14, Failures: 0, Errors: 0, Skipped: 0, Time elapsed: 0.002 sec - in org.apache.commons.lang3.StringUtilsSubstringTest
Running org.apache.commons.lang3.SystemUtilsTest
Tests run: 12, Failures: 0, Errors: 0, Skipped: 0, Time elapsed: 0.002 sec - in org.apache.commons.lang3.SystemUtilsTest
Running org.apache.commons.lang3.CharRangeTest
Tests run: 16, Failures: 0, Errors: 0, Skipped: 0, Time elapsed: 0.032 sec - in org.apache.commons.lang3.CharRangeTest
Running org.apache.commons.lang3.CharSetTest
Tests run: 14, Failures: 0, Errors: 0, Skipped: 0, Time elapsed: 0.008 sec - in org.apache.commons.lang3.CharSetTest
Running org.apache.commons.lang3.StringUtilsStartsEndsWithTest
Tests run: 6, Failures: 0, Errors: 0, Skipped: 0, Time elapsed: 0.003 sec - in org.apache.commons.lang3.StringUtilsStartsEndsWithTest
Running org.apache.commons.lang3.RandomStringUtilsTest
Tests run: 11, Failures: 0, Errors: 0, Skipped: 0, Time elapsed: 0.039 sec - in org.apache.commons.lang3.RandomStringUtilsTest
Running org.apache.commons.lang3.SerializationUtilsTest
Tests run: 26, Failures: 0, Errors: 0, Skipped: 0, Time elapsed: 0.046 sec - in org.apache.commons.lang3.SerializationUtilsTest
Running org.apache.commons.lang3.time.StopWatchTest
Tests run: 8, Failures: 0, Errors: 0, Skipped: 0, Time elapsed: 4.765 sec - in org.apache.commons.lang3.time.StopWatchTest
Running org.apache.commons.lang3.time.DateUtilsRoundingTest
Tests run: 22, Failures: 0, Errors: 0, Skipped: 0, Time elapsed: 0.17 sec - in org.apache.commons.lang3.time.DateUtilsRoundingTest
Running org.apache.commons.lang3.time.FastDateParserTest
Tests run: 33, Failures: 0, Errors: 0, Skipped: 0, Time elapsed: 1.977 sec - in org.apache.commons.lang3.time.FastDateParserTest
Running org.apache.commons.lang3.time.FastDateFormat_ParserTest
Tests run: 33, Failures: 0, Errors: 0, Skipped: 0, Time elapsed: 0.695 sec - in org.apache.commons.lang3.time.FastDateFormat_ParserTest
Running org.apache.commons.lang3.time.DurationFormatUtilsTest
Tests run: 25, Failures: 0, Errors: 0, Skipped: 0, Time elapsed: 0.773 sec - in org.apache.commons.lang3.time.DurationFormatUtilsTest
Running org.apache.commons.lang3.time.DateFormatUtilsTest
Tests run: 10, Failures: 0, Errors: 0, Skipped: 0, Time elapsed: 0.002 sec - in org.apache.commons.lang3.time.DateFormatUtilsTest
Running org.apache.commons.lang3.time.DateUtilsFragmentTest
Tests run: 57, Failures: 0, Errors: 0, Skipped: 0, Time elapsed: 0.01 sec - in org.apache.commons.lang3.time.DateUtilsFragmentTest
Running org.apache.commons.lang3.time.FastDatePrinterTimeZonesTest
Tests run: 617, Failures: 0, Errors: 0, Skipped: 0, Time elapsed: 0.2 sec - in org.apache.commons.lang3.time.FastDatePrinterTimeZonesTest
Running org.apache.commons.lang3.time.FastDateFormatTest
>>FastDateFormatTest: FastDateParser:33388  SimpleDateFormat:3599
Tests run: 14, Failures: 0, Errors: 0, Skipped: 0, Time elapsed: 4.067 sec - in org.apache.commons.lang3.time.FastDateFormatTest
Running org.apache.commons.lang3.time.FastDateFormat_PrinterTest
Tests run: 17, Failures: 0, Errors: 0, Skipped: 0, Time elapsed: 0.009 sec - in org.apache.commons.lang3.time.FastDateFormat_PrinterTest
Running org.apache.commons.lang3.time.FastDatePrinterTest
Tests run: 17, Failures: 0, Errors: 0, Skipped: 0, Time elapsed: 0.003 sec - in org.apache.commons.lang3.time.FastDatePrinterTest
Running org.apache.commons.lang3.time.FastDateParserSDFTest
Tests run: 276, Failures: 0, Errors: 0, Skipped: 92, Time elapsed: 0.064 sec - in org.apache.commons.lang3.time.FastDateParserSDFTest
Running org.apache.commons.lang3.time.DateUtilsTest
DateUtilsTest: Default Locale=en_US
Tests run: 38, Failures: 0, Errors: 0, Skipped: 0, Time elapsed: 0.021 sec - in org.apache.commons.lang3.time.DateUtilsTest
Running org.apache.commons.lang3.reflect.InheritanceUtilsTest
Tests run: 9, Failures: 0, Errors: 0, Skipped: 0, Time elapsed: 0.003 sec - in org.apache.commons.lang3.reflect.InheritanceUtilsTest
Running org.apache.commons.lang3.reflect.MethodUtilsTest
Tests run: 23, Failures: 0, Errors: 0, Skipped: 0, Time elapsed: 0.035 sec - in org.apache.commons.lang3.reflect.MethodUtilsTest
Running org.apache.commons.lang3.reflect.ConstructorUtilsTest
Tests run: 7, Failures: 0, Errors: 0, Skipped: 0, Time elapsed: 0.008 sec - in org.apache.commons.lang3.reflect.ConstructorUtilsTest
Running org.apache.commons.lang3.reflect.FieldUtilsTest
Tests run: 64, Failures: 0, Errors: 0, Skipped: 0, Time elapsed: 0.029 sec - in org.apache.commons.lang3.reflect.FieldUtilsTest
Running org.apache.commons.lang3.reflect.TypeLiteralTest
Tests run: 4, Failures: 0, Errors: 0, Skipped: 0, Time elapsed: 0.006 sec - in org.apache.commons.lang3.reflect.TypeLiteralTest
Running org.apache.commons.lang3.reflect.TypeUtilsTest
Tests run: 19, Failures: 0, Errors: 0, Skipped: 0, Time elapsed: 0.047 sec - in org.apache.commons.lang3.reflect.TypeUtilsTest
Running org.apache.commons.lang3.mutable.MutableByteTest
Tests run: 17, Failures: 0, Errors: 0, Skipped: 0, Time elapsed: 0.003 sec - in org.apache.commons.lang3.mutable.MutableByteTest
Running org.apache.commons.lang3.mutable.MutableShortTest
Tests run: 14, Failures: 0, Errors: 0, Skipped: 0, Time elapsed: 0.001 sec - in org.apache.commons.lang3.mutable.MutableShortTest
Running org.apache.commons.lang3.mutable.MutableIntTest
Tests run: 17, Failures: 0, Errors: 0, Skipped: 0, Time elapsed: 0.003 sec - in org.apache.commons.lang3.mutable.MutableIntTest
Running org.apache.commons.lang3.mutable.MutableDoubleTest
Tests run: 18, Failures: 0, Errors: 0, Skipped: 0, Time elapsed: 0.003 sec - in org.apache.commons.lang3.mutable.MutableDoubleTest
Running org.apache.commons.lang3.mutable.MutableFloatTest
Tests run: 18, Failures: 0, Errors: 0, Skipped: 0, Time elapsed: 0.004 sec - in org.apache.commons.lang3.mutable.MutableFloatTest
Running org.apache.commons.lang3.mutable.MutableLongTest
Tests run: 17, Failures: 0, Errors: 0, Skipped: 0, Time elapsed: 0.003 sec - in org.apache.commons.lang3.mutable.MutableLongTest
Running org.apache.commons.lang3.mutable.MutableBooleanTest
Tests run: 9, Failures: 0, Errors: 0, Skipped: 0, Time elapsed: 0.001 sec - in org.apache.commons.lang3.mutable.MutableBooleanTest
Running org.apache.commons.lang3.mutable.MutableObjectTest
Tests run: 5, Failures: 0, Errors: 0, Skipped: 0, Time elapsed: 0 sec - in org.apache.commons.lang3.mutable.MutableObjectTest
Running org.apache.commons.lang3.text.translate.UnicodeEscaperTest
Tests run: 3, Failures: 0, Errors: 0, Skipped: 0, Time elapsed: 0 sec - in org.apache.commons.lang3.text.translate.UnicodeEscaperTest
Running org.apache.commons.lang3.text.translate.EntityArraysTest
Tests run: 3, Failures: 0, Errors: 0, Skipped: 0, Time elapsed: 0 sec - in org.apache.commons.lang3.text.translate.EntityArraysTest
Running org.apache.commons.lang3.text.translate.UnicodeUnpairedSurrogateRemoverTest
Tests run: 2, Failures: 0, Errors: 0, Skipped: 0, Time elapsed: 0 sec - in org.apache.commons.lang3.text.translate.UnicodeUnpairedSurrogateRemoverTest
Running org.apache.commons.lang3.text.translate.NumericEntityUnescaperTest
Tests run: 3, Failures: 0, Errors: 0, Skipped: 0, Time elapsed: 0 sec - in org.apache.commons.lang3.text.translate.NumericEntityUnescaperTest
Running org.apache.commons.lang3.text.translate.NumericEntityEscaperTest
Tests run: 4, Failures: 0, Errors: 0, Skipped: 0, Time elapsed: 0 sec - in org.apache.commons.lang3.text.translate.NumericEntityEscaperTest
Running org.apache.commons.lang3.text.translate.LookupTranslatorTest
Tests run: 2, Failures: 0, Errors: 0, Skipped: 0, Time elapsed: 0.001 sec - in org.apache.commons.lang3.text.translate.LookupTranslatorTest
Running org.apache.commons.lang3.text.translate.UnicodeUnescaperTest
Tests run: 3, Failures: 0, Errors: 0, Skipped: 0, Time elapsed: 0 sec - in org.apache.commons.lang3.text.translate.UnicodeUnescaperTest
Running org.apache.commons.lang3.text.translate.OctalUnescaperTest
Tests run: 1, Failures: 0, Errors: 0, Skipped: 0, Time elapsed: 0 sec - in org.apache.commons.lang3.text.translate.OctalUnescaperTest
Running org.apache.commons.lang3.text.StrMatcherTest
Tests run: 14, Failures: 0, Errors: 0, Skipped: 0, Time elapsed: 0.002 sec - in org.apache.commons.lang3.text.StrMatcherTest
Running org.apache.commons.lang3.text.StrTokenizerTest
Tests run: 55, Failures: 0, Errors: 0, Skipped: 0, Time elapsed: 0.011 sec - in org.apache.commons.lang3.text.StrTokenizerTest
Running org.apache.commons.lang3.text.FormattableUtilsTest
Tests run: 5, Failures: 0, Errors: 0, Skipped: 0, Time elapsed: 0 sec - in org.apache.commons.lang3.text.FormattableUtilsTest
Running org.apache.commons.lang3.text.CompositeFormatTest
Tests run: 2, Failures: 0, Errors: 0, Skipped: 0, Time elapsed: 0 sec - in org.apache.commons.lang3.text.CompositeFormatTest
Running org.apache.commons.lang3.text.WordUtilsTest
Tests run: 12, Failures: 0, Errors: 0, Skipped: 0, Time elapsed: 0.003 sec - in org.apache.commons.lang3.text.WordUtilsTest
Running org.apache.commons.lang3.text.StrLookupTest
Tests run: 5, Failures: 0, Errors: 0, Skipped: 0, Time elapsed: 0.002 sec - in org.apache.commons.lang3.text.StrLookupTest
Running org.apache.commons.lang3.text.StrBuilderAppendInsertTest
Tests run: 51, Failures: 0, Errors: 0, Skipped: 0, Time elapsed: 0.009 sec - in org.apache.commons.lang3.text.StrBuilderAppendInsertTest
Running org.apache.commons.lang3.text.ExtendedMessageFormatTest
Tests run: 10, Failures: 0, Errors: 0, Skipped: 0, Time elapsed: 0.758 sec - in org.apache.commons.lang3.text.ExtendedMessageFormatTest
Running org.apache.commons.lang3.text.StrSubstitutorTest
Tests run: 40, Failures: 0, Errors: 0, Skipped: 0, Time elapsed: 0.03 sec - in org.apache.commons.lang3.text.StrSubstitutorTest
Running org.apache.commons.lang3.text.StrBuilderTest
Tests run: 90, Failures: 0, Errors: 0, Skipped: 0, Time elapsed: 0.04 sec - in org.apache.commons.lang3.text.StrBuilderTest
Running org.apache.commons.lang3.StringEscapeUtilsTest
Tests run: 28, Failures: 0, Errors: 0, Skipped: 0, Time elapsed: 0.4 sec - in org.apache.commons.lang3.StringEscapeUtilsTest
Running org.apache.commons.lang3.AnnotationUtilsTest
Tests run: 10, Failures: 0, Errors: 0, Skipped: 0, Time elapsed: 0.022 sec - in org.apache.commons.lang3.AnnotationUtilsTest
Running org.apache.commons.lang3.ConversionTest
Tests run: 42, Failures: 0, Errors: 0, Skipped: 0, Time elapsed: 0.012 sec - in org.apache.commons.lang3.ConversionTest
Running org.apache.commons.lang3.StringUtilsTrimEmptyTest
Tests run: 15, Failures: 0, Errors: 0, Skipped: 0, Time elapsed: 0.005 sec - in org.apache.commons.lang3.StringUtilsTrimEmptyTest
Running org.apache.commons.lang3.EnumUtilsTest
Tests run: 34, Failures: 0, Errors: 0, Skipped: 0, Time elapsed: 0.008 sec - in org.apache.commons.lang3.EnumUtilsTest
Running org.apache.commons.lang3.exception.ExceptionUtilsTest
Tests run: 28, Failures: 0, Errors: 0, Skipped: 0, Time elapsed: 0.025 sec - in org.apache.commons.lang3.exception.ExceptionUtilsTest
Running org.apache.commons.lang3.exception.DefaultExceptionContextTest
Tests run: 8, Failures: 0, Errors: 0, Skipped: 0, Time elapsed: 0.004 sec - in org.apache.commons.lang3.exception.DefaultExceptionContextTest
Running org.apache.commons.lang3.exception.ContextedExceptionTest
Tests run: 14, Failures: 0, Errors: 0, Skipped: 0, Time elapsed: 0.009 sec - in org.apache.commons.lang3.exception.ContextedExceptionTest
Running org.apache.commons.lang3.exception.ContextedRuntimeExceptionTest
Tests run: 14, Failures: 0, Errors: 0, Skipped: 0, Time elapsed: 0.009 sec - in org.apache.commons.lang3.exception.ContextedRuntimeExceptionTest
Running org.apache.commons.lang3.BitFieldTest
Tests run: 15, Failures: 0, Errors: 0, Skipped: 0, Time elapsed: 0.002 sec - in org.apache.commons.lang3.BitFieldTest
Running org.apache.commons.lang3.ArrayUtilsRemoveMultipleTest
Tests run: 55, Failures: 0, Errors: 0, Skipped: 0, Time elapsed: 0.01 sec - in org.apache.commons.lang3.ArrayUtilsRemoveMultipleTest
Running org.apache.commons.lang3.HashSetvBitSetTest
Ratio=8% array=100 count=1 extract=23810910 bitset=1969984
Ratio=14% array=100 count=10 extract=14059311 bitset=1982751
Ratio=8% array=100 count=50 extract=6903205 bitset=579877
Ratio=4% array=100 count=100 extract=10258255 bitset=431661
Ratio=79% array=1000 count=10 extract=6585121 bitset=5252885
Ratio=32% array=1000 count=100 extract=14329780 bitset=4617977
Ratio=7% array=1000 count=500 extract=42010577 bitset=2958936
Ratio=0% array=1000 count=1000 extract=78991130 bitset=740998
Ratio=82% count=0 hash=2960428 bits=2441954
Ratio=5% count=5 hash=3730896 bits=212966
Ratio=14% count=10 hash=2079322 bits=294080
Ratio=22% count=200 hash=18266999 bits=4065629
Ratio=17% count=50 hash=5735210 bits=1016240
Ratio=26% count=100 hash=8821995 bits=2315609
Ratio=22% count=1000 hash=75585469 bits=16762563
Ratio=22% count=2000 hash=144716054 bits=32211830
Tests run: 2, Failures: 0, Errors: 0, Skipped: 0, Time elapsed: 0.637 sec - in org.apache.commons.lang3.HashSetvBitSetTest
Running org.apache.commons.lang3.StringUtilsTest
Tests run: 124, Failures: 0, Errors: 0, Skipped: 0, Time elapsed: 0.123 sec - in org.apache.commons.lang3.StringUtilsTest
Running org.apache.commons.lang3.ArrayUtilsRemoveTest
Tests run: 19, Failures: 0, Errors: 0, Skipped: 0, Time elapsed: 0.001 sec - in org.apache.commons.lang3.ArrayUtilsRemoveTest
Running org.apache.commons.lang3.ObjectUtilsTest
Tests run: 36, Failures: 0, Errors: 0, Skipped: 0, Time elapsed: 0.007 sec - in org.apache.commons.lang3.ObjectUtilsTest
Running org.apache.commons.lang3.ClassPathUtilsTest
Tests run: 13, Failures: 0, Errors: 0, Skipped: 0, Time elapsed: 0.005 sec - in org.apache.commons.lang3.ClassPathUtilsTest
Running org.apache.commons.lang3.math.NumberUtilsTest
Tests run: 91, Failures: 0, Errors: 0, Skipped: 0, Time elapsed: 0.029 sec - in org.apache.commons.lang3.math.NumberUtilsTest
Running org.apache.commons.lang3.math.IEEE754rUtilsTest
Tests run: 3, Failures: 0, Errors: 0, Skipped: 0, Time elapsed: 0 sec - in org.apache.commons.lang3.math.IEEE754rUtilsTest
Running org.apache.commons.lang3.math.FractionTest
Tests run: 25, Failures: 0, Errors: 0, Skipped: 0, Time elapsed: 0.108 sec - in org.apache.commons.lang3.math.FractionTest
Running org.apache.commons.lang3.BooleanUtilsTest
Tests run: 72, Failures: 0, Errors: 0, Skipped: 0, Time elapsed: 0.014 sec - in org.apache.commons.lang3.BooleanUtilsTest
Running org.apache.commons.lang3.CharSequenceUtilsTest
Tests run: 2, Failures: 0, Errors: 0, Skipped: 0, Time elapsed: 0 sec - in org.apache.commons.lang3.CharSequenceUtilsTest
Running org.apache.commons.lang3.CharSetUtilsTest
Tests run: 11, Failures: 0, Errors: 0, Skipped: 0, Time elapsed: 0.001 sec - in org.apache.commons.lang3.CharSetUtilsTest
Running org.apache.commons.lang3.ArrayUtilsAddTest
Tests run: 13, Failures: 0, Errors: 0, Skipped: 0, Time elapsed: 0 sec - in org.apache.commons.lang3.ArrayUtilsAddTest
Running org.apache.commons.lang3.CharEncodingTest
Tests run: 6, Failures: 0, Errors: 0, Skipped: 0, Time elapsed: 0.023 sec - in org.apache.commons.lang3.CharEncodingTest
Running org.apache.commons.lang3.ClassUtilsTest
Tests run: 57, Failures: 0, Errors: 0, Skipped: 0, Time elapsed: 0.019 sec - in org.apache.commons.lang3.ClassUtilsTest
Running org.apache.commons.lang3.RangeTest
Tests run: 24, Failures: 0, Errors: 0, Skipped: 0, Time elapsed: 0.006 sec - in org.apache.commons.lang3.RangeTest
Running org.apache.commons.lang3.event.EventUtilsTest
Tests run: 8, Failures: 0, Errors: 0, Skipped: 0, Time elapsed: 0.014 sec - in org.apache.commons.lang3.event.EventUtilsTest
Running org.apache.commons.lang3.event.EventListenerSupportTest
Tests run: 9, Failures: 0, Errors: 0, Skipped: 0, Time elapsed: 0.021 sec - in org.apache.commons.lang3.event.EventListenerSupportTest
Running org.apache.commons.lang3.ArrayUtilsTest
Tests run: 205, Failures: 0, Errors: 0, Skipped: 0, Time elapsed: 0.044 sec - in org.apache.commons.lang3.ArrayUtilsTest
Running org.apache.commons.lang3.CharUtilsTest
Tests run: 24, Failures: 0, Errors: 0, Skipped: 0, Time elapsed: 0.003 sec - in org.apache.commons.lang3.CharUtilsTest
Running org.apache.commons.lang3.NotImplementedExceptionTest
Tests run: 1, Failures: 0, Errors: 0, Skipped: 0, Time elapsed: 0 sec - in org.apache.commons.lang3.NotImplementedExceptionTest
Running org.apache.commons.lang3.StringUtilsEqualsIndexOfTest
Tests run: 50, Failures: 0, Errors: 0, Skipped: 0, Time elapsed: 0.002 sec - in org.apache.commons.lang3.StringUtilsEqualsIndexOfTest
Running org.apache.commons.lang3.RandomUtilsTest
Tests run: 23, Failures: 0, Errors: 0, Skipped: 0, Time elapsed: 0.001 sec - in org.apache.commons.lang3.RandomUtilsTest

Results :

Failed tests: 
  DefaultToStringStyleTest.testAppendSuper:58 expected:<java.lang.Integer[@dda4f7b][]> but was:<java.lang.Integer[][]>
  DefaultToStringStyleTest.testBlank:53 expected:<java.lang.Integer[@dda4f7b][]> but was:<java.lang.Integer[][]>
  DefaultToStringStyleTest.testLong:96 expected:<java.lang.Integer[@dda4f7b][3]> but was:<java.lang.Integer[][3]>
  DefaultToStringStyleTest.testLongArray:114 expected:<java.lang.Integer[@dda4f7b][{1,2,-3,4}]> but was:<java.lang.Integer[][{1,2,-3,4}]>
  DefaultToStringStyleTest.testLongArrayArray:124 expected:<java.lang.Integer[@dda4f7b][{{1,2},<null>,{5}}]> but was:<java.lang.Integer[][{{1,2},<null>,{5}}]>
  DefaultToStringStyleTest.testObject:70 expected:<java.lang.Integer[@dda4f7b][<null>]> but was:<java.lang.Integer[][<null>]>
  DefaultToStringStyleTest.testObjectArray:104 expected:<java.lang.Integer[@dda4f7b][{<null>,5,{3,6}}]> but was:<java.lang.Integer[][{<null>,5,{3,6}}]>
  DefaultToStringStyleTest.testPerson:91 expected:<...ringStyleTest$Person[@37b79249][name=John Doe,age=3...> but was:<...ringStyleTest$Person[][name=John Doe,age=3...>
  MultiLineToStringStyleTest.testAppendSuper:59 expected:<java.lang.Integer[@dda4f7b][
]> but was:<java.lang.Integer[][
]>
  MultiLineToStringStyleTest.testBlank:54 expected:<java.lang.Integer[@dda4f7b][
]> but was:<java.lang.Integer[][
]>
  MultiLineToStringStyleTest.testLong:97 expected:<java.lang.Integer[@dda4f7b][
  3
]> but was:<java.lang.Integer[][
  3
]>
  MultiLineToStringStyleTest.testLongArray:115 expected:<java.lang.Integer[@dda4f7b][
  {1,2,-3,4}
]> but was:<java.lang.Integer[][
  {1,2,-3,4}
]>
  MultiLineToStringStyleTest.testLongArrayArray:125 expected:<java.lang.Integer[@dda4f7b][
  {{1,2},<null>,{5...> but was:<java.lang.Integer[][
  {{1,2},<null>,{5...>
  MultiLineToStringStyleTest.testObject:71 expected:<java.lang.Integer[@dda4f7b][
  <null>
]> but was:<java.lang.Integer[][
  <null>
]>
  MultiLineToStringStyleTest.testObjectArray:105 expected:<java.lang.Integer[@dda4f7b][
  {<null>,5,{3,6}}...> but was:<java.lang.Integer[][
  {<null>,5,{3,6}}...>
  MultiLineToStringStyleTest.testPerson:92 expected:<...ringStyleTest$Person[@42eb40fe][
  name=Jane Doe
  ...> but was:<...ringStyleTest$Person[][
  name=Jane Doe
  ...>
  MultilineRecursiveToStringStyleTest.boolArray:113 expected:<...StyleTest$WithArrays[@55c96b02][
  boolArray={
    ...> but was:<...StyleTest$WithArrays[][
  boolArray={
    ...>
  MultilineRecursiveToStringStyleTest.charArray:131 expected:<...StyleTest$WithArrays[@359430ca][
  boolArray=<null>...> but was:<...StyleTest$WithArrays[][
  boolArray=<null>...>
  MultilineRecursiveToStringStyleTest.doubleArray:167 expected:<...StyleTest$WithArrays[@3bbce0d6][
  boolArray=<null>...> but was:<...StyleTest$WithArrays[][
  boolArray=<null>...>
  MultilineRecursiveToStringStyleTest.intArray:149 expected:<...StyleTest$WithArrays[@593b8970][
  boolArray=<null>...> but was:<...StyleTest$WithArrays[][
  boolArray=<null>...>
  MultilineRecursiveToStringStyleTest.longArray:185 expected:<...StyleTest$WithArrays[@61bcaeed][
  boolArray=<null>...> but was:<...StyleTest$WithArrays[][
  boolArray=<null>...>
  MultilineRecursiveToStringStyleTest.nestedAndArray:80 expected:<...ingStyleTest$Account[@1d75249c[
  owner=<null>,
  transactions=java.util.ArrayList@75b68cdf{
    org.apache.commons.lang3.builder.MultilineRecursiveToStringStyleTest$Transaction@23dac0d9[
      amount=100.0,
      date=2014.10.14
    ],
    org.apache.commons.lang3.builder.MultilineRecursiveToStringStyleTest$Transaction@6eaaf8f2][
      amount=50.0,...> but was:<...ingStyleTest$Account[[
  owner=<null>,
  transactions=java.util.ArrayList{
    org.apache.commons.lang3.builder.MultilineRecursiveToStringStyleTest$Transaction[
      amount=100.0,
      date=2014.10.14
    ],
    org.apache.commons.lang3.builder.MultilineRecursiveToStringStyleTest$Transaction][
      amount=50.0,...>
  MultilineRecursiveToStringStyleTest.nestedElements:57 expected:<...ngStyleTest$Customer[@7377e4b0[
  name=Douglas Adams,
  bank=org.apache.commons.lang3.builder.MultilineRecursiveToStringStyleTest$Bank@44471a09][
    name=ASF Bank
...> but was:<...ngStyleTest$Customer[[
  name=Douglas Adams,
  bank=org.apache.commons.lang3.builder.MultilineRecursiveToStringStyleTest$Bank][
    name=ASF Bank
...>
  MultilineRecursiveToStringStyleTest.noArray:94 expected:<...StyleTest$WithArrays[@3d0f282][
  boolArray=<null>...> but was:<...StyleTest$WithArrays[][
  boolArray=<null>...>
  MultilineRecursiveToStringStyleTest.simpleObject:42 expected:<...tyleTest$Transaction[@5dcfd078][
  amount=100.0,
  ...> but was:<...tyleTest$Transaction[][
  amount=100.0,
  ...>
  MultilineRecursiveToStringStyleTest.stringArray:203 expected:<...StyleTest$WithArrays[@3096f94][
  boolArray=<null>...> but was:<...StyleTest$WithArrays[][
  boolArray=<null>...>
  NoFieldNamesToStringStyleTest.testAppendSuper:58 expected:<java.lang.Integer[@dda4f7b][]> but was:<java.lang.Integer[][]>
  NoFieldNamesToStringStyleTest.testBlank:53 expected:<java.lang.Integer[@dda4f7b][]> but was:<java.lang.Integer[][]>
  NoFieldNamesToStringStyleTest.testLong:96 expected:<java.lang.Integer[@dda4f7b][3]> but was:<java.lang.Integer[][3]>
  NoFieldNamesToStringStyleTest.testLongArray:114 expected:<java.lang.Integer[@dda4f7b][{1,2,-3,4}]> but was:<java.lang.Integer[][{1,2,-3,4}]>
  NoFieldNamesToStringStyleTest.testLongArrayArray:124 expected:<java.lang.Integer[@dda4f7b][{{1,2},<null>,{5}}]> but was:<java.lang.Integer[][{{1,2},<null>,{5}}]>
  NoFieldNamesToStringStyleTest.testObject:70 expected:<java.lang.Integer[@dda4f7b][<null>]> but was:<java.lang.Integer[][<null>]>
  NoFieldNamesToStringStyleTest.testObjectArray:104 expected:<java.lang.Integer[@dda4f7b][{<null>,5,{3,6}}]> but was:<java.lang.Integer[][{<null>,5,{3,6}}]>
  NoFieldNamesToStringStyleTest.testPerson:91 expected:<...ringStyleTest$Person[@7707d6ae][Ron Paul,72,false]> but was:<...ringStyleTest$Person[][Ron Paul,72,false]>
  RecursiveToStringStyleTest.testAppendSuper:57 expected:<java.lang.Integer[@dda4f7b][]> but was:<java.lang.Integer[][]>
  RecursiveToStringStyleTest.testBlank:52 expected:<java.lang.Integer[@dda4f7b][]> but was:<java.lang.Integer[][]>
  RecursiveToStringStyleTest.testLong:99 expected:<java.lang.Integer[@dda4f7b][3]> but was:<java.lang.Integer[][3]>
  RecursiveToStringStyleTest.testLongArray:117 expected:<java.lang.Integer[@dda4f7b][{1,2,-3,4}]> but was:<java.lang.Integer[][{1,2,-3,4}]>
  RecursiveToStringStyleTest.testLongArrayArray:127 expected:<java.lang.Integer[@dda4f7b][{{1,2},<null>,{5}}]> but was:<java.lang.Integer[][{{1,2},<null>,{5}}]>
  RecursiveToStringStyleTest.testObject:69 expected:<java.lang.Integer[@dda4f7b][<null>]> but was:<java.lang.Integer[][<null>]>
  RecursiveToStringStyleTest.testObjectArray:107 expected:<java.lang.Integer[@dda4f7b][{<null>,5,{3,6}}]> but was:<java.lang.Integer[][{<null>,5,{3,6}}]>
  RecursiveToStringStyleTest.testPerson:93 expected:<...ringStyleTest$Person[@574ff50a[name=John Doe,age=33,smoker=false,job=org.apache.commons.lang3.builder.RecursiveToStringStyleTest$Job@4260904e][title=Manager]]> but was:<...ringStyleTest$Person[[name=John Doe,age=33,smoker=false,job=org.apache.commons.lang3.builder.RecursiveToStringStyleTest$Job][title=Manager]]>
  ToStringBuilderTest.testAppendSuper:601 expected:<java.lang.Integer[@dda4f7b][]> but was:<java.lang.Integer[][]>
  ToStringBuilderTest.testAppendToString:611 expected:<java.lang.Integer[@dda4f7b][]> but was:<java.lang.Integer[][]>
  ToStringBuilderTest.testBlank:89 expected:<java.lang.Integer[@dda4f7b][]> but was:<java.lang.Integer[][]>
  ToStringBuilderTest.testBoolean:708 expected:<java.lang.Integer[@dda4f7b][true]> but was:<java.lang.Integer[][true]>
  ToStringBuilderTest.testBooleanArray:797 expected:<java.lang.Integer[@dda4f7b][{true,false,false}]> but was:<java.lang.Integer[][{true,false,false}]>
  ToStringBuilderTest.testBooleanArrayArray:877 expected:<java.lang.Integer[@dda4f7b][{{true,false},<null...> but was:<java.lang.Integer[][{{true,false},<null...>
  ToStringBuilderTest.testByte:686 expected:<java.lang.Integer[@dda4f7b][3]> but was:<java.lang.Integer[][3]>
  ToStringBuilderTest.testByteArray:757 expected:<java.lang.Integer[@dda4f7b][{1,2,-3,4}]> but was:<java.lang.Integer[][{1,2,-3,4}]>
  ToStringBuilderTest.testByteArrayArray:837 expected:<java.lang.Integer[@dda4f7b][{{1,2},<null>,{5}}]> but was:<java.lang.Integer[][{{1,2},<null>,{5}}]>
  ToStringBuilderTest.testChar:679 expected:<java.lang.Integer[@dda4f7b][A]> but was:<java.lang.Integer[][A]>
  ToStringBuilderTest.testCharArray:767 expected:<java.lang.Integer[@dda4f7b][{A,2,_,D}]> but was:<java.lang.Integer[][{A,2,_,D}]>
  ToStringBuilderTest.testCharArrayArray:847 expected:<java.lang.Integer[@dda4f7b][{{A,B},<null>,{p}}]> but was:<java.lang.Integer[][{{A,B},<null>,{p}}]>
  ToStringBuilderTest.testDouble:694 expected:<java.lang.Integer[@dda4f7b][3.2]> but was:<java.lang.Integer[][3.2]>
  ToStringBuilderTest.testDoubleArray:777 expected:<java.lang.Integer[@dda4f7b][{1.0,2.9876,-3.0000...> but was:<java.lang.Integer[][{1.0,2.9876,-3.0000...>
  ToStringBuilderTest.testDoubleArrayArray:857 expected:<java.lang.Integer[@dda4f7b][{{1.0,2.29686},<nul...> but was:<java.lang.Integer[][{{1.0,2.29686},<nul...>
  ToStringBuilderTest.testFloat:701 expected:<java.lang.Integer[@dda4f7b][3.2]> but was:<java.lang.Integer[][3.2]>
  ToStringBuilderTest.testFloatArray:787 expected:<java.lang.Integer[@dda4f7b][{1.0,2.9876,-3.0000...> but was:<java.lang.Integer[][{1.0,2.9876,-3.0000...>
  ToStringBuilderTest.testFloatArrayArray:867 expected:<java.lang.Integer[@dda4f7b][{{1.0,2.29686},<nul...> but was:<java.lang.Integer[][{{1.0,2.29686},<nul...>
  ToStringBuilderTest.testInheritedReflectionStatics:947 expected:<...nStaticFieldsFixture[@605d9809][staticString2=stati...> but was:<...nStaticFieldsFixture[][staticString2=stati...>
  ToStringBuilderTest.testInnerClassReflection:376 expected:<...ingBuilderTest$Outer[@381702ff[inner=org.apache.commons.lang3.builder.ToStringBuilderTest$Outer$Inner@6ec5d01d][]]> but was:<...ingBuilderTest$Outer[[inner=org.apache.commons.lang3.builder.ToStringBuilderTest$Outer$Inner][]]>
  ToStringBuilderTest.testInt:665 expected:<java.lang.Integer[@dda4f7b][3]> but was:<java.lang.Integer[][3]>
  ToStringBuilderTest.testIntArray:737 expected:<java.lang.Integer[@dda4f7b][{1,2,-3,4}]> but was:<java.lang.Integer[][{1,2,-3,4}]>
  ToStringBuilderTest.testIntArrayArray:817 expected:<java.lang.Integer[@dda4f7b][{{1,2},<null>,{5}}]> but was:<java.lang.Integer[][{{1,2},<null>,{5}}]>
  ToStringBuilderTest.testLong:657 expected:<java.lang.Integer[@dda4f7b][3]> but was:<java.lang.Integer[][3]>
  ToStringBuilderTest.testLongArray:727 expected:<java.lang.Integer[@dda4f7b][{1,2,-3,4}]> but was:<java.lang.Integer[][{1,2,-3,4}]>
  ToStringBuilderTest.testLongArrayArray:807 expected:<java.lang.Integer[@dda4f7b][{{1,2},<null>,{5}}]> but was:<java.lang.Integer[][{{1,2},<null>,{5}}]>
  ToStringBuilderTest.testObject:623 expected:<java.lang.Integer[@dda4f7b][<null>]> but was:<java.lang.Integer[][<null>]>
  ToStringBuilderTest.testObjectArray:717 expected:<java.lang.Integer[@dda4f7b][{<null>,5,{3,6}}]> but was:<java.lang.Integer[][{<null>,5,{3,6}}]>
  ToStringBuilderTest.testObjectBuild:641 expected:<java.lang.Integer[@dda4f7b][<null>]> but was:<java.lang.Integer[][<null>]>
  ToStringBuilderTest.testObjectCycle:892 expected:<...lderTest$ObjectCycle[@73c87405[org.apache.commons.lang3.builder.ToStringBuilderTest$ObjectCycle@6d392fa5][org.apache.commons....> but was:<...lderTest$ObjectCycle[[org.apache.commons.lang3.builder.ToStringBuilderTest$ObjectCycle][org.apache.commons....>
  ToStringBuilderTest.testReflectionArrayAndObjectCycle:576 expected:<[Ljava.lang.Object;[@6c02d7ea[{org.apache.commons.lang3.builder.ToStringBuilderTest$SimpleReflectionTestFixture@2ead7b0c][o=[Ljava.lang.Objec...> but was:<[Ljava.lang.Object;[[{org.apache.commons.lang3.builder.ToStringBuilderTest$SimpleReflectionTestFixture][o=[Ljava.lang.Objec...>
  ToStringBuilderTest.testReflectionArrayArrayCycle:432 expected:<[[Ljava.lang.Object;[@3f14a0de][{{[[Ljava.lang.Obje...> but was:<[[Ljava.lang.Object;[][{{[[Ljava.lang.Obje...>
  ToStringBuilderTest.testReflectionArrayCycle:402 expected:<[Ljava.lang.Object;[@422cac21][{[Ljava.lang.Object...> but was:<[Ljava.lang.Object;[][{[Ljava.lang.Object...>
  ToStringBuilderTest.testReflectionArrayCycleLevel2:416 expected:<[Ljava.lang.Object;[@845ca53][{{[Ljava.lang.Objec...> but was:<[Ljava.lang.Object;[][{{[Ljava.lang.Objec...>
  ToStringBuilderTest.testReflectionBoolean:116 expected:<java.lang.Boolean[@6b6a4b18][value=true]> but was:<java.lang.Boolean[][value=true]>
  ToStringBuilderTest.testReflectionBooleanArray:232 expected:<[Z[@3d8290a3][{true,false,false}]> but was:<[Z[][{true,false,false}]>
  ToStringBuilderTest.testReflectionBooleanArrayArray:307 expected:<[[Z[@1f181935][{{true,false},<null...> but was:<[[Z[][{{true,false},<null...>
  ToStringBuilderTest.testReflectionByteArrayArray:280 expected:<[[B[@20c12654][{{1,2},<null>,{5}}]> but was:<[[B[][{{1,2},<null>,{5}}]>
  ToStringBuilderTest.testReflectionCharArray:205 expected:<[C[@727f6c7d][{A,2,_,D}]> but was:<[C[][{A,2,_,D}]>
  ToStringBuilderTest.testReflectionCharArrayArray:289 expected:<[[C[@7f6968c4][{{A,B},<null>,{p}}]> but was:<[[C[][{{A,B},<null>,{p}}]>
  ToStringBuilderTest.testReflectionCharacter:106 expected:<java.lang.Character[@45ef3510][value=A]> but was:<java.lang.Character[][value=A]>
  ToStringBuilderTest.testReflectionDoubleArray:214 expected:<[D[@3a888c1][{1.0,2.9876,-3.0000...> but was:<[D[][{1.0,2.9876,-3.0000...>
  ToStringBuilderTest.testReflectionDoubleArrayArray:298 expected:<[[D[@741e9d69][{{1.0,2.29686},<nul...> but was:<[[D[][{{1.0,2.29686},<nul...>
  ToStringBuilderTest.testReflectionFloatArray:223 expected:<[F[@42ed8181][{1.0,2.9876,-3.0000...> but was:<[F[][{1.0,2.9876,-3.0000...>
  ToStringBuilderTest.testReflectionFloatArrayArray:243 expected:<[[F[@5b84d14e][{{1.0,2.29686},<nul...> but was:<[[F[][{{1.0,2.29686},<nul...>
  ToStringBuilderTest.testReflectionHierarchy:338 expected:<...flectionTestFixtureA[@79ed3030][a=a]> but was:<...flectionTestFixtureA[][a=a]>
  ToStringBuilderTest.testReflectionIntArray:178 expected:<[I[@28fed5b1][{1,2,-3,4}]> but was:<[I[][{1,2,-3,4}]>
  ToStringBuilderTest.testReflectionIntArrayArray:262 expected:<[[I[@2daa38c7][{{1,2},<null>,{5}}]> but was:<[[I[][{{1,2},<null>,{5}}]>
  ToStringBuilderTest.testReflectionInteger:97 expected:<java.lang.Integer[@dda4f7b][value=5]> but was:<java.lang.Integer[][value=5]>
  ToStringBuilderTest.testReflectionLongArray:169 expected:<[J[@26ed4b7a][{1,2,-3,4}]> but was:<[J[][{1,2,-3,4}]>
  ToStringBuilderTest.testReflectionLongArrayArray:253 expected:<[[J[@2d8cc78][{{1,2},<null>,{5}}]> but was:<[[J[][{{1,2},<null>,{5}}]>
  ToStringBuilderTest.testReflectionObjectArray:160 expected:<[Ljava.lang.Object;[@1594af77][{<null>,5,{3,6}}]> but was:<[Ljava.lang.Object;[][{<null>,5,{3,6}}]>
  ToStringBuilderTest.testReflectionObjectCycle:562 expected:<...ReflectionTestCycleA[@210ad97b[b=org.apache.commons.lang3.builder.ToStringBuilderTest$ReflectionTestCycleB@4f4c2b2f][a=org.apache.common...> but was:<...ReflectionTestCycleA[[b=org.apache.commons.lang3.builder.ToStringBuilderTest$ReflectionTestCycleB][a=org.apache.common...>
  ToStringBuilderTest.testReflectionShortArray:187 expected:<[S[@6ed0cc34][{1,2,-3,4}]> but was:<[S[][{1,2,-3,4}]>
  ToStringBuilderTest.testReflectionStatics:927 expected:<...nStaticFieldsFixture[@409c799b][staticString=static...> but was:<...nStaticFieldsFixture[][staticString=static...>
  ToStringBuilderTest.testReflectionhortArrayArray:271 expected:<[[S[@24f64a8d][{{1,2},<null>,{5}}]> but was:<[[S[][{{1,2},<null>,{5}}]>
  ToStringBuilderTest.testReflectionyteArray:196 expected:<[B[@fd94e60][{1,2,-3,4}]> but was:<[B[][{1,2,-3,4}]>
  ToStringBuilderTest.testSelfInstanceTwoVarsReflectionObjectCycle:549 expected:<...eflectionTestFixture[@3828ef8f][typeIsSelf=org.apac...> but was:<...eflectionTestFixture[][typeIsSelf=org.apac...>
  ToStringBuilderTest.testSelfInstanceVarReflectionObjectCycle:539 expected:<...eflectionTestFixture[@517a564][typeIsSelf=org.apac...> but was:<...eflectionTestFixture[][typeIsSelf=org.apac...>
  ToStringBuilderTest.testShort:672 expected:<java.lang.Integer[@dda4f7b][3]> but was:<java.lang.Integer[][3]>
  ToStringBuilderTest.testShortArray:747 expected:<java.lang.Integer[@dda4f7b][{1,2,-3,4}]> but was:<java.lang.Integer[][{1,2,-3,4}]>
  ToStringBuilderTest.testShortArrayArray:827 expected:<java.lang.Integer[@dda4f7b][{{1,2},<null>,{5}}]> but was:<java.lang.Integer[][{{1,2},<null>,{5}}]>
  ToStringBuilderTest.testSimpleReflectionObjectCycle:530 expected:<...eflectionTestFixture[@8beab46][o=org.apache.common...> but was:<...eflectionTestFixture[][o=org.apache.common...>
  ToStringBuilderTest.testSimpleReflectionStatics:907 expected:<...nStaticFieldsFixture[@317240d9][staticString=static...> but was:<...nStaticFieldsFixture[][staticString=static...>



Tests run: 3526, Failures: 106, Errors: 0, Skipped: 97

[INFO] ------------------------------------------------------------------------
[INFO] BUILD FAILURE
[INFO] ------------------------------------------------------------------------
[INFO] Total time: 33.941s
[INFO] Finished at: Tue Aug 04 08:44:54 BST 2015
[INFO] Final Memory: 23M/412M
[INFO] ------------------------------------------------------------------------
[ERROR] Failed to execute goal org.apache.maven.plugins:maven-surefire-plugin:2.18:test (default-test) on project commons-lang3: There are test failures.
[ERROR] 
[ERROR] Please refer to /home/perham/Study/LittleDarwin/Cases/commons-lang3-3.4-src/target/surefire-reports for the individual test results.
[ERROR] -> [Help 1]
[ERROR] 
[ERROR] To see the full stack trace of the errors, re-run Maven with the -e switch.
[ERROR] Re-run Maven using the -X switch to enable full debug logging.
[ERROR] 
[ERROR] For more information about the errors and possible solutions, please read the following articles:
[ERROR] [Help 1] http://cwiki.apache.org/confluence/display/MAVEN/MojoFailureException
