[INFO] Scanning for projects...
[INFO]                                                                         
[INFO] ------------------------------------------------------------------------
[INFO] Building Apache Commons Lang 3.4
[INFO] ------------------------------------------------------------------------
[INFO] 
[INFO] --- maven-enforcer-plugin:1.3.1:enforce (enforce-maven-3) @ commons-lang3 ---
[INFO] 
[INFO] --- build-helper-maven-plugin:1.8:parse-version (parse-version) @ commons-lang3 ---
[INFO] 
[INFO] --- maven-antrun-plugin:1.8:run (javadoc.resources) @ commons-lang3 ---
[INFO] Executing tasks

main:
[INFO] Executed tasks
[INFO] 
[INFO] --- maven-remote-resources-plugin:1.5:process (default) @ commons-lang3 ---
[INFO] 
[INFO] --- buildnumber-maven-plugin:1.3:create (default) @ commons-lang3 ---
[INFO] Executing: /bin/sh -c cd /home/perham/Study/LittleDarwin/Cases/commons-lang3-3.4-src && svn --non-interactive info
[INFO] Working directory: /home/perham/Study/LittleDarwin/Cases/commons-lang3-3.4-src
[INFO] Storing buildNumber: ?????? at timestamp: 1438674227181
[INFO] Executing: /bin/sh -c cd /home/perham/Study/LittleDarwin/Cases/commons-lang3-3.4-src && svn --non-interactive info
[INFO] Working directory: /home/perham/Study/LittleDarwin/Cases/commons-lang3-3.4-src
[INFO] Storing buildScmBranch: UNKNOWN_BRANCH
[INFO] 
[INFO] --- maven-resources-plugin:2.7:resources (default-resources) @ commons-lang3 ---
[INFO] Using 'ISO-8859-1' encoding to copy filtered resources.
[INFO] Copying 0 resource
[INFO] Copying 2 resources to META-INF
[INFO] 
[INFO] --- maven-compiler-plugin:3.2:compile (default-compile) @ commons-lang3 ---
[INFO] Changes detected - recompiling the module!
[INFO] Compiling 133 source files to /home/perham/Study/LittleDarwin/Cases/commons-lang3-3.4-src/target/classes
[INFO] /home/perham/Study/LittleDarwin/Cases/commons-lang3-3.4-src/src/main/java/org/apache/commons/lang3/SerializationUtils.java: /home/perham/Study/LittleDarwin/Cases/commons-lang3-3.4-src/src/main/java/org/apache/commons/lang3/SerializationUtils.java uses unchecked or unsafe operations.
[INFO] /home/perham/Study/LittleDarwin/Cases/commons-lang3-3.4-src/src/main/java/org/apache/commons/lang3/SerializationUtils.java: Recompile with -Xlint:unchecked for details.
[INFO] 
[INFO] --- maven-bundle-plugin:2.5.3:manifest (bundle-manifest) @ commons-lang3 ---
[INFO] 
[INFO] --- animal-sniffer-maven-plugin:1.13:check (checkAPIcompatibility) @ commons-lang3 ---
[INFO] Checking unresolved references to org.codehaus.mojo.signature:java16:1.0
[INFO] 
[INFO] --- maven-resources-plugin:2.7:testResources (default-testResources) @ commons-lang3 ---
[INFO] Using 'ISO-8859-1' encoding to copy filtered resources.
[INFO] Copying 2 resources
[INFO] Copying 2 resources to META-INF
[INFO] 
[INFO] --- maven-compiler-plugin:3.2:testCompile (default-testCompile) @ commons-lang3 ---
[INFO] Nothing to compile - all classes are up to date
[INFO] 
[INFO] --- maven-surefire-plugin:2.18:test (default-test) @ commons-lang3 ---
[INFO] Surefire report directory: /home/perham/Study/LittleDarwin/Cases/commons-lang3-3.4-src/target/surefire-reports

-------------------------------------------------------
 T E S T S
-------------------------------------------------------
Running org.apache.commons.lang3.ValidateTest
Tests run: 63, Failures: 0, Errors: 0, Skipped: 0, Time elapsed: 0.03 sec - in org.apache.commons.lang3.ValidateTest
Running org.apache.commons.lang3.LocaleUtilsTest
Tests run: 15, Failures: 0, Errors: 0, Skipped: 0, Time elapsed: 0.018 sec - in org.apache.commons.lang3.LocaleUtilsTest
Running org.apache.commons.lang3.tuple.MutableTripleTest
Tests run: 8, Failures: 0, Errors: 0, Skipped: 0, Time elapsed: 0.009 sec - in org.apache.commons.lang3.tuple.MutableTripleTest
Running org.apache.commons.lang3.tuple.TripleTest
Tests run: 10, Failures: 0, Errors: 0, Skipped: 0, Time elapsed: 0.006 sec - in org.apache.commons.lang3.tuple.TripleTest
Running org.apache.commons.lang3.tuple.ImmutablePairTest
Tests run: 6, Failures: 0, Errors: 0, Skipped: 0, Time elapsed: 0 sec - in org.apache.commons.lang3.tuple.ImmutablePairTest
Running org.apache.commons.lang3.tuple.MutablePairTest
Tests run: 8, Failures: 0, Errors: 0, Skipped: 0, Time elapsed: 0 sec - in org.apache.commons.lang3.tuple.MutablePairTest
Running org.apache.commons.lang3.tuple.ImmutableTripleTest
Tests run: 6, Failures: 0, Errors: 0, Skipped: 0, Time elapsed: 0 sec - in org.apache.commons.lang3.tuple.ImmutableTripleTest
Running org.apache.commons.lang3.tuple.PairTest
Tests run: 9, Failures: 0, Errors: 0, Skipped: 0, Time elapsed: 0.001 sec - in org.apache.commons.lang3.tuple.PairTest
Running org.apache.commons.lang3.StringUtilsIsTest
Tests run: 8, Failures: 0, Errors: 0, Skipped: 0, Time elapsed: 0.006 sec - in org.apache.commons.lang3.StringUtilsIsTest
Running org.apache.commons.lang3.JavaVersionTest
Tests run: 3, Failures: 0, Errors: 0, Skipped: 0, Time elapsed: 0 sec - in org.apache.commons.lang3.JavaVersionTest
Running org.apache.commons.lang3.builder.NoFieldNamesToStringStyleTest
Tests run: 8, Failures: 0, Errors: 0, Skipped: 0, Time elapsed: 0.008 sec - in org.apache.commons.lang3.builder.NoFieldNamesToStringStyleTest
Running org.apache.commons.lang3.builder.ShortPrefixToStringStyleTest
Tests run: 8, Failures: 7, Errors: 0, Skipped: 0, Time elapsed: 0.008 sec <<< FAILURE! - in org.apache.commons.lang3.builder.ShortPrefixToStringStyleTest
testObjectArray(org.apache.commons.lang3.builder.ShortPrefixToStringStyleTest)  Time elapsed: 0.005 sec  <<< FAILURE!
org.junit.ComparisonFailure: expected:<Integer[[]{<null>,5,{3,6}}]> but was:<Integer[[null=]{<null>,5,{3,6}}]>
	at org.junit.Assert.assertEquals(Assert.java:115)
	at org.junit.Assert.assertEquals(Assert.java:144)
	at org.apache.commons.lang3.builder.ShortPrefixToStringStyleTest.testObjectArray(ShortPrefixToStringStyleTest.java:104)

testLong(org.apache.commons.lang3.builder.ShortPrefixToStringStyleTest)  Time elapsed: 0 sec  <<< FAILURE!
org.junit.ComparisonFailure: expected:<Integer[[]3]> but was:<Integer[[null=]3]>
	at org.junit.Assert.assertEquals(Assert.java:115)
	at org.junit.Assert.assertEquals(Assert.java:144)
	at org.apache.commons.lang3.builder.ShortPrefixToStringStyleTest.testLong(ShortPrefixToStringStyleTest.java:96)

testLongArrayArray(org.apache.commons.lang3.builder.ShortPrefixToStringStyleTest)  Time elapsed: 0.001 sec  <<< FAILURE!
org.junit.ComparisonFailure: expected:<Integer[[]{{1,2},<null>,{5}}]> but was:<Integer[[null=]{{1,2},<null>,{5}}]>
	at org.junit.Assert.assertEquals(Assert.java:115)
	at org.junit.Assert.assertEquals(Assert.java:144)
	at org.apache.commons.lang3.builder.ShortPrefixToStringStyleTest.testLongArrayArray(ShortPrefixToStringStyleTest.java:124)

testLongArray(org.apache.commons.lang3.builder.ShortPrefixToStringStyleTest)  Time elapsed: 0 sec  <<< FAILURE!
org.junit.ComparisonFailure: expected:<Integer[[]{1,2,-3,4}]> but was:<Integer[[null=]{1,2,-3,4}]>
	at org.junit.Assert.assertEquals(Assert.java:115)
	at org.junit.Assert.assertEquals(Assert.java:144)
	at org.apache.commons.lang3.builder.ShortPrefixToStringStyleTest.testLongArray(ShortPrefixToStringStyleTest.java:114)

testObject(org.apache.commons.lang3.builder.ShortPrefixToStringStyleTest)  Time elapsed: 0.001 sec  <<< FAILURE!
org.junit.ComparisonFailure: expected:<Integer[[]<null>]> but was:<Integer[[null=]<null>]>
	at org.junit.Assert.assertEquals(Assert.java:115)
	at org.junit.Assert.assertEquals(Assert.java:144)
	at org.apache.commons.lang3.builder.ShortPrefixToStringStyleTest.testObject(ShortPrefixToStringStyleTest.java:70)

testPerson(org.apache.commons.lang3.builder.ShortPrefixToStringStyleTest)  Time elapsed: 0 sec  <<< FAILURE!
org.junit.ComparisonFailure: expected:<...ingStyleTest.Person[[name=John Q. Public,age=45,smoker=]true]> but was:<...ingStyleTest.Person[[John Q. Public,45,]true]>
	at org.junit.Assert.assertEquals(Assert.java:115)
	at org.junit.Assert.assertEquals(Assert.java:144)
	at org.apache.commons.lang3.builder.ShortPrefixToStringStyleTest.testPerson(ShortPrefixToStringStyleTest.java:91)

testAppendSuper(org.apache.commons.lang3.builder.ShortPrefixToStringStyleTest)  Time elapsed: 0.001 sec  <<< FAILURE!
org.junit.ComparisonFailure: expected:<Integer[[a=]hello]> but was:<Integer[[]hello]>
	at org.junit.Assert.assertEquals(Assert.java:115)
	at org.junit.Assert.assertEquals(Assert.java:144)
	at org.apache.commons.lang3.builder.ShortPrefixToStringStyleTest.testAppendSuper(ShortPrefixToStringStyleTest.java:61)

Running org.apache.commons.lang3.builder.DiffResultTest
Tests run: 9, Failures: 1, Errors: 0, Skipped: 0, Time elapsed: 0.007 sec <<< FAILURE! - in org.apache.commons.lang3.builder.DiffResultTest
testToStringOutput(org.apache.commons.lang3.builder.DiffResultTest)  Time elapsed: 0.004 sec  <<< FAILURE!
org.junit.ComparisonFailure: expected:<...sultTest.EmptyClass[[test=false] differs from DiffResultTest.EmptyClass[test=]true]> but was:<...sultTest.EmptyClass[[false] differs from DiffResultTest.EmptyClass[]true]>
	at org.junit.Assert.assertEquals(Assert.java:115)
	at org.junit.Assert.assertEquals(Assert.java:144)
	at org.apache.commons.lang3.builder.DiffResultTest.testToStringOutput(DiffResultTest.java:95)

Running org.apache.commons.lang3.builder.CompareToBuilderTest
Tests run: 48, Failures: 0, Errors: 0, Skipped: 0, Time elapsed: 0.019 sec - in org.apache.commons.lang3.builder.CompareToBuilderTest
Running org.apache.commons.lang3.builder.MultilineRecursiveToStringStyleTest
Tests run: 10, Failures: 10, Errors: 0, Skipped: 0, Time elapsed: 0.007 sec <<< FAILURE! - in org.apache.commons.lang3.builder.MultilineRecursiveToStringStyleTest
doubleArray(org.apache.commons.lang3.builder.MultilineRecursiveToStringStyleTest)  Time elapsed: 0 sec  <<< FAILURE!
org.junit.ComparisonFailure: expected:<...hArrays@6d4d203d[
  [boolArray=<null>,
  charArray=<null>,
  intArray=<null>,
  doubleArray={
    1.0,
    2.0
  },
  longArray=<null>,
  stringArray=]<null>
]> but was:<...hArrays@6d4d203d[
  [<null>,
  <null>,
  <null>,
  {
    1.0,
    2.0
  },
  <null>,
  ]<null>
]>
	at org.junit.Assert.assertEquals(Assert.java:115)
	at org.junit.Assert.assertEquals(Assert.java:144)
	at org.apache.commons.lang3.builder.MultilineRecursiveToStringStyleTest.doubleArray(MultilineRecursiveToStringStyleTest.java:167)

stringArray(org.apache.commons.lang3.builder.MultilineRecursiveToStringStyleTest)  Time elapsed: 0 sec  <<< FAILURE!
org.junit.ComparisonFailure: expected:<...hArrays@607c5f1a[
  [boolArray=<null>,
  charArray=<null>,
  intArray=<null>,
  doubleArray=<null>,
  longArray=<null>,
  stringArray=]{
    a,
    A
  }
]> but was:<...hArrays@607c5f1a[
  [<null>,
  <null>,
  <null>,
  <null>,
  <null>,
  ]{
    a,
    A
  }
]>
	at org.junit.Assert.assertEquals(Assert.java:115)
	at org.junit.Assert.assertEquals(Assert.java:144)
	at org.apache.commons.lang3.builder.MultilineRecursiveToStringStyleTest.stringArray(MultilineRecursiveToStringStyleTest.java:203)

simpleObject(org.apache.commons.lang3.builder.MultilineRecursiveToStringStyleTest)  Time elapsed: 0.001 sec  <<< FAILURE!
org.junit.ComparisonFailure: expected:<...saction@767fa665[
  [amount=100.0,
  date=]2014.10.15
]> but was:<...saction@767fa665[
  [100.0,
  ]2014.10.15
]>
	at org.junit.Assert.assertEquals(Assert.java:115)
	at org.junit.Assert.assertEquals(Assert.java:144)
	at org.apache.commons.lang3.builder.MultilineRecursiveToStringStyleTest.simpleObject(MultilineRecursiveToStringStyleTest.java:42)

longArray(org.apache.commons.lang3.builder.MultilineRecursiveToStringStyleTest)  Time elapsed: 0.001 sec  <<< FAILURE!
org.junit.ComparisonFailure: expected:<...hArrays@2a807bbc[
  [boolArray=<null>,
  charArray=<null>,
  intArray=<null>,
  doubleArray=<null>,
  longArray={
    1,
    2
  },
  stringArray=]<null>
]> but was:<...hArrays@2a807bbc[
  [<null>,
  <null>,
  <null>,
  <null>,
  {
    1,
    2
  },
  ]<null>
]>
	at org.junit.Assert.assertEquals(Assert.java:115)
	at org.junit.Assert.assertEquals(Assert.java:144)
	at org.apache.commons.lang3.builder.MultilineRecursiveToStringStyleTest.longArray(MultilineRecursiveToStringStyleTest.java:185)

intArray(org.apache.commons.lang3.builder.MultilineRecursiveToStringStyleTest)  Time elapsed: 0 sec  <<< FAILURE!
org.junit.ComparisonFailure: expected:<...hArrays@53bc45d4[
  [boolArray=<null>,
  charArray=<null>,
  intArray={
    1,
    2
  },
  doubleArray=<null>,
  longArray=<null>,
  stringArray=]<null>
]> but was:<...hArrays@53bc45d4[
  [<null>,
  <null>,
  {
    1,
    2
  },
  <null>,
  <null>,
  ]<null>
]>
	at org.junit.Assert.assertEquals(Assert.java:115)
	at org.junit.Assert.assertEquals(Assert.java:144)
	at org.apache.commons.lang3.builder.MultilineRecursiveToStringStyleTest.intArray(MultilineRecursiveToStringStyleTest.java:149)

nestedAndArray(org.apache.commons.lang3.builder.MultilineRecursiveToStringStyleTest)  Time elapsed: 0.002 sec  <<< FAILURE!
org.junit.ComparisonFailure: expected:<...Account@75b68cdf[
  [owner=<null>,
  transactions=java.util.ArrayList@23dac0d9{
    org.apache.commons.lang3.builder.MultilineRecursiveToStringStyleTest$Transaction@6eaaf8f2[
      amount=100.0,
      date=2014.10.14
    ],
    org.apache.commons.lang3.builder.MultilineRecursiveToStringStyleTest$Transaction@1abe10a1[
      amount=50.0,
      date=]2014.10.15
    ]
  }...> but was:<...Account@75b68cdf[
  [<null>,
  java.util.ArrayList@23dac0d9{
    org.apache.commons.lang3.builder.MultilineRecursiveToStringStyleTest$Transaction@6eaaf8f2[
      100.0,
      2014.10.14
    ],
    org.apache.commons.lang3.builder.MultilineRecursiveToStringStyleTest$Transaction@1abe10a1[
      50.0,
      ]2014.10.15
    ]
  }...>
	at org.junit.Assert.assertEquals(Assert.java:115)
	at org.junit.Assert.assertEquals(Assert.java:144)
	at org.apache.commons.lang3.builder.MultilineRecursiveToStringStyleTest.nestedAndArray(MultilineRecursiveToStringStyleTest.java:80)

charArray(org.apache.commons.lang3.builder.MultilineRecursiveToStringStyleTest)  Time elapsed: 0 sec  <<< FAILURE!
org.junit.ComparisonFailure: expected:<...hArrays@140f3941[
  [boolArray=<null>,
  charArray={
    a,
    A
  },
  intArray=<null>,
  doubleArray=<null>,
  longArray=<null>,
  stringArray=]<null>
]> but was:<...hArrays@140f3941[
  [<null>,
  {
    a,
    A
  },
  <null>,
  <null>,
  <null>,
  ]<null>
]>
	at org.junit.Assert.assertEquals(Assert.java:115)
	at org.junit.Assert.assertEquals(Assert.java:144)
	at org.apache.commons.lang3.builder.MultilineRecursiveToStringStyleTest.charArray(MultilineRecursiveToStringStyleTest.java:131)

nestedElements(org.apache.commons.lang3.builder.MultilineRecursiveToStringStyleTest)  Time elapsed: 0.001 sec  <<< FAILURE!
org.junit.ComparisonFailure: expected:<...ustomer@44471a09[
  [name=Douglas Adams,
  bank=org.apache.commons.lang3.builder.MultilineRecursiveToStringStyleTest$Bank@17fe67e4[
    name=ASF Bank
  ],
  accounts=]<null>
]> but was:<...ustomer@44471a09[
  [Douglas Adams,
  org.apache.commons.lang3.builder.MultilineRecursiveToStringStyleTest$Bank@17fe67e4[
    ASF Bank
  ],
  ]<null>
]>
	at org.junit.Assert.assertEquals(Assert.java:115)
	at org.junit.Assert.assertEquals(Assert.java:144)
	at org.apache.commons.lang3.builder.MultilineRecursiveToStringStyleTest.nestedElements(MultilineRecursiveToStringStyleTest.java:57)

boolArray(org.apache.commons.lang3.builder.MultilineRecursiveToStringStyleTest)  Time elapsed: 0.001 sec  <<< FAILURE!
org.junit.ComparisonFailure: expected:<...hArrays@1a907c4e[
  [boolArray={
    true,
    false,
    true
  },
  charArray=<null>,
  intArray=<null>,
  doubleArray=<null>,
  longArray=<null>,
  stringArray=]<null>
]> but was:<...hArrays@1a907c4e[
  [{
    true,
    false,
    true
  },
  <null>,
  <null>,
  <null>,
  <null>,
  ]<null>
]>
	at org.junit.Assert.assertEquals(Assert.java:115)
	at org.junit.Assert.assertEquals(Assert.java:144)
	at org.apache.commons.lang3.builder.MultilineRecursiveToStringStyleTest.boolArray(MultilineRecursiveToStringStyleTest.java:113)

noArray(org.apache.commons.lang3.builder.MultilineRecursiveToStringStyleTest)  Time elapsed: 0 sec  <<< FAILURE!
org.junit.ComparisonFailure: expected:<...thArrays@ae136c3[
  [boolArray=<null>,
  charArray=<null>,
  intArray=<null>,
  doubleArray=<null>,
  longArray=<null>,
  stringArray=]<null>
]> but was:<...thArrays@ae136c3[
  [<null>,
  <null>,
  <null>,
  <null>,
  <null>,
  ]<null>
]>
	at org.junit.Assert.assertEquals(Assert.java:115)
	at org.junit.Assert.assertEquals(Assert.java:144)
	at org.apache.commons.lang3.builder.MultilineRecursiveToStringStyleTest.noArray(MultilineRecursiveToStringStyleTest.java:94)

Running org.apache.commons.lang3.builder.RecursiveToStringStyleTest
Tests run: 8, Failures: 7, Errors: 0, Skipped: 0, Time elapsed: 0.012 sec <<< FAILURE! - in org.apache.commons.lang3.builder.RecursiveToStringStyleTest
testObjectArray(org.apache.commons.lang3.builder.RecursiveToStringStyleTest)  Time elapsed: 0 sec  <<< FAILURE!
org.junit.ComparisonFailure: expected:<...ng.Integer@77981b57[[]{<null>,5,{3,6}}]> but was:<...ng.Integer@77981b57[[null=]{<null>,5,{3,6}}]>
	at org.junit.Assert.assertEquals(Assert.java:115)
	at org.junit.Assert.assertEquals(Assert.java:144)
	at org.apache.commons.lang3.builder.RecursiveToStringStyleTest.testObjectArray(RecursiveToStringStyleTest.java:107)

testLong(org.apache.commons.lang3.builder.RecursiveToStringStyleTest)  Time elapsed: 0 sec  <<< FAILURE!
org.junit.ComparisonFailure: expected:<...ng.Integer@77981b57[[]3]> but was:<...ng.Integer@77981b57[[null=]3]>
	at org.junit.Assert.assertEquals(Assert.java:115)
	at org.junit.Assert.assertEquals(Assert.java:144)
	at org.apache.commons.lang3.builder.RecursiveToStringStyleTest.testLong(RecursiveToStringStyleTest.java:99)

testLongArrayArray(org.apache.commons.lang3.builder.RecursiveToStringStyleTest)  Time elapsed: 0.001 sec  <<< FAILURE!
org.junit.ComparisonFailure: expected:<...ng.Integer@77981b57[[]{{1,2},<null>,{5}}]> but was:<...ng.Integer@77981b57[[null=]{{1,2},<null>,{5}}]>
	at org.junit.Assert.assertEquals(Assert.java:115)
	at org.junit.Assert.assertEquals(Assert.java:144)
	at org.apache.commons.lang3.builder.RecursiveToStringStyleTest.testLongArrayArray(RecursiveToStringStyleTest.java:127)

testLongArray(org.apache.commons.lang3.builder.RecursiveToStringStyleTest)  Time elapsed: 0 sec  <<< FAILURE!
org.junit.ComparisonFailure: expected:<...ng.Integer@77981b57[[]{1,2,-3,4}]> but was:<...ng.Integer@77981b57[[null=]{1,2,-3,4}]>
	at org.junit.Assert.assertEquals(Assert.java:115)
	at org.junit.Assert.assertEquals(Assert.java:144)
	at org.apache.commons.lang3.builder.RecursiveToStringStyleTest.testLongArray(RecursiveToStringStyleTest.java:117)

testObject(org.apache.commons.lang3.builder.RecursiveToStringStyleTest)  Time elapsed: 0 sec  <<< FAILURE!
org.junit.ComparisonFailure: expected:<...ng.Integer@77981b57[[]<null>]> but was:<...ng.Integer@77981b57[[null=]<null>]>
	at org.junit.Assert.assertEquals(Assert.java:115)
	at org.junit.Assert.assertEquals(Assert.java:144)
	at org.apache.commons.lang3.builder.RecursiveToStringStyleTest.testObject(RecursiveToStringStyleTest.java:69)

testPerson(org.apache.commons.lang3.builder.RecursiveToStringStyleTest)  Time elapsed: 0 sec  <<< FAILURE!
org.junit.ComparisonFailure: expected:<...est$Person@4260904e[[name=John Doe,age=33,smoker=false,job=org.apache.commons.lang3.builder.RecursiveToStringStyleTest$Job@51a212ed[title=]Manager]]> but was:<...est$Person@4260904e[[John Doe,33,false,org.apache.commons.lang3.builder.RecursiveToStringStyleTest$Job@51a212ed[]Manager]]>
	at org.junit.Assert.assertEquals(Assert.java:115)
	at org.junit.Assert.assertEquals(Assert.java:144)
	at org.apache.commons.lang3.builder.RecursiveToStringStyleTest.testPerson(RecursiveToStringStyleTest.java:93)

testAppendSuper(org.apache.commons.lang3.builder.RecursiveToStringStyleTest)  Time elapsed: 0 sec  <<< FAILURE!
org.junit.ComparisonFailure: expected:<...ng.Integer@77981b57[[a=]hello]> but was:<...ng.Integer@77981b57[[]hello]>
	at org.junit.Assert.assertEquals(Assert.java:115)
	at org.junit.Assert.assertEquals(Assert.java:144)
	at org.apache.commons.lang3.builder.RecursiveToStringStyleTest.testAppendSuper(RecursiveToStringStyleTest.java:60)

Running org.apache.commons.lang3.builder.DefaultToStringStyleTest
Tests run: 8, Failures: 7, Errors: 0, Skipped: 0, Time elapsed: 0 sec <<< FAILURE! - in org.apache.commons.lang3.builder.DefaultToStringStyleTest
testObjectArray(org.apache.commons.lang3.builder.DefaultToStringStyleTest)  Time elapsed: 0 sec  <<< FAILURE!
org.junit.ComparisonFailure: expected:<...ng.Integer@77981b57[[]{<null>,5,{3,6}}]> but was:<...ng.Integer@77981b57[[null=]{<null>,5,{3,6}}]>
	at org.junit.Assert.assertEquals(Assert.java:115)
	at org.junit.Assert.assertEquals(Assert.java:144)
	at org.apache.commons.lang3.builder.DefaultToStringStyleTest.testObjectArray(DefaultToStringStyleTest.java:104)

testLong(org.apache.commons.lang3.builder.DefaultToStringStyleTest)  Time elapsed: 0 sec  <<< FAILURE!
org.junit.ComparisonFailure: expected:<...ng.Integer@77981b57[[]3]> but was:<...ng.Integer@77981b57[[null=]3]>
	at org.junit.Assert.assertEquals(Assert.java:115)
	at org.junit.Assert.assertEquals(Assert.java:144)
	at org.apache.commons.lang3.builder.DefaultToStringStyleTest.testLong(DefaultToStringStyleTest.java:96)

testLongArrayArray(org.apache.commons.lang3.builder.DefaultToStringStyleTest)  Time elapsed: 0 sec  <<< FAILURE!
org.junit.ComparisonFailure: expected:<...ng.Integer@77981b57[[]{{1,2},<null>,{5}}]> but was:<...ng.Integer@77981b57[[null=]{{1,2},<null>,{5}}]>
	at org.junit.Assert.assertEquals(Assert.java:115)
	at org.junit.Assert.assertEquals(Assert.java:144)
	at org.apache.commons.lang3.builder.DefaultToStringStyleTest.testLongArrayArray(DefaultToStringStyleTest.java:124)

testLongArray(org.apache.commons.lang3.builder.DefaultToStringStyleTest)  Time elapsed: 0 sec  <<< FAILURE!
org.junit.ComparisonFailure: expected:<...ng.Integer@77981b57[[]{1,2,-3,4}]> but was:<...ng.Integer@77981b57[[null=]{1,2,-3,4}]>
	at org.junit.Assert.assertEquals(Assert.java:115)
	at org.junit.Assert.assertEquals(Assert.java:144)
	at org.apache.commons.lang3.builder.DefaultToStringStyleTest.testLongArray(DefaultToStringStyleTest.java:114)

testObject(org.apache.commons.lang3.builder.DefaultToStringStyleTest)  Time elapsed: 0 sec  <<< FAILURE!
org.junit.ComparisonFailure: expected:<...ng.Integer@77981b57[[]<null>]> but was:<...ng.Integer@77981b57[[null=]<null>]>
	at org.junit.Assert.assertEquals(Assert.java:115)
	at org.junit.Assert.assertEquals(Assert.java:144)
	at org.apache.commons.lang3.builder.DefaultToStringStyleTest.testObject(DefaultToStringStyleTest.java:70)

testPerson(org.apache.commons.lang3.builder.DefaultToStringStyleTest)  Time elapsed: 0 sec  <<< FAILURE!
org.junit.ComparisonFailure: expected:<...est$Person@74e51332[[name=John Doe,age=33,smoker=]false]> but was:<...est$Person@74e51332[[John Doe,33,]false]>
	at org.junit.Assert.assertEquals(Assert.java:115)
	at org.junit.Assert.assertEquals(Assert.java:144)
	at org.apache.commons.lang3.builder.DefaultToStringStyleTest.testPerson(DefaultToStringStyleTest.java:91)

testAppendSuper(org.apache.commons.lang3.builder.DefaultToStringStyleTest)  Time elapsed: 0 sec  <<< FAILURE!
org.junit.ComparisonFailure: expected:<...ng.Integer@77981b57[[a=]hello]> but was:<...ng.Integer@77981b57[[]hello]>
	at org.junit.Assert.assertEquals(Assert.java:115)
	at org.junit.Assert.assertEquals(Assert.java:144)
	at org.apache.commons.lang3.builder.DefaultToStringStyleTest.testAppendSuper(DefaultToStringStyleTest.java:61)

Running org.apache.commons.lang3.builder.ReflectionToStringBuilderExcludeTest
Tests run: 11, Failures: 11, Errors: 0, Skipped: 0, Time elapsed: 0.001 sec <<< FAILURE! - in org.apache.commons.lang3.builder.ReflectionToStringBuilderExcludeTest
test_toStringExcludeEmptyCollection(org.apache.commons.lang3.builder.ReflectionToStringBuilderExcludeTest)  Time elapsed: 0 sec  <<< FAILURE!
java.lang.AssertionError: null
	at org.junit.Assert.fail(Assert.java:86)
	at org.junit.Assert.assertTrue(Assert.java:41)
	at org.junit.Assert.assertTrue(Assert.java:52)
	at org.apache.commons.lang3.builder.ReflectionToStringBuilderExcludeTest.validateNonSecretField(ReflectionToStringBuilderExcludeTest.java:124)
	at org.apache.commons.lang3.builder.ReflectionToStringBuilderExcludeTest.validateSecretFieldPresent(ReflectionToStringBuilderExcludeTest.java:135)
	at org.apache.commons.lang3.builder.ReflectionToStringBuilderExcludeTest.test_toStringExcludeEmptyCollection(ReflectionToStringBuilderExcludeTest.java:108)

test_toStringExcludeArrayWithNull(org.apache.commons.lang3.builder.ReflectionToStringBuilderExcludeTest)  Time elapsed: 0 sec  <<< FAILURE!
java.lang.AssertionError: null
	at org.junit.Assert.fail(Assert.java:86)
	at org.junit.Assert.assertTrue(Assert.java:41)
	at org.junit.Assert.assertTrue(Assert.java:52)
	at org.apache.commons.lang3.builder.ReflectionToStringBuilderExcludeTest.validateNonSecretField(ReflectionToStringBuilderExcludeTest.java:124)
	at org.apache.commons.lang3.builder.ReflectionToStringBuilderExcludeTest.validateSecretFieldPresent(ReflectionToStringBuilderExcludeTest.java:135)
	at org.apache.commons.lang3.builder.ReflectionToStringBuilderExcludeTest.test_toStringExcludeArrayWithNull(ReflectionToStringBuilderExcludeTest.java:65)

test_toStringExcludeArray(org.apache.commons.lang3.builder.ReflectionToStringBuilderExcludeTest)  Time elapsed: 0 sec  <<< FAILURE!
java.lang.AssertionError: null
	at org.junit.Assert.fail(Assert.java:86)
	at org.junit.Assert.assertTrue(Assert.java:41)
	at org.junit.Assert.assertTrue(Assert.java:52)
	at org.apache.commons.lang3.builder.ReflectionToStringBuilderExcludeTest.validateNonSecretField(ReflectionToStringBuilderExcludeTest.java:124)
	at org.apache.commons.lang3.builder.ReflectionToStringBuilderExcludeTest.validateSecretFieldAbsent(ReflectionToStringBuilderExcludeTest.java:130)
	at org.apache.commons.lang3.builder.ReflectionToStringBuilderExcludeTest.test_toStringExcludeArray(ReflectionToStringBuilderExcludeTest.java:59)

test_toStringExcludeNullCollection(org.apache.commons.lang3.builder.ReflectionToStringBuilderExcludeTest)  Time elapsed: 0 sec  <<< FAILURE!
java.lang.AssertionError: null
	at org.junit.Assert.fail(Assert.java:86)
	at org.junit.Assert.assertTrue(Assert.java:41)
	at org.junit.Assert.assertTrue(Assert.java:52)
	at org.apache.commons.lang3.builder.ReflectionToStringBuilderExcludeTest.validateNonSecretField(ReflectionToStringBuilderExcludeTest.java:124)
	at org.apache.commons.lang3.builder.ReflectionToStringBuilderExcludeTest.validateSecretFieldPresent(ReflectionToStringBuilderExcludeTest.java:135)
	at org.apache.commons.lang3.builder.ReflectionToStringBuilderExcludeTest.test_toStringExcludeNullCollection(ReflectionToStringBuilderExcludeTest.java:120)

test_toStringExcludeCollection(org.apache.commons.lang3.builder.ReflectionToStringBuilderExcludeTest)  Time elapsed: 0 sec  <<< FAILURE!
java.lang.AssertionError: null
	at org.junit.Assert.fail(Assert.java:86)
	at org.junit.Assert.assertTrue(Assert.java:41)
	at org.junit.Assert.assertTrue(Assert.java:52)
	at org.apache.commons.lang3.builder.ReflectionToStringBuilderExcludeTest.validateNonSecretField(ReflectionToStringBuilderExcludeTest.java:124)
	at org.apache.commons.lang3.builder.ReflectionToStringBuilderExcludeTest.validateSecretFieldAbsent(ReflectionToStringBuilderExcludeTest.java:130)
	at org.apache.commons.lang3.builder.ReflectionToStringBuilderExcludeTest.test_toStringExcludeCollection(ReflectionToStringBuilderExcludeTest.java:79)

test_toStringExcludeNullArray(org.apache.commons.lang3.builder.ReflectionToStringBuilderExcludeTest)  Time elapsed: 0 sec  <<< FAILURE!
java.lang.AssertionError: null
	at org.junit.Assert.fail(Assert.java:86)
	at org.junit.Assert.assertTrue(Assert.java:41)
	at org.junit.Assert.assertTrue(Assert.java:52)
	at org.apache.commons.lang3.builder.ReflectionToStringBuilderExcludeTest.validateNonSecretField(ReflectionToStringBuilderExcludeTest.java:124)
	at org.apache.commons.lang3.builder.ReflectionToStringBuilderExcludeTest.validateSecretFieldPresent(ReflectionToStringBuilderExcludeTest.java:135)
	at org.apache.commons.lang3.builder.ReflectionToStringBuilderExcludeTest.test_toStringExcludeNullArray(ReflectionToStringBuilderExcludeTest.java:114)

test_toStringExcludeEmptyArray(org.apache.commons.lang3.builder.ReflectionToStringBuilderExcludeTest)  Time elapsed: 0 sec  <<< FAILURE!
java.lang.AssertionError: null
	at org.junit.Assert.fail(Assert.java:86)
	at org.junit.Assert.assertTrue(Assert.java:41)
	at org.junit.Assert.assertTrue(Assert.java:52)
	at org.apache.commons.lang3.builder.ReflectionToStringBuilderExcludeTest.validateNonSecretField(ReflectionToStringBuilderExcludeTest.java:124)
	at org.apache.commons.lang3.builder.ReflectionToStringBuilderExcludeTest.validateSecretFieldPresent(ReflectionToStringBuilderExcludeTest.java:135)
	at org.apache.commons.lang3.builder.ReflectionToStringBuilderExcludeTest.test_toStringExcludeEmptyArray(ReflectionToStringBuilderExcludeTest.java:102)

test_toStringExclude(org.apache.commons.lang3.builder.ReflectionToStringBuilderExcludeTest)  Time elapsed: 0 sec  <<< FAILURE!
java.lang.AssertionError: null
	at org.junit.Assert.fail(Assert.java:86)
	at org.junit.Assert.assertTrue(Assert.java:41)
	at org.junit.Assert.assertTrue(Assert.java:52)
	at org.apache.commons.lang3.builder.ReflectionToStringBuilderExcludeTest.validateNonSecretField(ReflectionToStringBuilderExcludeTest.java:124)
	at org.apache.commons.lang3.builder.ReflectionToStringBuilderExcludeTest.validateSecretFieldAbsent(ReflectionToStringBuilderExcludeTest.java:130)
	at org.apache.commons.lang3.builder.ReflectionToStringBuilderExcludeTest.test_toStringExclude(ReflectionToStringBuilderExcludeTest.java:53)

test_toStringExcludeCollectionWithNulls(org.apache.commons.lang3.builder.ReflectionToStringBuilderExcludeTest)  Time elapsed: 0 sec  <<< FAILURE!
java.lang.AssertionError: null
	at org.junit.Assert.fail(Assert.java:86)
	at org.junit.Assert.assertTrue(Assert.java:41)
	at org.junit.Assert.assertTrue(Assert.java:52)
	at org.apache.commons.lang3.builder.ReflectionToStringBuilderExcludeTest.validateNonSecretField(ReflectionToStringBuilderExcludeTest.java:124)
	at org.apache.commons.lang3.builder.ReflectionToStringBuilderExcludeTest.validateSecretFieldPresent(ReflectionToStringBuilderExcludeTest.java:135)
	at org.apache.commons.lang3.builder.ReflectionToStringBuilderExcludeTest.test_toStringExcludeCollectionWithNulls(ReflectionToStringBuilderExcludeTest.java:96)

test_toStringExcludeArrayWithNulls(org.apache.commons.lang3.builder.ReflectionToStringBuilderExcludeTest)  Time elapsed: 0 sec  <<< FAILURE!
java.lang.AssertionError: null
	at org.junit.Assert.fail(Assert.java:86)
	at org.junit.Assert.assertTrue(Assert.java:41)
	at org.junit.Assert.assertTrue(Assert.java:52)
	at org.apache.commons.lang3.builder.ReflectionToStringBuilderExcludeTest.validateNonSecretField(ReflectionToStringBuilderExcludeTest.java:124)
	at org.apache.commons.lang3.builder.ReflectionToStringBuilderExcludeTest.validateSecretFieldPresent(ReflectionToStringBuilderExcludeTest.java:135)
	at org.apache.commons.lang3.builder.ReflectionToStringBuilderExcludeTest.test_toStringExcludeArrayWithNulls(ReflectionToStringBuilderExcludeTest.java:71)

test_toStringExcludeCollectionWithNull(org.apache.commons.lang3.builder.ReflectionToStringBuilderExcludeTest)  Time elapsed: 0 sec  <<< FAILURE!
java.lang.AssertionError: null
	at org.junit.Assert.fail(Assert.java:86)
	at org.junit.Assert.assertTrue(Assert.java:41)
	at org.junit.Assert.assertTrue(Assert.java:52)
	at org.apache.commons.lang3.builder.ReflectionToStringBuilderExcludeTest.validateNonSecretField(ReflectionToStringBuilderExcludeTest.java:124)
	at org.apache.commons.lang3.builder.ReflectionToStringBuilderExcludeTest.validateSecretFieldPresent(ReflectionToStringBuilderExcludeTest.java:135)
	at org.apache.commons.lang3.builder.ReflectionToStringBuilderExcludeTest.test_toStringExcludeCollectionWithNull(ReflectionToStringBuilderExcludeTest.java:87)

Running org.apache.commons.lang3.builder.StandardToStringStyleTest
Tests run: 8, Failures: 7, Errors: 0, Skipped: 0, Time elapsed: 0.001 sec <<< FAILURE! - in org.apache.commons.lang3.builder.StandardToStringStyleTest
testObjectArray(org.apache.commons.lang3.builder.StandardToStringStyleTest)  Time elapsed: 0 sec  <<< FAILURE!
org.junit.ComparisonFailure: expected:<Integer[[][%NULL%, 5, [3, 6]]]> but was:<Integer[[null=][%NULL%, 5, [3, 6]]]>
	at org.junit.Assert.assertEquals(Assert.java:115)
	at org.junit.Assert.assertEquals(Assert.java:144)
	at org.apache.commons.lang3.builder.StandardToStringStyleTest.testObjectArray(StandardToStringStyleTest.java:119)

testLong(org.apache.commons.lang3.builder.StandardToStringStyleTest)  Time elapsed: 0 sec  <<< FAILURE!
org.junit.ComparisonFailure: expected:<Integer[[]3]> but was:<Integer[[null=]3]>
	at org.junit.Assert.assertEquals(Assert.java:115)
	at org.junit.Assert.assertEquals(Assert.java:144)
	at org.apache.commons.lang3.builder.StandardToStringStyleTest.testLong(StandardToStringStyleTest.java:111)

testLongArrayArray(org.apache.commons.lang3.builder.StandardToStringStyleTest)  Time elapsed: 0 sec  <<< FAILURE!
org.junit.ComparisonFailure: expected:<Integer[[][[1, 2], %NULL%, [5]...> but was:<Integer[[null=][[1, 2], %NULL%, [5]...>
	at org.junit.Assert.assertEquals(Assert.java:115)
	at org.junit.Assert.assertEquals(Assert.java:144)
	at org.apache.commons.lang3.builder.StandardToStringStyleTest.testLongArrayArray(StandardToStringStyleTest.java:139)

testLongArray(org.apache.commons.lang3.builder.StandardToStringStyleTest)  Time elapsed: 0 sec  <<< FAILURE!
org.junit.ComparisonFailure: expected:<Integer[[][1, 2, -3, 4]]> but was:<Integer[[null=][1, 2, -3, 4]]>
	at org.junit.Assert.assertEquals(Assert.java:115)
	at org.junit.Assert.assertEquals(Assert.java:144)
	at org.apache.commons.lang3.builder.StandardToStringStyleTest.testLongArray(StandardToStringStyleTest.java:129)

testObject(org.apache.commons.lang3.builder.StandardToStringStyleTest)  Time elapsed: 0 sec  <<< FAILURE!
org.junit.ComparisonFailure: expected:<Integer[[]%NULL%]> but was:<Integer[[null=]%NULL%]>
	at org.junit.Assert.assertEquals(Assert.java:115)
	at org.junit.Assert.assertEquals(Assert.java:144)
	at org.apache.commons.lang3.builder.StandardToStringStyleTest.testObject(StandardToStringStyleTest.java:85)

testPerson(org.apache.commons.lang3.builder.StandardToStringStyleTest)  Time elapsed: 0 sec  <<< FAILURE!
org.junit.ComparisonFailure: expected:<...ingStyleTest.Person[[name=Suzy Queue,age=19,smoker=]false]> but was:<...ingStyleTest.Person[[Suzy Queue,19,]false]>
	at org.junit.Assert.assertEquals(Assert.java:115)
	at org.junit.Assert.assertEquals(Assert.java:144)
	at org.apache.commons.lang3.builder.StandardToStringStyleTest.testPerson(StandardToStringStyleTest.java:106)

testAppendSuper(org.apache.commons.lang3.builder.StandardToStringStyleTest)  Time elapsed: 0 sec  <<< FAILURE!
org.junit.ComparisonFailure: expected:<Integer[[a=]hello]> but was:<Integer[[]hello]>
	at org.junit.Assert.assertEquals(Assert.java:115)
	at org.junit.Assert.assertEquals(Assert.java:144)
	at org.apache.commons.lang3.builder.StandardToStringStyleTest.testAppendSuper(StandardToStringStyleTest.java:76)

Running org.apache.commons.lang3.builder.ToStringStyleTest
Tests run: 12, Failures: 0, Errors: 0, Skipped: 0, Time elapsed: 0.001 sec - in org.apache.commons.lang3.builder.ToStringStyleTest
Running org.apache.commons.lang3.builder.DiffTest
Tests run: 4, Failures: 0, Errors: 0, Skipped: 0, Time elapsed: 0.001 sec - in org.apache.commons.lang3.builder.DiffTest
Running org.apache.commons.lang3.builder.SimpleToStringStyleTest
Tests run: 8, Failures: 0, Errors: 0, Skipped: 0, Time elapsed: 0.001 sec - in org.apache.commons.lang3.builder.SimpleToStringStyleTest
Running org.apache.commons.lang3.builder.MultiLineToStringStyleTest
Tests run: 8, Failures: 7, Errors: 0, Skipped: 0, Time elapsed: 0.001 sec <<< FAILURE! - in org.apache.commons.lang3.builder.MultiLineToStringStyleTest
testObjectArray(org.apache.commons.lang3.builder.MultiLineToStringStyleTest)  Time elapsed: 0 sec  <<< FAILURE!
org.junit.ComparisonFailure: expected:<...Integer@77981b57[
  []{<null>,5,{3,6}}
]> but was:<...Integer@77981b57[
  [null=]{<null>,5,{3,6}}
]>
	at org.junit.Assert.assertEquals(Assert.java:115)
	at org.junit.Assert.assertEquals(Assert.java:144)
	at org.apache.commons.lang3.builder.MultiLineToStringStyleTest.testObjectArray(MultiLineToStringStyleTest.java:105)

testLong(org.apache.commons.lang3.builder.MultiLineToStringStyleTest)  Time elapsed: 0 sec  <<< FAILURE!
org.junit.ComparisonFailure: expected:<...Integer@77981b57[
  []3
]> but was:<...Integer@77981b57[
  [null=]3
]>
	at org.junit.Assert.assertEquals(Assert.java:115)
	at org.junit.Assert.assertEquals(Assert.java:144)
	at org.apache.commons.lang3.builder.MultiLineToStringStyleTest.testLong(MultiLineToStringStyleTest.java:97)

testLongArrayArray(org.apache.commons.lang3.builder.MultiLineToStringStyleTest)  Time elapsed: 0 sec  <<< FAILURE!
org.junit.ComparisonFailure: expected:<...Integer@77981b57[
  []{{1,2},<null>,{5}}
]> but was:<...Integer@77981b57[
  [null=]{{1,2},<null>,{5}}
]>
	at org.junit.Assert.assertEquals(Assert.java:115)
	at org.junit.Assert.assertEquals(Assert.java:144)
	at org.apache.commons.lang3.builder.MultiLineToStringStyleTest.testLongArrayArray(MultiLineToStringStyleTest.java:125)

testLongArray(org.apache.commons.lang3.builder.MultiLineToStringStyleTest)  Time elapsed: 0 sec  <<< FAILURE!
org.junit.ComparisonFailure: expected:<...Integer@77981b57[
  []{1,2,-3,4}
]> but was:<...Integer@77981b57[
  [null=]{1,2,-3,4}
]>
	at org.junit.Assert.assertEquals(Assert.java:115)
	at org.junit.Assert.assertEquals(Assert.java:144)
	at org.apache.commons.lang3.builder.MultiLineToStringStyleTest.testLongArray(MultiLineToStringStyleTest.java:115)

testObject(org.apache.commons.lang3.builder.MultiLineToStringStyleTest)  Time elapsed: 0 sec  <<< FAILURE!
org.junit.ComparisonFailure: expected:<...Integer@77981b57[
  []<null>
]> but was:<...Integer@77981b57[
  [null=]<null>
]>
	at org.junit.Assert.assertEquals(Assert.java:115)
	at org.junit.Assert.assertEquals(Assert.java:144)
	at org.apache.commons.lang3.builder.MultiLineToStringStyleTest.testObject(MultiLineToStringStyleTest.java:71)

testPerson(org.apache.commons.lang3.builder.MultiLineToStringStyleTest)  Time elapsed: 0 sec  <<< FAILURE!
org.junit.ComparisonFailure: expected:<...$Person@598d406b[
  [name=Jane Doe
  age=25
  smoker=]true
]> but was:<...$Person@598d406b[
  [Jane Doe
  25
  ]true
]>
	at org.junit.Assert.assertEquals(Assert.java:115)
	at org.junit.Assert.assertEquals(Assert.java:144)
	at org.apache.commons.lang3.builder.MultiLineToStringStyleTest.testPerson(MultiLineToStringStyleTest.java:92)

testAppendSuper(org.apache.commons.lang3.builder.MultiLineToStringStyleTest)  Time elapsed: 0 sec  <<< FAILURE!
org.junit.ComparisonFailure: expected:<...Integer@77981b57[
  [a=]hello
]> but was:<...Integer@77981b57[
  []hello
]>
	at org.junit.Assert.assertEquals(Assert.java:115)
	at org.junit.Assert.assertEquals(Assert.java:144)
	at org.apache.commons.lang3.builder.MultiLineToStringStyleTest.testAppendSuper(MultiLineToStringStyleTest.java:62)

Running org.apache.commons.lang3.builder.ToStringStyleConcurrencyTest
Tests run: 3, Failures: 0, Errors: 0, Skipped: 0, Time elapsed: 4.012 sec - in org.apache.commons.lang3.builder.ToStringStyleConcurrencyTest
Running org.apache.commons.lang3.builder.ReflectionToStringBuilderMutateInspectConcurrencyTest
Tests run: 1, Failures: 0, Errors: 0, Skipped: 1, Time elapsed: 0 sec - in org.apache.commons.lang3.builder.ReflectionToStringBuilderMutateInspectConcurrencyTest
Running org.apache.commons.lang3.builder.ToStringBuilderTest
Tests run: 74, Failures: 43, Errors: 0, Skipped: 1, Time elapsed: 0.054 sec <<< FAILURE! - in org.apache.commons.lang3.builder.ToStringBuilderTest
testCharArray(org.apache.commons.lang3.builder.ToStringBuilderTest)  Time elapsed: 0.001 sec  <<< FAILURE!
org.junit.ComparisonFailure: expected:<...ng.Integer@77981b57[[]{A,2,_,D}]> but was:<...ng.Integer@77981b57[[null=]{A,2,_,D}]>
	at org.junit.Assert.assertEquals(Assert.java:115)
	at org.junit.Assert.assertEquals(Assert.java:144)
	at org.apache.commons.lang3.builder.ToStringBuilderTest.testCharArray(ToStringBuilderTest.java:767)

testDoubleArrayArray(org.apache.commons.lang3.builder.ToStringBuilderTest)  Time elapsed: 0 sec  <<< FAILURE!
org.junit.ComparisonFailure: expected:<...ng.Integer@77981b57[[]{{1.0,2.29686},<null...> but was:<...ng.Integer@77981b57[[null=]{{1.0,2.29686},<null...>
	at org.junit.Assert.assertEquals(Assert.java:115)
	at org.junit.Assert.assertEquals(Assert.java:144)
	at org.apache.commons.lang3.builder.ToStringBuilderTest.testDoubleArrayArray(ToStringBuilderTest.java:857)

testReflectionBoolean(org.apache.commons.lang3.builder.ToStringBuilderTest)  Time elapsed: 0.001 sec  <<< FAILURE!
org.junit.ComparisonFailure: expected:<...ang.Boolean@8453227[[value=]true]> but was:<...ang.Boolean@8453227[[]true]>
	at org.junit.Assert.assertEquals(Assert.java:115)
	at org.junit.Assert.assertEquals(Assert.java:144)
	at org.apache.commons.lang3.builder.ToStringBuilderTest.testReflectionBoolean(ToStringBuilderTest.java:116)

testObjectArray(org.apache.commons.lang3.builder.ToStringBuilderTest)  Time elapsed: 0.001 sec  <<< FAILURE!
org.junit.ComparisonFailure: expected:<...ng.Integer@77981b57[[]{<null>,5,{3,6}}]> but was:<...ng.Integer@77981b57[[null=]{<null>,5,{3,6}}]>
	at org.junit.Assert.assertEquals(Assert.java:115)
	at org.junit.Assert.assertEquals(Assert.java:144)
	at org.apache.commons.lang3.builder.ToStringBuilderTest.testObjectArray(ToStringBuilderTest.java:717)

testObjectBuild(org.apache.commons.lang3.builder.ToStringBuilderTest)  Time elapsed: 0 sec  <<< FAILURE!
org.junit.ComparisonFailure: expected:<...ng.Integer@77981b57[[]<null>]> but was:<...ng.Integer@77981b57[[null=]<null>]>
	at org.junit.Assert.assertEquals(Assert.java:115)
	at org.junit.Assert.assertEquals(Assert.java:144)
	at org.apache.commons.lang3.builder.ToStringBuilderTest.testObjectBuild(ToStringBuilderTest.java:641)

testObjectCycle(org.apache.commons.lang3.builder.ToStringBuilderTest)  Time elapsed: 0.001 sec  <<< FAILURE!
org.junit.ComparisonFailure: expected:<...bjectCycle@60c40bac[[org.apache.commons.lang3.builder.ToStringBuilderTest$ObjectCycle@66da7ad5[]org.apache.commons.l...> but was:<...bjectCycle@60c40bac[[null=org.apache.commons.lang3.builder.ToStringBuilderTest$ObjectCycle@66da7ad5[null=]org.apache.commons.l...>
	at org.junit.Assert.assertEquals(Assert.java:115)
	at org.junit.Assert.assertEquals(Assert.java:144)
	at org.apache.commons.lang3.builder.ToStringBuilderTest.testObjectCycle(ToStringBuilderTest.java:892)

testReflectionHierarchy(org.apache.commons.lang3.builder.ToStringBuilderTest)  Time elapsed: 0.001 sec  <<< FAILURE!
org.junit.ComparisonFailure: expected:<...tFixtureA@5f175881[a[=a]]> but was:<...tFixtureA@5f175881[a[]]>
	at org.junit.Assert.assertEquals(Assert.java:115)
	at org.junit.Assert.assertEquals(Assert.java:144)
	at org.apache.commons.lang3.builder.ToStringBuilderTest.testReflectionHierarchy(ToStringBuilderTest.java:338)

testSelfInstanceTwoVarsReflectionObjectCycle(org.apache.commons.lang3.builder.ToStringBuilderTest)  Time elapsed: 0.001 sec  <<< FAILURE!
org.junit.ComparisonFailure: expected:<...estFixture@6f7331c4[[typeIsSelf=org.apache.commons.lang3.builder.ToStringBuilderTest$SelfInstanceTwoVarsReflectionTestFixture@6f7331c4,otherType=]The Other Type]> but was:<...estFixture@6f7331c4[[org.apache.commons.lang3.builder.ToStringBuilderTest$SelfInstanceTwoVarsReflectionTestFixture@6f7331c4,]The Other Type]>
	at org.junit.Assert.assertEquals(Assert.java:115)
	at org.junit.Assert.assertEquals(Assert.java:144)
	at org.apache.commons.lang3.builder.ToStringBuilderTest.testSelfInstanceTwoVarsReflectionObjectCycle(ToStringBuilderTest.java:549)

testShortArrayArray(org.apache.commons.lang3.builder.ToStringBuilderTest)  Time elapsed: 0 sec  <<< FAILURE!
org.junit.ComparisonFailure: expected:<...ng.Integer@77981b57[[]{{1,2},<null>,{5}}]> but was:<...ng.Integer@77981b57[[null=]{{1,2},<null>,{5}}]>
	at org.junit.Assert.assertEquals(Assert.java:115)
	at org.junit.Assert.assertEquals(Assert.java:144)
	at org.apache.commons.lang3.builder.ToStringBuilderTest.testShortArrayArray(ToStringBuilderTest.java:827)

testBooleanArrayArray(org.apache.commons.lang3.builder.ToStringBuilderTest)  Time elapsed: 0.001 sec  <<< FAILURE!
org.junit.ComparisonFailure: expected:<...ng.Integer@77981b57[[]{{true,false},<null>...> but was:<...ng.Integer@77981b57[[null=]{{true,false},<null>...>
	at org.junit.Assert.assertEquals(Assert.java:115)
	at org.junit.Assert.assertEquals(Assert.java:144)
	at org.apache.commons.lang3.builder.ToStringBuilderTest.testBooleanArrayArray(ToStringBuilderTest.java:877)

testFloatArray(org.apache.commons.lang3.builder.ToStringBuilderTest)  Time elapsed: 0 sec  <<< FAILURE!
org.junit.ComparisonFailure: expected:<...ng.Integer@77981b57[[]{1.0,2.9876,-3.00001...> but was:<...ng.Integer@77981b57[[null=]{1.0,2.9876,-3.00001...>
	at org.junit.Assert.assertEquals(Assert.java:115)
	at org.junit.Assert.assertEquals(Assert.java:144)
	at org.apache.commons.lang3.builder.ToStringBuilderTest.testFloatArray(ToStringBuilderTest.java:787)

testInt(org.apache.commons.lang3.builder.ToStringBuilderTest)  Time elapsed: 0.001 sec  <<< FAILURE!
org.junit.ComparisonFailure: expected:<...ng.Integer@77981b57[[]3]> but was:<...ng.Integer@77981b57[[null=]3]>
	at org.junit.Assert.assertEquals(Assert.java:115)
	at org.junit.Assert.assertEquals(Assert.java:144)
	at org.apache.commons.lang3.builder.ToStringBuilderTest.testInt(ToStringBuilderTest.java:665)

testByteArray(org.apache.commons.lang3.builder.ToStringBuilderTest)  Time elapsed: 0 sec  <<< FAILURE!
org.junit.ComparisonFailure: expected:<...ng.Integer@77981b57[[]{1,2,-3,4}]> but was:<...ng.Integer@77981b57[[null=]{1,2,-3,4}]>
	at org.junit.Assert.assertEquals(Assert.java:115)
	at org.junit.Assert.assertEquals(Assert.java:144)
	at org.apache.commons.lang3.builder.ToStringBuilderTest.testByteArray(ToStringBuilderTest.java:757)

testFloat(org.apache.commons.lang3.builder.ToStringBuilderTest)  Time elapsed: 0.001 sec  <<< FAILURE!
org.junit.ComparisonFailure: expected:<...ng.Integer@77981b57[[]3.2]> but was:<...ng.Integer@77981b57[[null=]3.2]>
	at org.junit.Assert.assertEquals(Assert.java:115)
	at org.junit.Assert.assertEquals(Assert.java:144)
	at org.apache.commons.lang3.builder.ToStringBuilderTest.testFloat(ToStringBuilderTest.java:701)

testShort(org.apache.commons.lang3.builder.ToStringBuilderTest)  Time elapsed: 0.001 sec  <<< FAILURE!
org.junit.ComparisonFailure: expected:<...ng.Integer@77981b57[[]3]> but was:<...ng.Integer@77981b57[[null=]3]>
	at org.junit.Assert.assertEquals(Assert.java:115)
	at org.junit.Assert.assertEquals(Assert.java:144)
	at org.apache.commons.lang3.builder.ToStringBuilderTest.testShort(ToStringBuilderTest.java:672)

testByte(org.apache.commons.lang3.builder.ToStringBuilderTest)  Time elapsed: 0.001 sec  <<< FAILURE!
org.junit.ComparisonFailure: expected:<...ng.Integer@77981b57[[]3]> but was:<...ng.Integer@77981b57[[null=]3]>
	at org.junit.Assert.assertEquals(Assert.java:115)
	at org.junit.Assert.assertEquals(Assert.java:144)
	at org.apache.commons.lang3.builder.ToStringBuilderTest.testByte(ToStringBuilderTest.java:686)

testChar(org.apache.commons.lang3.builder.ToStringBuilderTest)  Time elapsed: 0 sec  <<< FAILURE!
org.junit.ComparisonFailure: expected:<...ng.Integer@77981b57[[]A]> but was:<...ng.Integer@77981b57[[null=]A]>
	at org.junit.Assert.assertEquals(Assert.java:115)
	at org.junit.Assert.assertEquals(Assert.java:144)
	at org.apache.commons.lang3.builder.ToStringBuilderTest.testChar(ToStringBuilderTest.java:679)

testLong(org.apache.commons.lang3.builder.ToStringBuilderTest)  Time elapsed: 0 sec  <<< FAILURE!
org.junit.ComparisonFailure: expected:<...ng.Integer@77981b57[[]3]> but was:<...ng.Integer@77981b57[[null=]3]>
	at org.junit.Assert.assertEquals(Assert.java:115)
	at org.junit.Assert.assertEquals(Assert.java:144)
	at org.apache.commons.lang3.builder.ToStringBuilderTest.testLong(ToStringBuilderTest.java:657)

testLongArrayArray(org.apache.commons.lang3.builder.ToStringBuilderTest)  Time elapsed: 0 sec  <<< FAILURE!
org.junit.ComparisonFailure: expected:<...ng.Integer@77981b57[[]{{1,2},<null>,{5}}]> but was:<...ng.Integer@77981b57[[null=]{{1,2},<null>,{5}}]>
	at org.junit.Assert.assertEquals(Assert.java:115)
	at org.junit.Assert.assertEquals(Assert.java:144)
	at org.apache.commons.lang3.builder.ToStringBuilderTest.testLongArrayArray(ToStringBuilderTest.java:807)

testBoolean(org.apache.commons.lang3.builder.ToStringBuilderTest)  Time elapsed: 0 sec  <<< FAILURE!
org.junit.ComparisonFailure: expected:<...ng.Integer@77981b57[[]true]> but was:<...ng.Integer@77981b57[[null=]true]>
	at org.junit.Assert.assertEquals(Assert.java:115)
	at org.junit.Assert.assertEquals(Assert.java:144)
	at org.apache.commons.lang3.builder.ToStringBuilderTest.testBoolean(ToStringBuilderTest.java:708)

testReflectionInteger(org.apache.commons.lang3.builder.ToStringBuilderTest)  Time elapsed: 0.001 sec  <<< FAILURE!
org.junit.ComparisonFailure: expected:<...ng.Integer@77981b57[[value=]5]> but was:<...ng.Integer@77981b57[[]5]>
	at org.junit.Assert.assertEquals(Assert.java:115)
	at org.junit.Assert.assertEquals(Assert.java:144)
	at org.apache.commons.lang3.builder.ToStringBuilderTest.testReflectionInteger(ToStringBuilderTest.java:97)

testBooleanArray(org.apache.commons.lang3.builder.ToStringBuilderTest)  Time elapsed: 0.001 sec  <<< FAILURE!
org.junit.ComparisonFailure: expected:<...ng.Integer@77981b57[[]{true,false,false}]> but was:<...ng.Integer@77981b57[[null=]{true,false,false}]>
	at org.junit.Assert.assertEquals(Assert.java:115)
	at org.junit.Assert.assertEquals(Assert.java:144)
	at org.apache.commons.lang3.builder.ToStringBuilderTest.testBooleanArray(ToStringBuilderTest.java:797)

testFloatArrayArray(org.apache.commons.lang3.builder.ToStringBuilderTest)  Time elapsed: 0.001 sec  <<< FAILURE!
org.junit.ComparisonFailure: expected:<...ng.Integer@77981b57[[]{{1.0,2.29686},<null...> but was:<...ng.Integer@77981b57[[null=]{{1.0,2.29686},<null...>
	at org.junit.Assert.assertEquals(Assert.java:115)
	at org.junit.Assert.assertEquals(Assert.java:144)
	at org.apache.commons.lang3.builder.ToStringBuilderTest.testFloatArrayArray(ToStringBuilderTest.java:867)

testSimpleReflectionStatics(org.apache.commons.lang3.builder.ToStringBuilderTest)  Time elapsed: 0.002 sec  <<< FAILURE!
org.junit.ComparisonFailure: expected:<...d8290a3[staticString[=staticString,staticInt=]12345]> but was:<...d8290a3[staticString[,]12345]>
	at org.junit.Assert.assertEquals(Assert.java:115)
	at org.junit.Assert.assertEquals(Assert.java:144)
	at org.apache.commons.lang3.builder.ToStringBuilderTest.testSimpleReflectionStatics(ToStringBuilderTest.java:907)

testReflectionStatics(org.apache.commons.lang3.builder.ToStringBuilderTest)  Time elapsed: 0.001 sec  <<< FAILURE!
org.junit.ComparisonFailure: expected:<...17240d9[staticString[=staticString,staticInt=12345,instanceString=instanceString,instanceInt=]67890]> but was:<...17240d9[staticString[,12345,instanceString,]67890]>
	at org.junit.Assert.assertEquals(Assert.java:115)
	at org.junit.Assert.assertEquals(Assert.java:144)
	at org.apache.commons.lang3.builder.ToStringBuilderTest.testReflectionStatics(ToStringBuilderTest.java:927)

testReflectionObjectCycle(org.apache.commons.lang3.builder.ToStringBuilderTest)  Time elapsed: 0.001 sec  <<< FAILURE!
org.junit.ComparisonFailure: expected:<...TestCycleA@1d523624[[b=org.apache.commons.lang3.builder.ToStringBuilderTest$ReflectionTestCycleB@608486[a=]org.apache.commons.l...> but was:<...TestCycleA@1d523624[[org.apache.commons.lang3.builder.ToStringBuilderTest$ReflectionTestCycleB@608486[]org.apache.commons.l...>
	at org.junit.Assert.assertEquals(Assert.java:115)
	at org.junit.Assert.assertEquals(Assert.java:144)
	at org.apache.commons.lang3.builder.ToStringBuilderTest.testReflectionObjectCycle(ToStringBuilderTest.java:562)

testLongArray(org.apache.commons.lang3.builder.ToStringBuilderTest)  Time elapsed: 0.001 sec  <<< FAILURE!
org.junit.ComparisonFailure: expected:<...ng.Integer@77981b57[[]{1,2,-3,4}]> but was:<...ng.Integer@77981b57[[null=]{1,2,-3,4}]>
	at org.junit.Assert.assertEquals(Assert.java:115)
	at org.junit.Assert.assertEquals(Assert.java:144)
	at org.apache.commons.lang3.builder.ToStringBuilderTest.testLongArray(ToStringBuilderTest.java:727)

testSimpleReflectionObjectCycle(org.apache.commons.lang3.builder.ToStringBuilderTest)  Time elapsed: 0 sec  <<< FAILURE!
org.junit.ComparisonFailure: expected:<...stFixture@3f7ac6d8[o[=o]rg.apache.commons.la...> but was:<...stFixture@3f7ac6d8[o[]rg.apache.commons.la...>
	at org.junit.Assert.assertEquals(Assert.java:115)
	at org.junit.Assert.assertEquals(Assert.java:144)
	at org.apache.commons.lang3.builder.ToStringBuilderTest.testSimpleReflectionObjectCycle(ToStringBuilderTest.java:530)

testShortArray(org.apache.commons.lang3.builder.ToStringBuilderTest)  Time elapsed: 0 sec  <<< FAILURE!
org.junit.ComparisonFailure: expected:<...ng.Integer@77981b57[[]{1,2,-3,4}]> but was:<...ng.Integer@77981b57[[null=]{1,2,-3,4}]>
	at org.junit.Assert.assertEquals(Assert.java:115)
	at org.junit.Assert.assertEquals(Assert.java:144)
	at org.apache.commons.lang3.builder.ToStringBuilderTest.testShortArray(ToStringBuilderTest.java:747)

testIntArrayArray(org.apache.commons.lang3.builder.ToStringBuilderTest)  Time elapsed: 0 sec  <<< FAILURE!
org.junit.ComparisonFailure: expected:<...ng.Integer@77981b57[[]{{1,2},<null>,{5}}]> but was:<...ng.Integer@77981b57[[null=]{{1,2},<null>,{5}}]>
	at org.junit.Assert.assertEquals(Assert.java:115)
	at org.junit.Assert.assertEquals(Assert.java:144)
	at org.apache.commons.lang3.builder.ToStringBuilderTest.testIntArrayArray(ToStringBuilderTest.java:817)

testInheritedReflectionStatics(org.apache.commons.lang3.builder.ToStringBuilderTest)  Time elapsed: 0.001 sec  <<< FAILURE!
org.junit.ComparisonFailure: expected:<...358a80[staticString2[=staticString2,staticInt2=]67890]> but was:<...358a80[staticString2[,]67890]>
	at org.junit.Assert.assertEquals(Assert.java:115)
	at org.junit.Assert.assertEquals(Assert.java:144)
	at org.apache.commons.lang3.builder.ToStringBuilderTest.testInheritedReflectionStatics(ToStringBuilderTest.java:947)

testAppendToString(org.apache.commons.lang3.builder.ToStringBuilderTest)  Time elapsed: 0 sec  <<< FAILURE!
org.junit.ComparisonFailure: expected:<...ng.Integer@77981b57[[a=]hello]> but was:<...ng.Integer@77981b57[[]hello]>
	at org.junit.Assert.assertEquals(Assert.java:115)
	at org.junit.Assert.assertEquals(Assert.java:144)
	at org.apache.commons.lang3.builder.ToStringBuilderTest.testAppendToString(ToStringBuilderTest.java:614)

testReflectionArrayAndObjectCycle(org.apache.commons.lang3.builder.ToStringBuilderTest)  Time elapsed: 0 sec  <<< FAILURE!
org.junit.ComparisonFailure: expected:<...estFixture@57d0258a[[o=][Ljava.lang.Object;@...> but was:<...estFixture@57d0258a[[][Ljava.lang.Object;@...>
	at org.junit.Assert.assertEquals(Assert.java:115)
	at org.junit.Assert.assertEquals(Assert.java:144)
	at org.apache.commons.lang3.builder.ToStringBuilderTest.testReflectionArrayAndObjectCycle(ToStringBuilderTest.java:576)

testIntArray(org.apache.commons.lang3.builder.ToStringBuilderTest)  Time elapsed: 0 sec  <<< FAILURE!
org.junit.ComparisonFailure: expected:<...ng.Integer@77981b57[[]{1,2,-3,4}]> but was:<...ng.Integer@77981b57[[null=]{1,2,-3,4}]>
	at org.junit.Assert.assertEquals(Assert.java:115)
	at org.junit.Assert.assertEquals(Assert.java:144)
	at org.apache.commons.lang3.builder.ToStringBuilderTest.testIntArray(ToStringBuilderTest.java:737)

testDouble(org.apache.commons.lang3.builder.ToStringBuilderTest)  Time elapsed: 0.001 sec  <<< FAILURE!
org.junit.ComparisonFailure: expected:<...ng.Integer@77981b57[[]3.2]> but was:<...ng.Integer@77981b57[[null=]3.2]>
	at org.junit.Assert.assertEquals(Assert.java:115)
	at org.junit.Assert.assertEquals(Assert.java:144)
	at org.apache.commons.lang3.builder.ToStringBuilderTest.testDouble(ToStringBuilderTest.java:694)

testByteArrayArray(org.apache.commons.lang3.builder.ToStringBuilderTest)  Time elapsed: 0 sec  <<< FAILURE!
org.junit.ComparisonFailure: expected:<...ng.Integer@77981b57[[]{{1,2},<null>,{5}}]> but was:<...ng.Integer@77981b57[[null=]{{1,2},<null>,{5}}]>
	at org.junit.Assert.assertEquals(Assert.java:115)
	at org.junit.Assert.assertEquals(Assert.java:144)
	at org.apache.commons.lang3.builder.ToStringBuilderTest.testByteArrayArray(ToStringBuilderTest.java:837)

testCharArrayArray(org.apache.commons.lang3.builder.ToStringBuilderTest)  Time elapsed: 0 sec  <<< FAILURE!
org.junit.ComparisonFailure: expected:<...ng.Integer@77981b57[[]{{A,B},<null>,{p}}]> but was:<...ng.Integer@77981b57[[null=]{{A,B},<null>,{p}}]>
	at org.junit.Assert.assertEquals(Assert.java:115)
	at org.junit.Assert.assertEquals(Assert.java:144)
	at org.apache.commons.lang3.builder.ToStringBuilderTest.testCharArrayArray(ToStringBuilderTest.java:847)

testSelfInstanceVarReflectionObjectCycle(org.apache.commons.lang3.builder.ToStringBuilderTest)  Time elapsed: 0.001 sec  <<< FAILURE!
org.junit.ComparisonFailure: expected:<...estFixture@6c02d7ea[[typeIsSelf=]org.apache.commons.l...> but was:<...estFixture@6c02d7ea[[]org.apache.commons.l...>
	at org.junit.Assert.assertEquals(Assert.java:115)
	at org.junit.Assert.assertEquals(Assert.java:144)
	at org.apache.commons.lang3.builder.ToStringBuilderTest.testSelfInstanceVarReflectionObjectCycle(ToStringBuilderTest.java:539)

testObject(org.apache.commons.lang3.builder.ToStringBuilderTest)  Time elapsed: 0 sec  <<< FAILURE!
org.junit.ComparisonFailure: expected:<...ng.Integer@77981b57[[]<null>]> but was:<...ng.Integer@77981b57[[null=]<null>]>
	at org.junit.Assert.assertEquals(Assert.java:115)
	at org.junit.Assert.assertEquals(Assert.java:144)
	at org.apache.commons.lang3.builder.ToStringBuilderTest.testObject(ToStringBuilderTest.java:623)

testAppendSuper(org.apache.commons.lang3.builder.ToStringBuilderTest)  Time elapsed: 0.001 sec  <<< FAILURE!
org.junit.ComparisonFailure: expected:<...ng.Integer@77981b57[[a=]hello]> but was:<...ng.Integer@77981b57[[]hello]>
	at org.junit.Assert.assertEquals(Assert.java:115)
	at org.junit.Assert.assertEquals(Assert.java:144)
	at org.apache.commons.lang3.builder.ToStringBuilderTest.testAppendSuper(ToStringBuilderTest.java:604)

testInnerClassReflection(org.apache.commons.lang3.builder.ToStringBuilderTest)  Time elapsed: 0 sec  <<< FAILURE!
org.junit.ComparisonFailure: expected:<...Test$Outer@171f6179[[inner=]org.apache.commons.l...> but was:<...Test$Outer@171f6179[[]org.apache.commons.l...>
	at org.junit.Assert.assertEquals(Assert.java:115)
	at org.junit.Assert.assertEquals(Assert.java:144)
	at org.apache.commons.lang3.builder.ToStringBuilderTest.testInnerClassReflection(ToStringBuilderTest.java:376)

testReflectionCharacter(org.apache.commons.lang3.builder.ToStringBuilderTest)  Time elapsed: 0 sec  <<< FAILURE!
org.junit.ComparisonFailure: expected:<....Character@22df9697[[value=]A]> but was:<....Character@22df9697[[]A]>
	at org.junit.Assert.assertEquals(Assert.java:115)
	at org.junit.Assert.assertEquals(Assert.java:144)
	at org.apache.commons.lang3.builder.ToStringBuilderTest.testReflectionCharacter(ToStringBuilderTest.java:106)

testDoubleArray(org.apache.commons.lang3.builder.ToStringBuilderTest)  Time elapsed: 0 sec  <<< FAILURE!
org.junit.ComparisonFailure: expected:<...ng.Integer@77981b57[[]{1.0,2.9876,-3.00001...> but was:<...ng.Integer@77981b57[[null=]{1.0,2.9876,-3.00001...>
	at org.junit.Assert.assertEquals(Assert.java:115)
	at org.junit.Assert.assertEquals(Assert.java:144)
	at org.apache.commons.lang3.builder.ToStringBuilderTest.testDoubleArray(ToStringBuilderTest.java:777)

Running org.apache.commons.lang3.builder.EqualsBuilderTest
Tests run: 48, Failures: 0, Errors: 0, Skipped: 0, Time elapsed: 0.046 sec - in org.apache.commons.lang3.builder.EqualsBuilderTest
Running org.apache.commons.lang3.builder.HashCodeBuilderAndEqualsBuilderTest
Tests run: 4, Failures: 0, Errors: 0, Skipped: 0, Time elapsed: 0 sec - in org.apache.commons.lang3.builder.HashCodeBuilderAndEqualsBuilderTest
Running org.apache.commons.lang3.builder.ReflectionToStringBuilderConcurrencyTest
Tests run: 3, Failures: 0, Errors: 0, Skipped: 3, Time elapsed: 0 sec - in org.apache.commons.lang3.builder.ReflectionToStringBuilderConcurrencyTest
Running org.apache.commons.lang3.builder.JsonToStringStyleTest
Tests run: 9, Failures: 4, Errors: 0, Skipped: 0, Time elapsed: 0.001 sec <<< FAILURE! - in org.apache.commons.lang3.builder.JsonToStringStyleTest
testLong(org.apache.commons.lang3.builder.JsonToStringStyleTest)  Time elapsed: 0 sec  <<< FAILURE!
org.junit.ComparisonFailure: expected:<{["a":]3}> but was:<{[]3}>
	at org.junit.Assert.assertEquals(Assert.java:115)
	at org.junit.Assert.assertEquals(Assert.java:144)
	at org.apache.commons.lang3.builder.JsonToStringStyleTest.testLong(JsonToStringStyleTest.java:208)

testObject(org.apache.commons.lang3.builder.JsonToStringStyleTest)  Time elapsed: 0 sec  <<< FAILURE!
org.junit.ComparisonFailure: expected:<{["a":]null}> but was:<{[]null}>
	at org.junit.Assert.assertEquals(Assert.java:115)
	at org.junit.Assert.assertEquals(Assert.java:144)
	at org.apache.commons.lang3.builder.JsonToStringStyleTest.testObject(JsonToStringStyleTest.java:112)

testPerson(org.apache.commons.lang3.builder.JsonToStringStyleTest)  Time elapsed: 0 sec  <<< FAILURE!
org.junit.ComparisonFailure: expected:<{"[name":"Jane Doe","age":25,"smoker":]true}> but was:<{"[Jane Doe",25,]true}>
	at org.junit.Assert.assertEquals(Assert.java:115)
	at org.junit.Assert.assertEquals(Assert.java:144)
	at org.apache.commons.lang3.builder.JsonToStringStyleTest.testPerson(JsonToStringStyleTest.java:192)

testAppendSuper(org.apache.commons.lang3.builder.JsonToStringStyleTest)  Time elapsed: 0 sec  <<< FAILURE!
org.junit.ComparisonFailure: expected:<{"[a":"]hello"}> but was:<{"[]hello"}>
	at org.junit.Assert.assertEquals(Assert.java:115)
	at org.junit.Assert.assertEquals(Assert.java:144)
	at org.apache.commons.lang3.builder.JsonToStringStyleTest.testAppendSuper(JsonToStringStyleTest.java:74)

Running org.apache.commons.lang3.builder.NoClassNameToStringStyleTest
Tests run: 8, Failures: 7, Errors: 0, Skipped: 0, Time elapsed: 0.001 sec <<< FAILURE! - in org.apache.commons.lang3.builder.NoClassNameToStringStyleTest
testObjectArray(org.apache.commons.lang3.builder.NoClassNameToStringStyleTest)  Time elapsed: 0 sec  <<< FAILURE!
org.junit.ComparisonFailure: expected:<[[]{<null>,5,{3,6}}]> but was:<[[null=]{<null>,5,{3,6}}]>
	at org.junit.Assert.assertEquals(Assert.java:115)
	at org.junit.Assert.assertEquals(Assert.java:144)
	at org.apache.commons.lang3.builder.NoClassNameToStringStyleTest.testObjectArray(NoClassNameToStringStyleTest.java:102)

testLong(org.apache.commons.lang3.builder.NoClassNameToStringStyleTest)  Time elapsed: 0 sec  <<< FAILURE!
org.junit.ComparisonFailure: expected:<[[]3]> but was:<[[null=]3]>
	at org.junit.Assert.assertEquals(Assert.java:115)
	at org.junit.Assert.assertEquals(Assert.java:144)
	at org.apache.commons.lang3.builder.NoClassNameToStringStyleTest.testLong(NoClassNameToStringStyleTest.java:94)

testLongArrayArray(org.apache.commons.lang3.builder.NoClassNameToStringStyleTest)  Time elapsed: 0 sec  <<< FAILURE!
org.junit.ComparisonFailure: expected:<[[]{{1,2},<null>,{5}}]> but was:<[[null=]{{1,2},<null>,{5}}]>
	at org.junit.Assert.assertEquals(Assert.java:115)
	at org.junit.Assert.assertEquals(Assert.java:144)
	at org.apache.commons.lang3.builder.NoClassNameToStringStyleTest.testLongArrayArray(NoClassNameToStringStyleTest.java:122)

testLongArray(org.apache.commons.lang3.builder.NoClassNameToStringStyleTest)  Time elapsed: 0 sec  <<< FAILURE!
org.junit.ComparisonFailure: expected:<[[]{1,2,-3,4}]> but was:<[[null=]{1,2,-3,4}]>
	at org.junit.Assert.assertEquals(Assert.java:115)
	at org.junit.Assert.assertEquals(Assert.java:144)
	at org.apache.commons.lang3.builder.NoClassNameToStringStyleTest.testLongArray(NoClassNameToStringStyleTest.java:112)

testObject(org.apache.commons.lang3.builder.NoClassNameToStringStyleTest)  Time elapsed: 0 sec  <<< FAILURE!
org.junit.ComparisonFailure: expected:<[[]<null>]> but was:<[[null=]<null>]>
	at org.junit.Assert.assertEquals(Assert.java:115)
	at org.junit.Assert.assertEquals(Assert.java:144)
	at org.apache.commons.lang3.builder.NoClassNameToStringStyleTest.testObject(NoClassNameToStringStyleTest.java:69)

testPerson(org.apache.commons.lang3.builder.NoClassNameToStringStyleTest)  Time elapsed: 0 sec  <<< FAILURE!
org.junit.ComparisonFailure: expected:<[[name=John Q. Public,age=45,smoker=]true]> but was:<[[John Q. Public,45,]true]>
	at org.junit.Assert.assertEquals(Assert.java:115)
	at org.junit.Assert.assertEquals(Assert.java:144)
	at org.apache.commons.lang3.builder.NoClassNameToStringStyleTest.testPerson(NoClassNameToStringStyleTest.java:89)

testAppendSuper(org.apache.commons.lang3.builder.NoClassNameToStringStyleTest)  Time elapsed: 0 sec  <<< FAILURE!
org.junit.ComparisonFailure: expected:<[[a=]hello]> but was:<[[]hello]>
	at org.junit.Assert.assertEquals(Assert.java:115)
	at org.junit.Assert.assertEquals(Assert.java:144)
	at org.apache.commons.lang3.builder.NoClassNameToStringStyleTest.testAppendSuper(NoClassNameToStringStyleTest.java:60)

Running org.apache.commons.lang3.builder.DiffBuilderTest
Tests run: 30, Failures: 0, Errors: 0, Skipped: 0, Time elapsed: 0.02 sec - in org.apache.commons.lang3.builder.DiffBuilderTest
Running org.apache.commons.lang3.builder.HashCodeBuilderTest
Tests run: 44, Failures: 0, Errors: 0, Skipped: 0, Time elapsed: 0.012 sec - in org.apache.commons.lang3.builder.HashCodeBuilderTest
Running org.apache.commons.lang3.concurrent.AtomicInitializerTest
Tests run: 3, Failures: 0, Errors: 0, Skipped: 0, Time elapsed: 0.007 sec - in org.apache.commons.lang3.concurrent.AtomicInitializerTest
Running org.apache.commons.lang3.concurrent.CallableBackgroundInitializerTest
Tests run: 4, Failures: 0, Errors: 0, Skipped: 0, Time elapsed: 0.004 sec - in org.apache.commons.lang3.concurrent.CallableBackgroundInitializerTest
Running org.apache.commons.lang3.concurrent.BackgroundInitializerTest
Tests run: 15, Failures: 0, Errors: 0, Skipped: 0, Time elapsed: 0.013 sec - in org.apache.commons.lang3.concurrent.BackgroundInitializerTest
Running org.apache.commons.lang3.concurrent.LazyInitializerTest
Tests run: 3, Failures: 0, Errors: 0, Skipped: 0, Time elapsed: 0.004 sec - in org.apache.commons.lang3.concurrent.LazyInitializerTest
Running org.apache.commons.lang3.concurrent.BasicThreadFactoryTest
Tests run: 15, Failures: 0, Errors: 0, Skipped: 0, Time elapsed: 0.037 sec - in org.apache.commons.lang3.concurrent.BasicThreadFactoryTest
Running org.apache.commons.lang3.concurrent.ConstantInitializerTest
Tests run: 7, Failures: 0, Errors: 0, Skipped: 0, Time elapsed: 0 sec - in org.apache.commons.lang3.concurrent.ConstantInitializerTest
Running org.apache.commons.lang3.concurrent.MultiBackgroundInitializerTest
Tests run: 17, Failures: 0, Errors: 0, Skipped: 0, Time elapsed: 0.057 sec - in org.apache.commons.lang3.concurrent.MultiBackgroundInitializerTest
Running org.apache.commons.lang3.concurrent.AtomicSafeInitializerTest
Tests run: 4, Failures: 0, Errors: 0, Skipped: 0, Time elapsed: 0.01 sec - in org.apache.commons.lang3.concurrent.AtomicSafeInitializerTest
Running org.apache.commons.lang3.concurrent.ConcurrentUtilsTest
Tests run: 40, Failures: 0, Errors: 0, Skipped: 0, Time elapsed: 0.014 sec - in org.apache.commons.lang3.concurrent.ConcurrentUtilsTest
Running org.apache.commons.lang3.concurrent.TimedSemaphoreTest
Tests run: 15, Failures: 0, Errors: 0, Skipped: 0, Time elapsed: 1.185 sec - in org.apache.commons.lang3.concurrent.TimedSemaphoreTest
Running org.apache.commons.lang3.StringUtilsSubstringTest
Tests run: 14, Failures: 0, Errors: 0, Skipped: 0, Time elapsed: 0.007 sec - in org.apache.commons.lang3.StringUtilsSubstringTest
Running org.apache.commons.lang3.SystemUtilsTest
Tests run: 12, Failures: 0, Errors: 0, Skipped: 0, Time elapsed: 0.001 sec - in org.apache.commons.lang3.SystemUtilsTest
Running org.apache.commons.lang3.CharRangeTest
Tests run: 16, Failures: 0, Errors: 0, Skipped: 0, Time elapsed: 0.031 sec - in org.apache.commons.lang3.CharRangeTest
Running org.apache.commons.lang3.CharSetTest
Tests run: 14, Failures: 0, Errors: 0, Skipped: 0, Time elapsed: 0.007 sec - in org.apache.commons.lang3.CharSetTest
Running org.apache.commons.lang3.StringUtilsStartsEndsWithTest
Tests run: 6, Failures: 0, Errors: 0, Skipped: 0, Time elapsed: 0.003 sec - in org.apache.commons.lang3.StringUtilsStartsEndsWithTest
Running org.apache.commons.lang3.RandomStringUtilsTest
Tests run: 11, Failures: 0, Errors: 0, Skipped: 0, Time elapsed: 0.039 sec - in org.apache.commons.lang3.RandomStringUtilsTest
Running org.apache.commons.lang3.SerializationUtilsTest
Tests run: 26, Failures: 0, Errors: 0, Skipped: 0, Time elapsed: 0.046 sec - in org.apache.commons.lang3.SerializationUtilsTest
Running org.apache.commons.lang3.time.StopWatchTest
Tests run: 8, Failures: 0, Errors: 0, Skipped: 0, Time elapsed: 4.768 sec - in org.apache.commons.lang3.time.StopWatchTest
Running org.apache.commons.lang3.time.DateUtilsRoundingTest
Tests run: 22, Failures: 0, Errors: 0, Skipped: 0, Time elapsed: 0.159 sec - in org.apache.commons.lang3.time.DateUtilsRoundingTest
Running org.apache.commons.lang3.time.FastDateParserTest
Tests run: 33, Failures: 0, Errors: 0, Skipped: 0, Time elapsed: 2.034 sec - in org.apache.commons.lang3.time.FastDateParserTest
Running org.apache.commons.lang3.time.FastDateFormat_ParserTest
Tests run: 33, Failures: 0, Errors: 0, Skipped: 0, Time elapsed: 0.681 sec - in org.apache.commons.lang3.time.FastDateFormat_ParserTest
Running org.apache.commons.lang3.time.DurationFormatUtilsTest
Tests run: 25, Failures: 0, Errors: 0, Skipped: 0, Time elapsed: 0.731 sec - in org.apache.commons.lang3.time.DurationFormatUtilsTest
Running org.apache.commons.lang3.time.DateFormatUtilsTest
Tests run: 10, Failures: 0, Errors: 0, Skipped: 0, Time elapsed: 0.002 sec - in org.apache.commons.lang3.time.DateFormatUtilsTest
Running org.apache.commons.lang3.time.DateUtilsFragmentTest
Tests run: 57, Failures: 0, Errors: 0, Skipped: 0, Time elapsed: 0.01 sec - in org.apache.commons.lang3.time.DateUtilsFragmentTest
Running org.apache.commons.lang3.time.FastDatePrinterTimeZonesTest
Tests run: 617, Failures: 0, Errors: 0, Skipped: 0, Time elapsed: 0.204 sec - in org.apache.commons.lang3.time.FastDatePrinterTimeZonesTest
Running org.apache.commons.lang3.time.FastDateFormatTest
>>FastDateFormatTest: FastDateParser:34424  SimpleDateFormat:3170
Tests run: 14, Failures: 0, Errors: 0, Skipped: 0, Time elapsed: 4.109 sec - in org.apache.commons.lang3.time.FastDateFormatTest
Running org.apache.commons.lang3.time.FastDateFormat_PrinterTest
Tests run: 17, Failures: 0, Errors: 0, Skipped: 0, Time elapsed: 0.008 sec - in org.apache.commons.lang3.time.FastDateFormat_PrinterTest
Running org.apache.commons.lang3.time.FastDatePrinterTest
Tests run: 17, Failures: 0, Errors: 0, Skipped: 0, Time elapsed: 0.004 sec - in org.apache.commons.lang3.time.FastDatePrinterTest
Running org.apache.commons.lang3.time.FastDateParserSDFTest
Tests run: 276, Failures: 0, Errors: 0, Skipped: 92, Time elapsed: 0.061 sec - in org.apache.commons.lang3.time.FastDateParserSDFTest
Running org.apache.commons.lang3.time.DateUtilsTest
DateUtilsTest: Default Locale=en_US
Tests run: 38, Failures: 0, Errors: 0, Skipped: 0, Time elapsed: 0.008 sec - in org.apache.commons.lang3.time.DateUtilsTest
Running org.apache.commons.lang3.reflect.InheritanceUtilsTest
Tests run: 9, Failures: 0, Errors: 0, Skipped: 0, Time elapsed: 0.002 sec - in org.apache.commons.lang3.reflect.InheritanceUtilsTest
Running org.apache.commons.lang3.reflect.MethodUtilsTest
Tests run: 23, Failures: 0, Errors: 0, Skipped: 0, Time elapsed: 0.025 sec - in org.apache.commons.lang3.reflect.MethodUtilsTest
Running org.apache.commons.lang3.reflect.ConstructorUtilsTest
Tests run: 7, Failures: 0, Errors: 0, Skipped: 0, Time elapsed: 0.011 sec - in org.apache.commons.lang3.reflect.ConstructorUtilsTest
Running org.apache.commons.lang3.reflect.FieldUtilsTest
Tests run: 64, Failures: 0, Errors: 0, Skipped: 0, Time elapsed: 0.023 sec - in org.apache.commons.lang3.reflect.FieldUtilsTest
Running org.apache.commons.lang3.reflect.TypeLiteralTest
Tests run: 4, Failures: 0, Errors: 0, Skipped: 0, Time elapsed: 0.005 sec - in org.apache.commons.lang3.reflect.TypeLiteralTest
Running org.apache.commons.lang3.reflect.TypeUtilsTest
Tests run: 19, Failures: 0, Errors: 0, Skipped: 0, Time elapsed: 0.041 sec - in org.apache.commons.lang3.reflect.TypeUtilsTest
Running org.apache.commons.lang3.mutable.MutableByteTest
Tests run: 17, Failures: 0, Errors: 0, Skipped: 0, Time elapsed: 0.003 sec - in org.apache.commons.lang3.mutable.MutableByteTest
Running org.apache.commons.lang3.mutable.MutableShortTest
Tests run: 14, Failures: 0, Errors: 0, Skipped: 0, Time elapsed: 0.002 sec - in org.apache.commons.lang3.mutable.MutableShortTest
Running org.apache.commons.lang3.mutable.MutableIntTest
Tests run: 17, Failures: 0, Errors: 0, Skipped: 0, Time elapsed: 0.004 sec - in org.apache.commons.lang3.mutable.MutableIntTest
Running org.apache.commons.lang3.mutable.MutableDoubleTest
Tests run: 18, Failures: 0, Errors: 0, Skipped: 0, Time elapsed: 0.003 sec - in org.apache.commons.lang3.mutable.MutableDoubleTest
Running org.apache.commons.lang3.mutable.MutableFloatTest
Tests run: 18, Failures: 0, Errors: 0, Skipped: 0, Time elapsed: 0.004 sec - in org.apache.commons.lang3.mutable.MutableFloatTest
Running org.apache.commons.lang3.mutable.MutableLongTest
Tests run: 17, Failures: 0, Errors: 0, Skipped: 0, Time elapsed: 0.004 sec - in org.apache.commons.lang3.mutable.MutableLongTest
Running org.apache.commons.lang3.mutable.MutableBooleanTest
Tests run: 9, Failures: 0, Errors: 0, Skipped: 0, Time elapsed: 0.002 sec - in org.apache.commons.lang3.mutable.MutableBooleanTest
Running org.apache.commons.lang3.mutable.MutableObjectTest
Tests run: 5, Failures: 0, Errors: 0, Skipped: 0, Time elapsed: 0 sec - in org.apache.commons.lang3.mutable.MutableObjectTest
Running org.apache.commons.lang3.text.translate.UnicodeEscaperTest
Tests run: 3, Failures: 0, Errors: 0, Skipped: 0, Time elapsed: 0 sec - in org.apache.commons.lang3.text.translate.UnicodeEscaperTest
Running org.apache.commons.lang3.text.translate.EntityArraysTest
Tests run: 3, Failures: 0, Errors: 0, Skipped: 0, Time elapsed: 0.001 sec - in org.apache.commons.lang3.text.translate.EntityArraysTest
Running org.apache.commons.lang3.text.translate.UnicodeUnpairedSurrogateRemoverTest
Tests run: 2, Failures: 0, Errors: 0, Skipped: 0, Time elapsed: 0 sec - in org.apache.commons.lang3.text.translate.UnicodeUnpairedSurrogateRemoverTest
Running org.apache.commons.lang3.text.translate.NumericEntityUnescaperTest
Tests run: 3, Failures: 0, Errors: 0, Skipped: 0, Time elapsed: 0 sec - in org.apache.commons.lang3.text.translate.NumericEntityUnescaperTest
Running org.apache.commons.lang3.text.translate.NumericEntityEscaperTest
Tests run: 4, Failures: 0, Errors: 0, Skipped: 0, Time elapsed: 0.001 sec - in org.apache.commons.lang3.text.translate.NumericEntityEscaperTest
Running org.apache.commons.lang3.text.translate.LookupTranslatorTest
Tests run: 2, Failures: 0, Errors: 0, Skipped: 0, Time elapsed: 0 sec - in org.apache.commons.lang3.text.translate.LookupTranslatorTest
Running org.apache.commons.lang3.text.translate.UnicodeUnescaperTest
Tests run: 3, Failures: 0, Errors: 0, Skipped: 0, Time elapsed: 0 sec - in org.apache.commons.lang3.text.translate.UnicodeUnescaperTest
Running org.apache.commons.lang3.text.translate.OctalUnescaperTest
Tests run: 1, Failures: 0, Errors: 0, Skipped: 0, Time elapsed: 0 sec - in org.apache.commons.lang3.text.translate.OctalUnescaperTest
Running org.apache.commons.lang3.text.StrMatcherTest
Tests run: 14, Failures: 0, Errors: 0, Skipped: 0, Time elapsed: 0.005 sec - in org.apache.commons.lang3.text.StrMatcherTest
Running org.apache.commons.lang3.text.StrTokenizerTest
Tests run: 55, Failures: 0, Errors: 0, Skipped: 0, Time elapsed: 0.014 sec - in org.apache.commons.lang3.text.StrTokenizerTest
Running org.apache.commons.lang3.text.FormattableUtilsTest
Tests run: 5, Failures: 0, Errors: 0, Skipped: 0, Time elapsed: 0.001 sec - in org.apache.commons.lang3.text.FormattableUtilsTest
Running org.apache.commons.lang3.text.CompositeFormatTest
Tests run: 2, Failures: 0, Errors: 0, Skipped: 0, Time elapsed: 0 sec - in org.apache.commons.lang3.text.CompositeFormatTest
Running org.apache.commons.lang3.text.WordUtilsTest
Tests run: 12, Failures: 0, Errors: 0, Skipped: 0, Time elapsed: 0.004 sec - in org.apache.commons.lang3.text.WordUtilsTest
Running org.apache.commons.lang3.text.StrLookupTest
Tests run: 5, Failures: 0, Errors: 0, Skipped: 0, Time elapsed: 0.002 sec - in org.apache.commons.lang3.text.StrLookupTest
Running org.apache.commons.lang3.text.StrBuilderAppendInsertTest
Tests run: 51, Failures: 0, Errors: 0, Skipped: 0, Time elapsed: 0.011 sec - in org.apache.commons.lang3.text.StrBuilderAppendInsertTest
Running org.apache.commons.lang3.text.ExtendedMessageFormatTest
Tests run: 10, Failures: 0, Errors: 0, Skipped: 0, Time elapsed: 0.704 sec - in org.apache.commons.lang3.text.ExtendedMessageFormatTest
Running org.apache.commons.lang3.text.StrSubstitutorTest
Tests run: 40, Failures: 0, Errors: 0, Skipped: 0, Time elapsed: 0.022 sec - in org.apache.commons.lang3.text.StrSubstitutorTest
Running org.apache.commons.lang3.text.StrBuilderTest
Tests run: 90, Failures: 0, Errors: 0, Skipped: 0, Time elapsed: 0.034 sec - in org.apache.commons.lang3.text.StrBuilderTest
Running org.apache.commons.lang3.StringEscapeUtilsTest
Tests run: 28, Failures: 0, Errors: 0, Skipped: 0, Time elapsed: 0.328 sec - in org.apache.commons.lang3.StringEscapeUtilsTest
Running org.apache.commons.lang3.AnnotationUtilsTest
Tests run: 10, Failures: 1, Errors: 0, Skipped: 0, Time elapsed: 0.021 sec <<< FAILURE! - in org.apache.commons.lang3.AnnotationUtilsTest
testToString(org.apache.commons.lang3.AnnotationUtilsTest)  Time elapsed: 0.001 sec  <<< FAILURE!
java.lang.AssertionError: null
	at org.junit.Assert.fail(Assert.java:86)
	at org.junit.Assert.assertTrue(Assert.java:41)
	at org.junit.Assert.assertTrue(Assert.java:52)
	at org.apache.commons.lang3.AnnotationUtilsTest.testToString(AnnotationUtilsTest.java:503)

Running org.apache.commons.lang3.ConversionTest
Tests run: 42, Failures: 0, Errors: 0, Skipped: 0, Time elapsed: 0.015 sec - in org.apache.commons.lang3.ConversionTest
Running org.apache.commons.lang3.StringUtilsTrimEmptyTest
Tests run: 15, Failures: 0, Errors: 0, Skipped: 0, Time elapsed: 0.006 sec - in org.apache.commons.lang3.StringUtilsTrimEmptyTest
Running org.apache.commons.lang3.EnumUtilsTest
Tests run: 34, Failures: 0, Errors: 0, Skipped: 0, Time elapsed: 0.01 sec - in org.apache.commons.lang3.EnumUtilsTest
Running org.apache.commons.lang3.exception.ExceptionUtilsTest
Tests run: 28, Failures: 0, Errors: 0, Skipped: 0, Time elapsed: 0.023 sec - in org.apache.commons.lang3.exception.ExceptionUtilsTest
Running org.apache.commons.lang3.exception.DefaultExceptionContextTest
Tests run: 8, Failures: 0, Errors: 0, Skipped: 0, Time elapsed: 0.004 sec - in org.apache.commons.lang3.exception.DefaultExceptionContextTest
Running org.apache.commons.lang3.exception.ContextedExceptionTest
Tests run: 14, Failures: 0, Errors: 0, Skipped: 0, Time elapsed: 0.01 sec - in org.apache.commons.lang3.exception.ContextedExceptionTest
Running org.apache.commons.lang3.exception.ContextedRuntimeExceptionTest
Tests run: 14, Failures: 0, Errors: 0, Skipped: 0, Time elapsed: 0.01 sec - in org.apache.commons.lang3.exception.ContextedRuntimeExceptionTest
Running org.apache.commons.lang3.BitFieldTest
Tests run: 15, Failures: 0, Errors: 0, Skipped: 0, Time elapsed: 0.003 sec - in org.apache.commons.lang3.BitFieldTest
Running org.apache.commons.lang3.ArrayUtilsRemoveMultipleTest
Tests run: 55, Failures: 0, Errors: 0, Skipped: 0, Time elapsed: 0.016 sec - in org.apache.commons.lang3.ArrayUtilsRemoveMultipleTest
Running org.apache.commons.lang3.HashSetvBitSetTest
Ratio=9% array=100 count=1 extract=12002786 bitset=1196611
Ratio=7% array=100 count=10 extract=16365811 bitset=1207224
Ratio=4% array=100 count=50 extract=22441020 bitset=1108403
Ratio=4% array=100 count=100 extract=9667102 bitset=468493
Ratio=78% array=1000 count=10 extract=6214763 bitset=4862046
Ratio=33% array=1000 count=100 extract=14325290 bitset=4747987
Ratio=5% array=1000 count=500 extract=54300934 bitset=3092974
Ratio=1% array=1000 count=1000 extract=69774451 bitset=717316
Ratio=738% count=0 hash=334275 bits=2468488
Ratio=24% count=5 hash=843341 bits=203379
Ratio=27% count=10 hash=1239916 bits=341925
Ratio=22% count=200 hash=18306786 bits=4097097
Ratio=17% count=50 hash=5841007 bits=1011001
Ratio=26% count=100 hash=8612003 bits=2285559
Ratio=21% count=1000 hash=72836275 bits=15891820
Ratio=22% count=2000 hash=145307594 bits=32124762
Tests run: 2, Failures: 0, Errors: 0, Skipped: 0, Time elapsed: 0.627 sec - in org.apache.commons.lang3.HashSetvBitSetTest
Running org.apache.commons.lang3.StringUtilsTest
Tests run: 124, Failures: 0, Errors: 0, Skipped: 0, Time elapsed: 0.122 sec - in org.apache.commons.lang3.StringUtilsTest
Running org.apache.commons.lang3.ArrayUtilsRemoveTest
Tests run: 19, Failures: 0, Errors: 0, Skipped: 0, Time elapsed: 0.003 sec - in org.apache.commons.lang3.ArrayUtilsRemoveTest
Running org.apache.commons.lang3.ObjectUtilsTest
Tests run: 36, Failures: 0, Errors: 0, Skipped: 0, Time elapsed: 0.025 sec - in org.apache.commons.lang3.ObjectUtilsTest
Running org.apache.commons.lang3.ClassPathUtilsTest
Tests run: 13, Failures: 0, Errors: 0, Skipped: 0, Time elapsed: 0.001 sec - in org.apache.commons.lang3.ClassPathUtilsTest
Running org.apache.commons.lang3.math.NumberUtilsTest
Tests run: 91, Failures: 0, Errors: 0, Skipped: 0, Time elapsed: 0.017 sec - in org.apache.commons.lang3.math.NumberUtilsTest
Running org.apache.commons.lang3.math.IEEE754rUtilsTest
Tests run: 3, Failures: 0, Errors: 0, Skipped: 0, Time elapsed: 0 sec - in org.apache.commons.lang3.math.IEEE754rUtilsTest
Running org.apache.commons.lang3.math.FractionTest
Tests run: 25, Failures: 0, Errors: 0, Skipped: 0, Time elapsed: 0.371 sec - in org.apache.commons.lang3.math.FractionTest
Running org.apache.commons.lang3.BooleanUtilsTest
Tests run: 72, Failures: 0, Errors: 0, Skipped: 0, Time elapsed: 0.013 sec - in org.apache.commons.lang3.BooleanUtilsTest
Running org.apache.commons.lang3.CharSequenceUtilsTest
Tests run: 2, Failures: 0, Errors: 0, Skipped: 0, Time elapsed: 0 sec - in org.apache.commons.lang3.CharSequenceUtilsTest
Running org.apache.commons.lang3.CharSetUtilsTest
Tests run: 11, Failures: 0, Errors: 0, Skipped: 0, Time elapsed: 0.001 sec - in org.apache.commons.lang3.CharSetUtilsTest
Running org.apache.commons.lang3.ArrayUtilsAddTest
Tests run: 13, Failures: 0, Errors: 0, Skipped: 0, Time elapsed: 0.001 sec - in org.apache.commons.lang3.ArrayUtilsAddTest
Running org.apache.commons.lang3.CharEncodingTest
Tests run: 6, Failures: 0, Errors: 0, Skipped: 0, Time elapsed: 0.031 sec - in org.apache.commons.lang3.CharEncodingTest
Running org.apache.commons.lang3.ClassUtilsTest
Tests run: 57, Failures: 0, Errors: 0, Skipped: 0, Time elapsed: 0.026 sec - in org.apache.commons.lang3.ClassUtilsTest
Running org.apache.commons.lang3.RangeTest
Tests run: 24, Failures: 0, Errors: 0, Skipped: 0, Time elapsed: 0.007 sec - in org.apache.commons.lang3.RangeTest
Running org.apache.commons.lang3.event.EventUtilsTest
Tests run: 8, Failures: 0, Errors: 0, Skipped: 0, Time elapsed: 0.02 sec - in org.apache.commons.lang3.event.EventUtilsTest
Running org.apache.commons.lang3.event.EventListenerSupportTest
Tests run: 9, Failures: 0, Errors: 0, Skipped: 0, Time elapsed: 0.015 sec - in org.apache.commons.lang3.event.EventListenerSupportTest
Running org.apache.commons.lang3.ArrayUtilsTest
Tests run: 205, Failures: 0, Errors: 0, Skipped: 0, Time elapsed: 0.047 sec - in org.apache.commons.lang3.ArrayUtilsTest
Running org.apache.commons.lang3.CharUtilsTest
Tests run: 24, Failures: 0, Errors: 0, Skipped: 0, Time elapsed: 0.004 sec - in org.apache.commons.lang3.CharUtilsTest
Running org.apache.commons.lang3.NotImplementedExceptionTest
Tests run: 1, Failures: 0, Errors: 0, Skipped: 0, Time elapsed: 0 sec - in org.apache.commons.lang3.NotImplementedExceptionTest
Running org.apache.commons.lang3.StringUtilsEqualsIndexOfTest
Tests run: 50, Failures: 0, Errors: 0, Skipped: 0, Time elapsed: 0.002 sec - in org.apache.commons.lang3.StringUtilsEqualsIndexOfTest
Running org.apache.commons.lang3.RandomUtilsTest
Tests run: 23, Failures: 0, Errors: 0, Skipped: 0, Time elapsed: 0.001 sec - in org.apache.commons.lang3.RandomUtilsTest

Results :

Failed tests: 
  AnnotationUtilsTest.testToString:503 null
  DefaultToStringStyleTest.testAppendSuper:61 expected:<...ng.Integer@77981b57[[a=]hello]> but was:<...ng.Integer@77981b57[[]hello]>
  DefaultToStringStyleTest.testLong:96 expected:<...ng.Integer@77981b57[[]3]> but was:<...ng.Integer@77981b57[[null=]3]>
  DefaultToStringStyleTest.testLongArray:114 expected:<...ng.Integer@77981b57[[]{1,2,-3,4}]> but was:<...ng.Integer@77981b57[[null=]{1,2,-3,4}]>
  DefaultToStringStyleTest.testLongArrayArray:124 expected:<...ng.Integer@77981b57[[]{{1,2},<null>,{5}}]> but was:<...ng.Integer@77981b57[[null=]{{1,2},<null>,{5}}]>
  DefaultToStringStyleTest.testObject:70 expected:<...ng.Integer@77981b57[[]<null>]> but was:<...ng.Integer@77981b57[[null=]<null>]>
  DefaultToStringStyleTest.testObjectArray:104 expected:<...ng.Integer@77981b57[[]{<null>,5,{3,6}}]> but was:<...ng.Integer@77981b57[[null=]{<null>,5,{3,6}}]>
  DefaultToStringStyleTest.testPerson:91 expected:<...est$Person@74e51332[[name=John Doe,age=33,smoker=]false]> but was:<...est$Person@74e51332[[John Doe,33,]false]>
  DiffResultTest.testToStringOutput:95 expected:<...sultTest.EmptyClass[[test=false] differs from DiffResultTest.EmptyClass[test=]true]> but was:<...sultTest.EmptyClass[[false] differs from DiffResultTest.EmptyClass[]true]>
  JsonToStringStyleTest.testAppendSuper:74 expected:<{"[a":"]hello"}> but was:<{"[]hello"}>
  JsonToStringStyleTest.testLong:208 expected:<{["a":]3}> but was:<{[]3}>
  JsonToStringStyleTest.testObject:112 expected:<{["a":]null}> but was:<{[]null}>
  JsonToStringStyleTest.testPerson:192 expected:<{"[name":"Jane Doe","age":25,"smoker":]true}> but was:<{"[Jane Doe",25,]true}>
  MultiLineToStringStyleTest.testAppendSuper:62 expected:<...Integer@77981b57[
  [a=]hello
]> but was:<...Integer@77981b57[
  []hello
]>
  MultiLineToStringStyleTest.testLong:97 expected:<...Integer@77981b57[
  []3
]> but was:<...Integer@77981b57[
  [null=]3
]>
  MultiLineToStringStyleTest.testLongArray:115 expected:<...Integer@77981b57[
  []{1,2,-3,4}
]> but was:<...Integer@77981b57[
  [null=]{1,2,-3,4}
]>
  MultiLineToStringStyleTest.testLongArrayArray:125 expected:<...Integer@77981b57[
  []{{1,2},<null>,{5}}
]> but was:<...Integer@77981b57[
  [null=]{{1,2},<null>,{5}}
]>
  MultiLineToStringStyleTest.testObject:71 expected:<...Integer@77981b57[
  []<null>
]> but was:<...Integer@77981b57[
  [null=]<null>
]>
  MultiLineToStringStyleTest.testObjectArray:105 expected:<...Integer@77981b57[
  []{<null>,5,{3,6}}
]> but was:<...Integer@77981b57[
  [null=]{<null>,5,{3,6}}
]>
  MultiLineToStringStyleTest.testPerson:92 expected:<...$Person@598d406b[
  [name=Jane Doe
  age=25
  smoker=]true
]> but was:<...$Person@598d406b[
  [Jane Doe
  25
  ]true
]>
  MultilineRecursiveToStringStyleTest.boolArray:113 expected:<...hArrays@1a907c4e[
  [boolArray={
    true,
    false,
    true
  },
  charArray=<null>,
  intArray=<null>,
  doubleArray=<null>,
  longArray=<null>,
  stringArray=]<null>
]> but was:<...hArrays@1a907c4e[
  [{
    true,
    false,
    true
  },
  <null>,
  <null>,
  <null>,
  <null>,
  ]<null>
]>
  MultilineRecursiveToStringStyleTest.charArray:131 expected:<...hArrays@140f3941[
  [boolArray=<null>,
  charArray={
    a,
    A
  },
  intArray=<null>,
  doubleArray=<null>,
  longArray=<null>,
  stringArray=]<null>
]> but was:<...hArrays@140f3941[
  [<null>,
  {
    a,
    A
  },
  <null>,
  <null>,
  <null>,
  ]<null>
]>
  MultilineRecursiveToStringStyleTest.doubleArray:167 expected:<...hArrays@6d4d203d[
  [boolArray=<null>,
  charArray=<null>,
  intArray=<null>,
  doubleArray={
    1.0,
    2.0
  },
  longArray=<null>,
  stringArray=]<null>
]> but was:<...hArrays@6d4d203d[
  [<null>,
  <null>,
  <null>,
  {
    1.0,
    2.0
  },
  <null>,
  ]<null>
]>
  MultilineRecursiveToStringStyleTest.intArray:149 expected:<...hArrays@53bc45d4[
  [boolArray=<null>,
  charArray=<null>,
  intArray={
    1,
    2
  },
  doubleArray=<null>,
  longArray=<null>,
  stringArray=]<null>
]> but was:<...hArrays@53bc45d4[
  [<null>,
  <null>,
  {
    1,
    2
  },
  <null>,
  <null>,
  ]<null>
]>
  MultilineRecursiveToStringStyleTest.longArray:185 expected:<...hArrays@2a807bbc[
  [boolArray=<null>,
  charArray=<null>,
  intArray=<null>,
  doubleArray=<null>,
  longArray={
    1,
    2
  },
  stringArray=]<null>
]> but was:<...hArrays@2a807bbc[
  [<null>,
  <null>,
  <null>,
  <null>,
  {
    1,
    2
  },
  ]<null>
]>
  MultilineRecursiveToStringStyleTest.nestedAndArray:80 expected:<...Account@75b68cdf[
  [owner=<null>,
  transactions=java.util.ArrayList@23dac0d9{
    org.apache.commons.lang3.builder.MultilineRecursiveToStringStyleTest$Transaction@6eaaf8f2[
      amount=100.0,
      date=2014.10.14
    ],
    org.apache.commons.lang3.builder.MultilineRecursiveToStringStyleTest$Transaction@1abe10a1[
      amount=50.0,
      date=]2014.10.15
    ]
  }...> but was:<...Account@75b68cdf[
  [<null>,
  java.util.ArrayList@23dac0d9{
    org.apache.commons.lang3.builder.MultilineRecursiveToStringStyleTest$Transaction@6eaaf8f2[
      100.0,
      2014.10.14
    ],
    org.apache.commons.lang3.builder.MultilineRecursiveToStringStyleTest$Transaction@1abe10a1[
      50.0,
      ]2014.10.15
    ]
  }...>
  MultilineRecursiveToStringStyleTest.nestedElements:57 expected:<...ustomer@44471a09[
  [name=Douglas Adams,
  bank=org.apache.commons.lang3.builder.MultilineRecursiveToStringStyleTest$Bank@17fe67e4[
    name=ASF Bank
  ],
  accounts=]<null>
]> but was:<...ustomer@44471a09[
  [Douglas Adams,
  org.apache.commons.lang3.builder.MultilineRecursiveToStringStyleTest$Bank@17fe67e4[
    ASF Bank
  ],
  ]<null>
]>
  MultilineRecursiveToStringStyleTest.noArray:94 expected:<...thArrays@ae136c3[
  [boolArray=<null>,
  charArray=<null>,
  intArray=<null>,
  doubleArray=<null>,
  longArray=<null>,
  stringArray=]<null>
]> but was:<...thArrays@ae136c3[
  [<null>,
  <null>,
  <null>,
  <null>,
  <null>,
  ]<null>
]>
  MultilineRecursiveToStringStyleTest.simpleObject:42 expected:<...saction@767fa665[
  [amount=100.0,
  date=]2014.10.15
]> but was:<...saction@767fa665[
  [100.0,
  ]2014.10.15
]>
  MultilineRecursiveToStringStyleTest.stringArray:203 expected:<...hArrays@607c5f1a[
  [boolArray=<null>,
  charArray=<null>,
  intArray=<null>,
  doubleArray=<null>,
  longArray=<null>,
  stringArray=]{
    a,
    A
  }
]> but was:<...hArrays@607c5f1a[
  [<null>,
  <null>,
  <null>,
  <null>,
  <null>,
  ]{
    a,
    A
  }
]>
  NoClassNameToStringStyleTest.testAppendSuper:60 expected:<[[a=]hello]> but was:<[[]hello]>
  NoClassNameToStringStyleTest.testLong:94 expected:<[[]3]> but was:<[[null=]3]>
  NoClassNameToStringStyleTest.testLongArray:112 expected:<[[]{1,2,-3,4}]> but was:<[[null=]{1,2,-3,4}]>
  NoClassNameToStringStyleTest.testLongArrayArray:122 expected:<[[]{{1,2},<null>,{5}}]> but was:<[[null=]{{1,2},<null>,{5}}]>
  NoClassNameToStringStyleTest.testObject:69 expected:<[[]<null>]> but was:<[[null=]<null>]>
  NoClassNameToStringStyleTest.testObjectArray:102 expected:<[[]{<null>,5,{3,6}}]> but was:<[[null=]{<null>,5,{3,6}}]>
  NoClassNameToStringStyleTest.testPerson:89 expected:<[[name=John Q. Public,age=45,smoker=]true]> but was:<[[John Q. Public,45,]true]>
  RecursiveToStringStyleTest.testAppendSuper:60 expected:<...ng.Integer@77981b57[[a=]hello]> but was:<...ng.Integer@77981b57[[]hello]>
  RecursiveToStringStyleTest.testLong:99 expected:<...ng.Integer@77981b57[[]3]> but was:<...ng.Integer@77981b57[[null=]3]>
  RecursiveToStringStyleTest.testLongArray:117 expected:<...ng.Integer@77981b57[[]{1,2,-3,4}]> but was:<...ng.Integer@77981b57[[null=]{1,2,-3,4}]>
  RecursiveToStringStyleTest.testLongArrayArray:127 expected:<...ng.Integer@77981b57[[]{{1,2},<null>,{5}}]> but was:<...ng.Integer@77981b57[[null=]{{1,2},<null>,{5}}]>
  RecursiveToStringStyleTest.testObject:69 expected:<...ng.Integer@77981b57[[]<null>]> but was:<...ng.Integer@77981b57[[null=]<null>]>
  RecursiveToStringStyleTest.testObjectArray:107 expected:<...ng.Integer@77981b57[[]{<null>,5,{3,6}}]> but was:<...ng.Integer@77981b57[[null=]{<null>,5,{3,6}}]>
  RecursiveToStringStyleTest.testPerson:93 expected:<...est$Person@4260904e[[name=John Doe,age=33,smoker=false,job=org.apache.commons.lang3.builder.RecursiveToStringStyleTest$Job@51a212ed[title=]Manager]]> but was:<...est$Person@4260904e[[John Doe,33,false,org.apache.commons.lang3.builder.RecursiveToStringStyleTest$Job@51a212ed[]Manager]]>
  ReflectionToStringBuilderExcludeTest.test_toStringExclude:53->validateSecretFieldAbsent:130->validateNonSecretField:124 null
  ReflectionToStringBuilderExcludeTest.test_toStringExcludeArray:59->validateSecretFieldAbsent:130->validateNonSecretField:124 null
  ReflectionToStringBuilderExcludeTest.test_toStringExcludeArrayWithNull:65->validateSecretFieldPresent:135->validateNonSecretField:124 null
  ReflectionToStringBuilderExcludeTest.test_toStringExcludeArrayWithNulls:71->validateSecretFieldPresent:135->validateNonSecretField:124 null
  ReflectionToStringBuilderExcludeTest.test_toStringExcludeCollection:79->validateSecretFieldAbsent:130->validateNonSecretField:124 null
  ReflectionToStringBuilderExcludeTest.test_toStringExcludeCollectionWithNull:87->validateSecretFieldPresent:135->validateNonSecretField:124 null
  ReflectionToStringBuilderExcludeTest.test_toStringExcludeCollectionWithNulls:96->validateSecretFieldPresent:135->validateNonSecretField:124 null
  ReflectionToStringBuilderExcludeTest.test_toStringExcludeEmptyArray:102->validateSecretFieldPresent:135->validateNonSecretField:124 null
  ReflectionToStringBuilderExcludeTest.test_toStringExcludeEmptyCollection:108->validateSecretFieldPresent:135->validateNonSecretField:124 null
  ReflectionToStringBuilderExcludeTest.test_toStringExcludeNullArray:114->validateSecretFieldPresent:135->validateNonSecretField:124 null
  ReflectionToStringBuilderExcludeTest.test_toStringExcludeNullCollection:120->validateSecretFieldPresent:135->validateNonSecretField:124 null
  ShortPrefixToStringStyleTest.testAppendSuper:61 expected:<Integer[[a=]hello]> but was:<Integer[[]hello]>
  ShortPrefixToStringStyleTest.testLong:96 expected:<Integer[[]3]> but was:<Integer[[null=]3]>
  ShortPrefixToStringStyleTest.testLongArray:114 expected:<Integer[[]{1,2,-3,4}]> but was:<Integer[[null=]{1,2,-3,4}]>
  ShortPrefixToStringStyleTest.testLongArrayArray:124 expected:<Integer[[]{{1,2},<null>,{5}}]> but was:<Integer[[null=]{{1,2},<null>,{5}}]>
  ShortPrefixToStringStyleTest.testObject:70 expected:<Integer[[]<null>]> but was:<Integer[[null=]<null>]>
  ShortPrefixToStringStyleTest.testObjectArray:104 expected:<Integer[[]{<null>,5,{3,6}}]> but was:<Integer[[null=]{<null>,5,{3,6}}]>
  ShortPrefixToStringStyleTest.testPerson:91 expected:<...ingStyleTest.Person[[name=John Q. Public,age=45,smoker=]true]> but was:<...ingStyleTest.Person[[John Q. Public,45,]true]>
  StandardToStringStyleTest.testAppendSuper:76 expected:<Integer[[a=]hello]> but was:<Integer[[]hello]>
  StandardToStringStyleTest.testLong:111 expected:<Integer[[]3]> but was:<Integer[[null=]3]>
  StandardToStringStyleTest.testLongArray:129 expected:<Integer[[][1, 2, -3, 4]]> but was:<Integer[[null=][1, 2, -3, 4]]>
  StandardToStringStyleTest.testLongArrayArray:139 expected:<Integer[[][[1, 2], %NULL%, [5]...> but was:<Integer[[null=][[1, 2], %NULL%, [5]...>
  StandardToStringStyleTest.testObject:85 expected:<Integer[[]%NULL%]> but was:<Integer[[null=]%NULL%]>
  StandardToStringStyleTest.testObjectArray:119 expected:<Integer[[][%NULL%, 5, [3, 6]]]> but was:<Integer[[null=][%NULL%, 5, [3, 6]]]>
  StandardToStringStyleTest.testPerson:106 expected:<...ingStyleTest.Person[[name=Suzy Queue,age=19,smoker=]false]> but was:<...ingStyleTest.Person[[Suzy Queue,19,]false]>
  ToStringBuilderTest.testAppendSuper:604 expected:<...ng.Integer@77981b57[[a=]hello]> but was:<...ng.Integer@77981b57[[]hello]>
  ToStringBuilderTest.testAppendToString:614 expected:<...ng.Integer@77981b57[[a=]hello]> but was:<...ng.Integer@77981b57[[]hello]>
  ToStringBuilderTest.testBoolean:708 expected:<...ng.Integer@77981b57[[]true]> but was:<...ng.Integer@77981b57[[null=]true]>
  ToStringBuilderTest.testBooleanArray:797 expected:<...ng.Integer@77981b57[[]{true,false,false}]> but was:<...ng.Integer@77981b57[[null=]{true,false,false}]>
  ToStringBuilderTest.testBooleanArrayArray:877 expected:<...ng.Integer@77981b57[[]{{true,false},<null>...> but was:<...ng.Integer@77981b57[[null=]{{true,false},<null>...>
  ToStringBuilderTest.testByte:686 expected:<...ng.Integer@77981b57[[]3]> but was:<...ng.Integer@77981b57[[null=]3]>
  ToStringBuilderTest.testByteArray:757 expected:<...ng.Integer@77981b57[[]{1,2,-3,4}]> but was:<...ng.Integer@77981b57[[null=]{1,2,-3,4}]>
  ToStringBuilderTest.testByteArrayArray:837 expected:<...ng.Integer@77981b57[[]{{1,2},<null>,{5}}]> but was:<...ng.Integer@77981b57[[null=]{{1,2},<null>,{5}}]>
  ToStringBuilderTest.testChar:679 expected:<...ng.Integer@77981b57[[]A]> but was:<...ng.Integer@77981b57[[null=]A]>
  ToStringBuilderTest.testCharArray:767 expected:<...ng.Integer@77981b57[[]{A,2,_,D}]> but was:<...ng.Integer@77981b57[[null=]{A,2,_,D}]>
  ToStringBuilderTest.testCharArrayArray:847 expected:<...ng.Integer@77981b57[[]{{A,B},<null>,{p}}]> but was:<...ng.Integer@77981b57[[null=]{{A,B},<null>,{p}}]>
  ToStringBuilderTest.testDouble:694 expected:<...ng.Integer@77981b57[[]3.2]> but was:<...ng.Integer@77981b57[[null=]3.2]>
  ToStringBuilderTest.testDoubleArray:777 expected:<...ng.Integer@77981b57[[]{1.0,2.9876,-3.00001...> but was:<...ng.Integer@77981b57[[null=]{1.0,2.9876,-3.00001...>
  ToStringBuilderTest.testDoubleArrayArray:857 expected:<...ng.Integer@77981b57[[]{{1.0,2.29686},<null...> but was:<...ng.Integer@77981b57[[null=]{{1.0,2.29686},<null...>
  ToStringBuilderTest.testFloat:701 expected:<...ng.Integer@77981b57[[]3.2]> but was:<...ng.Integer@77981b57[[null=]3.2]>
  ToStringBuilderTest.testFloatArray:787 expected:<...ng.Integer@77981b57[[]{1.0,2.9876,-3.00001...> but was:<...ng.Integer@77981b57[[null=]{1.0,2.9876,-3.00001...>
  ToStringBuilderTest.testFloatArrayArray:867 expected:<...ng.Integer@77981b57[[]{{1.0,2.29686},<null...> but was:<...ng.Integer@77981b57[[null=]{{1.0,2.29686},<null...>
  ToStringBuilderTest.testInheritedReflectionStatics:947 expected:<...358a80[staticString2[=staticString2,staticInt2=]67890]> but was:<...358a80[staticString2[,]67890]>
  ToStringBuilderTest.testInnerClassReflection:376 expected:<...Test$Outer@171f6179[[inner=]org.apache.commons.l...> but was:<...Test$Outer@171f6179[[]org.apache.commons.l...>
  ToStringBuilderTest.testInt:665 expected:<...ng.Integer@77981b57[[]3]> but was:<...ng.Integer@77981b57[[null=]3]>
  ToStringBuilderTest.testIntArray:737 expected:<...ng.Integer@77981b57[[]{1,2,-3,4}]> but was:<...ng.Integer@77981b57[[null=]{1,2,-3,4}]>
  ToStringBuilderTest.testIntArrayArray:817 expected:<...ng.Integer@77981b57[[]{{1,2},<null>,{5}}]> but was:<...ng.Integer@77981b57[[null=]{{1,2},<null>,{5}}]>
  ToStringBuilderTest.testLong:657 expected:<...ng.Integer@77981b57[[]3]> but was:<...ng.Integer@77981b57[[null=]3]>
  ToStringBuilderTest.testLongArray:727 expected:<...ng.Integer@77981b57[[]{1,2,-3,4}]> but was:<...ng.Integer@77981b57[[null=]{1,2,-3,4}]>
  ToStringBuilderTest.testLongArrayArray:807 expected:<...ng.Integer@77981b57[[]{{1,2},<null>,{5}}]> but was:<...ng.Integer@77981b57[[null=]{{1,2},<null>,{5}}]>
  ToStringBuilderTest.testObject:623 expected:<...ng.Integer@77981b57[[]<null>]> but was:<...ng.Integer@77981b57[[null=]<null>]>
  ToStringBuilderTest.testObjectArray:717 expected:<...ng.Integer@77981b57[[]{<null>,5,{3,6}}]> but was:<...ng.Integer@77981b57[[null=]{<null>,5,{3,6}}]>
  ToStringBuilderTest.testObjectBuild:641 expected:<...ng.Integer@77981b57[[]<null>]> but was:<...ng.Integer@77981b57[[null=]<null>]>
  ToStringBuilderTest.testObjectCycle:892 expected:<...bjectCycle@60c40bac[[org.apache.commons.lang3.builder.ToStringBuilderTest$ObjectCycle@66da7ad5[]org.apache.commons.l...> but was:<...bjectCycle@60c40bac[[null=org.apache.commons.lang3.builder.ToStringBuilderTest$ObjectCycle@66da7ad5[null=]org.apache.commons.l...>
  ToStringBuilderTest.testReflectionArrayAndObjectCycle:576 expected:<...estFixture@57d0258a[[o=][Ljava.lang.Object;@...> but was:<...estFixture@57d0258a[[][Ljava.lang.Object;@...>
  ToStringBuilderTest.testReflectionBoolean:116 expected:<...ang.Boolean@8453227[[value=]true]> but was:<...ang.Boolean@8453227[[]true]>
  ToStringBuilderTest.testReflectionCharacter:106 expected:<....Character@22df9697[[value=]A]> but was:<....Character@22df9697[[]A]>
  ToStringBuilderTest.testReflectionHierarchy:338 expected:<...tFixtureA@5f175881[a[=a]]> but was:<...tFixtureA@5f175881[a[]]>
  ToStringBuilderTest.testReflectionInteger:97 expected:<...ng.Integer@77981b57[[value=]5]> but was:<...ng.Integer@77981b57[[]5]>
  ToStringBuilderTest.testReflectionObjectCycle:562 expected:<...TestCycleA@1d523624[[b=org.apache.commons.lang3.builder.ToStringBuilderTest$ReflectionTestCycleB@608486[a=]org.apache.commons.l...> but was:<...TestCycleA@1d523624[[org.apache.commons.lang3.builder.ToStringBuilderTest$ReflectionTestCycleB@608486[]org.apache.commons.l...>
  ToStringBuilderTest.testReflectionStatics:927 expected:<...17240d9[staticString[=staticString,staticInt=12345,instanceString=instanceString,instanceInt=]67890]> but was:<...17240d9[staticString[,12345,instanceString,]67890]>
  ToStringBuilderTest.testSelfInstanceTwoVarsReflectionObjectCycle:549 expected:<...estFixture@6f7331c4[[typeIsSelf=org.apache.commons.lang3.builder.ToStringBuilderTest$SelfInstanceTwoVarsReflectionTestFixture@6f7331c4,otherType=]The Other Type]> but was:<...estFixture@6f7331c4[[org.apache.commons.lang3.builder.ToStringBuilderTest$SelfInstanceTwoVarsReflectionTestFixture@6f7331c4,]The Other Type]>
  ToStringBuilderTest.testSelfInstanceVarReflectionObjectCycle:539 expected:<...estFixture@6c02d7ea[[typeIsSelf=]org.apache.commons.l...> but was:<...estFixture@6c02d7ea[[]org.apache.commons.l...>
  ToStringBuilderTest.testShort:672 expected:<...ng.Integer@77981b57[[]3]> but was:<...ng.Integer@77981b57[[null=]3]>
  ToStringBuilderTest.testShortArray:747 expected:<...ng.Integer@77981b57[[]{1,2,-3,4}]> but was:<...ng.Integer@77981b57[[null=]{1,2,-3,4}]>
  ToStringBuilderTest.testShortArrayArray:827 expected:<...ng.Integer@77981b57[[]{{1,2},<null>,{5}}]> but was:<...ng.Integer@77981b57[[null=]{{1,2},<null>,{5}}]>
  ToStringBuilderTest.testSimpleReflectionObjectCycle:530 expected:<...stFixture@3f7ac6d8[o[=o]rg.apache.commons.la...> but was:<...stFixture@3f7ac6d8[o[]rg.apache.commons.la...>
  ToStringBuilderTest.testSimpleReflectionStatics:907 expected:<...d8290a3[staticString[=staticString,staticInt=]12345]> but was:<...d8290a3[staticString[,]12345]>



Tests run: 3526, Failures: 112, Errors: 0, Skipped: 97

[INFO] ------------------------------------------------------------------------
[INFO] BUILD FAILURE
[INFO] ------------------------------------------------------------------------
[INFO] Total time: 34.555s
[INFO] Finished at: Tue Aug 04 08:44:18 BST 2015
[INFO] Final Memory: 25M/500M
[INFO] ------------------------------------------------------------------------
[ERROR] Failed to execute goal org.apache.maven.plugins:maven-surefire-plugin:2.18:test (default-test) on project commons-lang3: There are test failures.
[ERROR] 
[ERROR] Please refer to /home/perham/Study/LittleDarwin/Cases/commons-lang3-3.4-src/target/surefire-reports for the individual test results.
[ERROR] -> [Help 1]
[ERROR] 
[ERROR] To see the full stack trace of the errors, re-run Maven with the -e switch.
[ERROR] Re-run Maven using the -X switch to enable full debug logging.
[ERROR] 
[ERROR] For more information about the errors and possible solutions, please read the following articles:
[ERROR] [Help 1] http://cwiki.apache.org/confluence/display/MAVEN/MojoFailureException
