[INFO] Scanning for projects...
[INFO]                                                                         
[INFO] ------------------------------------------------------------------------
[INFO] Building Apache Commons Lang 3.4
[INFO] ------------------------------------------------------------------------
[INFO] 
[INFO] --- maven-enforcer-plugin:1.3.1:enforce (enforce-maven-3) @ commons-lang3 ---
[INFO] 
[INFO] --- build-helper-maven-plugin:1.8:parse-version (parse-version) @ commons-lang3 ---
[INFO] 
[INFO] --- maven-antrun-plugin:1.8:run (javadoc.resources) @ commons-lang3 ---
[INFO] Executing tasks

main:
[INFO] Executed tasks
[INFO] 
[INFO] --- maven-remote-resources-plugin:1.5:process (default) @ commons-lang3 ---
[INFO] 
[INFO] --- buildnumber-maven-plugin:1.3:create (default) @ commons-lang3 ---
[INFO] Executing: /bin/sh -c cd /home/perham/Study/LittleDarwin/Cases/commons-lang3-3.4-src && svn --non-interactive info
[INFO] Working directory: /home/perham/Study/LittleDarwin/Cases/commons-lang3-3.4-src
[INFO] Storing buildNumber: ?????? at timestamp: 1438676440402
[INFO] Executing: /bin/sh -c cd /home/perham/Study/LittleDarwin/Cases/commons-lang3-3.4-src && svn --non-interactive info
[INFO] Working directory: /home/perham/Study/LittleDarwin/Cases/commons-lang3-3.4-src
[INFO] Storing buildScmBranch: UNKNOWN_BRANCH
[INFO] 
[INFO] --- maven-resources-plugin:2.7:resources (default-resources) @ commons-lang3 ---
[INFO] Using 'ISO-8859-1' encoding to copy filtered resources.
[INFO] Copying 0 resource
[INFO] Copying 2 resources to META-INF
[INFO] 
[INFO] --- maven-compiler-plugin:3.2:compile (default-compile) @ commons-lang3 ---
[INFO] Changes detected - recompiling the module!
[INFO] Compiling 133 source files to /home/perham/Study/LittleDarwin/Cases/commons-lang3-3.4-src/target/classes
[INFO] /home/perham/Study/LittleDarwin/Cases/commons-lang3-3.4-src/src/main/java/org/apache/commons/lang3/SerializationUtils.java: /home/perham/Study/LittleDarwin/Cases/commons-lang3-3.4-src/src/main/java/org/apache/commons/lang3/SerializationUtils.java uses unchecked or unsafe operations.
[INFO] /home/perham/Study/LittleDarwin/Cases/commons-lang3-3.4-src/src/main/java/org/apache/commons/lang3/SerializationUtils.java: Recompile with -Xlint:unchecked for details.
[INFO] 
[INFO] --- maven-bundle-plugin:2.5.3:manifest (bundle-manifest) @ commons-lang3 ---
[INFO] 
[INFO] --- animal-sniffer-maven-plugin:1.13:check (checkAPIcompatibility) @ commons-lang3 ---
[INFO] Checking unresolved references to org.codehaus.mojo.signature:java16:1.0
[INFO] 
[INFO] --- maven-resources-plugin:2.7:testResources (default-testResources) @ commons-lang3 ---
[INFO] Using 'ISO-8859-1' encoding to copy filtered resources.
[INFO] Copying 2 resources
[INFO] Copying 2 resources to META-INF
[INFO] 
[INFO] --- maven-compiler-plugin:3.2:testCompile (default-testCompile) @ commons-lang3 ---
[INFO] Nothing to compile - all classes are up to date
[INFO] 
[INFO] --- maven-surefire-plugin:2.18:test (default-test) @ commons-lang3 ---
[INFO] Surefire report directory: /home/perham/Study/LittleDarwin/Cases/commons-lang3-3.4-src/target/surefire-reports

-------------------------------------------------------
 T E S T S
-------------------------------------------------------
Running org.apache.commons.lang3.ValidateTest
Tests run: 63, Failures: 0, Errors: 0, Skipped: 0, Time elapsed: 0.034 sec - in org.apache.commons.lang3.ValidateTest
Running org.apache.commons.lang3.LocaleUtilsTest
Tests run: 15, Failures: 0, Errors: 0, Skipped: 0, Time elapsed: 0.02 sec - in org.apache.commons.lang3.LocaleUtilsTest
Running org.apache.commons.lang3.tuple.MutableTripleTest
Tests run: 8, Failures: 0, Errors: 0, Skipped: 0, Time elapsed: 0.008 sec - in org.apache.commons.lang3.tuple.MutableTripleTest
Running org.apache.commons.lang3.tuple.TripleTest
Tests run: 10, Failures: 0, Errors: 0, Skipped: 0, Time elapsed: 0.001 sec - in org.apache.commons.lang3.tuple.TripleTest
Running org.apache.commons.lang3.tuple.ImmutablePairTest
Tests run: 6, Failures: 0, Errors: 0, Skipped: 0, Time elapsed: 0.001 sec - in org.apache.commons.lang3.tuple.ImmutablePairTest
Running org.apache.commons.lang3.tuple.MutablePairTest
Tests run: 8, Failures: 0, Errors: 0, Skipped: 0, Time elapsed: 0 sec - in org.apache.commons.lang3.tuple.MutablePairTest
Running org.apache.commons.lang3.tuple.ImmutableTripleTest
Tests run: 6, Failures: 0, Errors: 0, Skipped: 0, Time elapsed: 0.001 sec - in org.apache.commons.lang3.tuple.ImmutableTripleTest
Running org.apache.commons.lang3.tuple.PairTest
Tests run: 9, Failures: 0, Errors: 0, Skipped: 0, Time elapsed: 0.001 sec - in org.apache.commons.lang3.tuple.PairTest
Running org.apache.commons.lang3.StringUtilsIsTest
Tests run: 8, Failures: 0, Errors: 0, Skipped: 0, Time elapsed: 0.001 sec - in org.apache.commons.lang3.StringUtilsIsTest
Running org.apache.commons.lang3.JavaVersionTest
Tests run: 3, Failures: 0, Errors: 0, Skipped: 0, Time elapsed: 0 sec - in org.apache.commons.lang3.JavaVersionTest
Running org.apache.commons.lang3.builder.NoFieldNamesToStringStyleTest
Tests run: 8, Failures: 5, Errors: 1, Skipped: 0, Time elapsed: 0.021 sec <<< FAILURE! - in org.apache.commons.lang3.builder.NoFieldNamesToStringStyleTest
testObjectArray(org.apache.commons.lang3.builder.NoFieldNamesToStringStyleTest)  Time elapsed: 0.013 sec  <<< ERROR!
java.lang.NullPointerException: null
	at org.apache.commons.lang3.builder.ToStringStyle.isRegistered(ToStringStyle.java:28)
	at org.apache.commons.lang3.builder.ToStringStyle.appendInternal(ToStringStyle.java:82)
	at org.apache.commons.lang3.builder.ToStringStyle.appendDetail(ToStringStyle.java:160)
	at org.apache.commons.lang3.builder.ToStringStyle.append(ToStringStyle.java:151)
	at org.apache.commons.lang3.builder.ToStringBuilder.append(ToStringBuilder.java:486)
	at org.apache.commons.lang3.builder.NoFieldNamesToStringStyleTest.testObjectArray(NoFieldNamesToStringStyleTest.java:104)

testLongArrayArray(org.apache.commons.lang3.builder.NoFieldNamesToStringStyleTest)  Time elapsed: 0.003 sec  <<< FAILURE!
org.junit.ComparisonFailure: expected:<...g.Integer@66d89fb1[{[{1,2},<null>,{5}]}]> but was:<...g.Integer@66d89fb1[{[[J@19565a99,<null>,[J@7455ffcd]}]>
	at org.junit.Assert.assertEquals(Assert.java:115)
	at org.junit.Assert.assertEquals(Assert.java:144)
	at org.apache.commons.lang3.builder.NoFieldNamesToStringStyleTest.testLongArrayArray(NoFieldNamesToStringStyleTest.java:124)

testLongArray(org.apache.commons.lang3.builder.NoFieldNamesToStringStyleTest)  Time elapsed: 0 sec  <<< FAILURE!
org.junit.ComparisonFailure: expected:<...ng.Integer@66d89fb1[[{1,2,-3,4}]]> but was:<...ng.Integer@66d89fb1[[[J@52ba2221]]>
	at org.junit.Assert.assertEquals(Assert.java:115)
	at org.junit.Assert.assertEquals(Assert.java:144)
	at org.apache.commons.lang3.builder.NoFieldNamesToStringStyleTest.testLongArray(NoFieldNamesToStringStyleTest.java:115)

testObject(org.apache.commons.lang3.builder.NoFieldNamesToStringStyleTest)  Time elapsed: 0.003 sec  <<< FAILURE!
org.junit.ComparisonFailure: expected:<...ng.Integer@66d89fb1[[<size=0>]]> but was:<...ng.Integer@66d89fb1[[java.util.ArrayList@1e86471]]>
	at org.junit.Assert.assertEquals(Assert.java:115)
	at org.junit.Assert.assertEquals(Assert.java:144)
	at org.apache.commons.lang3.builder.NoFieldNamesToStringStyleTest.testObject(NoFieldNamesToStringStyleTest.java:76)

testPerson(org.apache.commons.lang3.builder.NoFieldNamesToStringStyleTest)  Time elapsed: 0.001 sec  <<< FAILURE!
org.junit.ComparisonFailure: expected:<...est$Person@401a37b1[[Ron Paul],72,false]> but was:<...est$Person@401a37b1[[java.lang.String@793e6657],72,false]>
	at org.junit.Assert.assertEquals(Assert.java:115)
	at org.junit.Assert.assertEquals(Assert.java:144)
	at org.apache.commons.lang3.builder.NoFieldNamesToStringStyleTest.testPerson(NoFieldNamesToStringStyleTest.java:91)

testAppendSuper(org.apache.commons.lang3.builder.NoFieldNamesToStringStyleTest)  Time elapsed: 0 sec  <<< FAILURE!
org.junit.ComparisonFailure: expected:<...ng.Integer@66d89fb1[[hello]]> but was:<...ng.Integer@66d89fb1[[java.lang.String@6fb117f0]]>
	at org.junit.Assert.assertEquals(Assert.java:115)
	at org.junit.Assert.assertEquals(Assert.java:144)
	at org.apache.commons.lang3.builder.NoFieldNamesToStringStyleTest.testAppendSuper(NoFieldNamesToStringStyleTest.java:61)

Running org.apache.commons.lang3.builder.ShortPrefixToStringStyleTest
Tests run: 8, Failures: 5, Errors: 1, Skipped: 0, Time elapsed: 0.001 sec <<< FAILURE! - in org.apache.commons.lang3.builder.ShortPrefixToStringStyleTest
testObjectArray(org.apache.commons.lang3.builder.ShortPrefixToStringStyleTest)  Time elapsed: 0 sec  <<< ERROR!
java.lang.NullPointerException: null
	at org.apache.commons.lang3.builder.ToStringStyle.isRegistered(ToStringStyle.java:28)
	at org.apache.commons.lang3.builder.ToStringStyle.appendInternal(ToStringStyle.java:82)
	at org.apache.commons.lang3.builder.ToStringStyle.appendDetail(ToStringStyle.java:160)
	at org.apache.commons.lang3.builder.ToStringStyle.append(ToStringStyle.java:151)
	at org.apache.commons.lang3.builder.ToStringBuilder.append(ToStringBuilder.java:486)
	at org.apache.commons.lang3.builder.ShortPrefixToStringStyleTest.testObjectArray(ShortPrefixToStringStyleTest.java:104)

testLongArrayArray(org.apache.commons.lang3.builder.ShortPrefixToStringStyleTest)  Time elapsed: 0 sec  <<< FAILURE!
org.junit.ComparisonFailure: expected:<Integer[{[{1,2},<null>,{5}]}]> but was:<Integer[{[[J@539ac6d9,<null>,[J@5674fb70]}]>
	at org.junit.Assert.assertEquals(Assert.java:115)
	at org.junit.Assert.assertEquals(Assert.java:144)
	at org.apache.commons.lang3.builder.ShortPrefixToStringStyleTest.testLongArrayArray(ShortPrefixToStringStyleTest.java:124)

testLongArray(org.apache.commons.lang3.builder.ShortPrefixToStringStyleTest)  Time elapsed: 0 sec  <<< FAILURE!
org.junit.ComparisonFailure: expected:<Integer[[{1,2,-3,4}]]> but was:<Integer[[[J@1a27a268]]>
	at org.junit.Assert.assertEquals(Assert.java:115)
	at org.junit.Assert.assertEquals(Assert.java:144)
	at org.apache.commons.lang3.builder.ShortPrefixToStringStyleTest.testLongArray(ShortPrefixToStringStyleTest.java:115)

testObject(org.apache.commons.lang3.builder.ShortPrefixToStringStyleTest)  Time elapsed: 0 sec  <<< FAILURE!
org.junit.ComparisonFailure: expected:<Integer[a=[<size=0>]]> but was:<Integer[a=[java.util.ArrayList@20176742]]>
	at org.junit.Assert.assertEquals(Assert.java:115)
	at org.junit.Assert.assertEquals(Assert.java:144)
	at org.apache.commons.lang3.builder.ShortPrefixToStringStyleTest.testObject(ShortPrefixToStringStyleTest.java:76)

testPerson(org.apache.commons.lang3.builder.ShortPrefixToStringStyleTest)  Time elapsed: 0.001 sec  <<< FAILURE!
org.junit.ComparisonFailure: expected:<...yleTest.Person[name=[John Q. Public],age=45,smoker=true]> but was:<...yleTest.Person[name=[java.lang.String@78d1cbf1],age=45,smoker=true]>
	at org.junit.Assert.assertEquals(Assert.java:115)
	at org.junit.Assert.assertEquals(Assert.java:144)
	at org.apache.commons.lang3.builder.ShortPrefixToStringStyleTest.testPerson(ShortPrefixToStringStyleTest.java:91)

testAppendSuper(org.apache.commons.lang3.builder.ShortPrefixToStringStyleTest)  Time elapsed: 0 sec  <<< FAILURE!
org.junit.ComparisonFailure: expected:<Integer[a=[hello]]> but was:<Integer[a=[java.lang.String@6fb117f0]]>
	at org.junit.Assert.assertEquals(Assert.java:115)
	at org.junit.Assert.assertEquals(Assert.java:144)
	at org.apache.commons.lang3.builder.ShortPrefixToStringStyleTest.testAppendSuper(ShortPrefixToStringStyleTest.java:61)

Running org.apache.commons.lang3.builder.DiffResultTest
Tests run: 9, Failures: 0, Errors: 0, Skipped: 0, Time elapsed: 0.006 sec - in org.apache.commons.lang3.builder.DiffResultTest
Running org.apache.commons.lang3.builder.CompareToBuilderTest
Tests run: 48, Failures: 0, Errors: 0, Skipped: 0, Time elapsed: 0.017 sec - in org.apache.commons.lang3.builder.CompareToBuilderTest
Running org.apache.commons.lang3.builder.MultilineRecursiveToStringStyleTest
Tests run: 10, Failures: 9, Errors: 0, Skipped: 0, Time elapsed: 0.008 sec <<< FAILURE! - in org.apache.commons.lang3.builder.MultilineRecursiveToStringStyleTest
doubleArray(org.apache.commons.lang3.builder.MultilineRecursiveToStringStyleTest)  Time elapsed: 0 sec  <<< FAILURE!
org.junit.ComparisonFailure: expected:<...ull>,
  doubleArray=[{
    1.0,
    2.0
  }],
  longArray=<null>...> but was:<...ull>,
  doubleArray=[[D@6b2fd0b3],
  longArray=<null>...>
	at org.junit.Assert.assertEquals(Assert.java:115)
	at org.junit.Assert.assertEquals(Assert.java:144)
	at org.apache.commons.lang3.builder.MultilineRecursiveToStringStyleTest.doubleArray(MultilineRecursiveToStringStyleTest.java:167)

stringArray(org.apache.commons.lang3.builder.MultilineRecursiveToStringStyleTest)  Time elapsed: 0.001 sec  <<< FAILURE!
org.junit.ComparisonFailure: expected:<...ull>,
  stringArray=[{
    a,
    A
  }]
]> but was:<...ull>,
  stringArray=[[Ljava.lang.String;@710765e5]
]>
	at org.junit.Assert.assertEquals(Assert.java:115)
	at org.junit.Assert.assertEquals(Assert.java:144)
	at org.apache.commons.lang3.builder.MultilineRecursiveToStringStyleTest.stringArray(MultilineRecursiveToStringStyleTest.java:203)

simpleObject(org.apache.commons.lang3.builder.MultilineRecursiveToStringStyleTest)  Time elapsed: 0.002 sec  <<< FAILURE!
org.junit.ComparisonFailure: expected:<...mount=100.0,
  date=[2014.10.15]
]> but was:<...mount=100.0,
  date=[java.lang.String@598d406b]
]>
	at org.junit.Assert.assertEquals(Assert.java:115)
	at org.junit.Assert.assertEquals(Assert.java:144)
	at org.apache.commons.lang3.builder.MultilineRecursiveToStringStyleTest.simpleObject(MultilineRecursiveToStringStyleTest.java:42)

longArray(org.apache.commons.lang3.builder.MultilineRecursiveToStringStyleTest)  Time elapsed: 0 sec  <<< FAILURE!
org.junit.ComparisonFailure: expected:<...<null>,
  longArray=[{
    1,
    2
  }],
  stringArray=<nul...> but was:<...<null>,
  longArray=[[J@63cb6c2c],
  stringArray=<nul...>
	at org.junit.Assert.assertEquals(Assert.java:115)
	at org.junit.Assert.assertEquals(Assert.java:144)
	at org.apache.commons.lang3.builder.MultilineRecursiveToStringStyleTest.longArray(MultilineRecursiveToStringStyleTest.java:185)

intArray(org.apache.commons.lang3.builder.MultilineRecursiveToStringStyleTest)  Time elapsed: 0.001 sec  <<< FAILURE!
org.junit.ComparisonFailure: expected:<...=<null>,
  intArray=[{
    1,
    2
  }],
  doubleArray=<nul...> but was:<...=<null>,
  intArray=[[I@42eb40fe],
  doubleArray=<nul...>
	at org.junit.Assert.assertEquals(Assert.java:115)
	at org.junit.Assert.assertEquals(Assert.java:144)
	at org.apache.commons.lang3.builder.MultilineRecursiveToStringStyleTest.intArray(MultilineRecursiveToStringStyleTest.java:149)

nestedAndArray(org.apache.commons.lang3.builder.MultilineRecursiveToStringStyleTest)  Time elapsed: 0.001 sec  <<< FAILURE!
org.junit.ComparisonFailure: expected:<...l.ArrayList@33318b82[{
    org.apache.commons.lang3.builder.MultilineRecursiveToStringStyleTest$Transaction@79be1e0f[
      amount=100.0,
      date=2014.10.14
    ],
    org.apache.commons.lang3.builder.MultilineRecursiveToStringStyleTest$Transaction@30a7a93a[
      amount=50.0,
      date=2014.10.15
    ]
  }]
]> but was:<...l.ArrayList@33318b82[]
]>
	at org.junit.Assert.assertEquals(Assert.java:115)
	at org.junit.Assert.assertEquals(Assert.java:144)
	at org.apache.commons.lang3.builder.MultilineRecursiveToStringStyleTest.nestedAndArray(MultilineRecursiveToStringStyleTest.java:80)

charArray(org.apache.commons.lang3.builder.MultilineRecursiveToStringStyleTest)  Time elapsed: 0.001 sec  <<< FAILURE!
org.junit.ComparisonFailure: expected:<...<null>,
  charArray=[{
    a,
    A
  }],
  intArray=<null>,...> but was:<...<null>,
  charArray=[[C@75225d4a],
  intArray=<null>,...>
	at org.junit.Assert.assertEquals(Assert.java:115)
	at org.junit.Assert.assertEquals(Assert.java:144)
	at org.apache.commons.lang3.builder.MultilineRecursiveToStringStyleTest.charArray(MultilineRecursiveToStringStyleTest.java:131)

nestedElements(org.apache.commons.lang3.builder.MultilineRecursiveToStringStyleTest)  Time elapsed: 0.001 sec  <<< FAILURE!
org.junit.ComparisonFailure: expected:<...er@231ae15a[
  name=[Douglas Adams,
  bank=org.apache.commons.lang3.builder.MultilineRecursiveToStringStyleTest$Bank@39c0edb7[
    name=ASF Bank
  ]],
  accounts=<null>
...> but was:<...er@231ae15a[
  name=[java.lang.String@430e0623,
  bank=org.apache.commons.lang3.builder.MultilineRecursiveToStringStyleTest$Bank@39c0edb7],
  accounts=<null>
...>
	at org.junit.Assert.assertEquals(Assert.java:115)
	at org.junit.Assert.assertEquals(Assert.java:144)
	at org.apache.commons.lang3.builder.MultilineRecursiveToStringStyleTest.nestedElements(MultilineRecursiveToStringStyleTest.java:57)

boolArray(org.apache.commons.lang3.builder.MultilineRecursiveToStringStyleTest)  Time elapsed: 0 sec  <<< FAILURE!
org.junit.ComparisonFailure: expected:<...b50639[
  boolArray=[{
    true,
    false,
    true
  }],
  charArray=<null>...> but was:<...b50639[
  boolArray=[[Z@27abb00a],
  charArray=<null>...>
	at org.junit.Assert.assertEquals(Assert.java:115)
	at org.junit.Assert.assertEquals(Assert.java:144)
	at org.apache.commons.lang3.builder.MultilineRecursiveToStringStyleTest.boolArray(MultilineRecursiveToStringStyleTest.java:113)

Running org.apache.commons.lang3.builder.RecursiveToStringStyleTest
Tests run: 8, Failures: 5, Errors: 1, Skipped: 0, Time elapsed: 0.007 sec <<< FAILURE! - in org.apache.commons.lang3.builder.RecursiveToStringStyleTest
testObjectArray(org.apache.commons.lang3.builder.RecursiveToStringStyleTest)  Time elapsed: 0 sec  <<< ERROR!
java.lang.NullPointerException: null
	at org.apache.commons.lang3.builder.ToStringStyle.isRegistered(ToStringStyle.java:28)
	at org.apache.commons.lang3.builder.ToStringStyle.appendInternal(ToStringStyle.java:82)
	at org.apache.commons.lang3.builder.ToStringStyle.appendDetail(ToStringStyle.java:160)
	at org.apache.commons.lang3.builder.ToStringStyle.append(ToStringStyle.java:151)
	at org.apache.commons.lang3.builder.ToStringBuilder.append(ToStringBuilder.java:486)
	at org.apache.commons.lang3.builder.RecursiveToStringStyleTest.testObjectArray(RecursiveToStringStyleTest.java:107)

testLongArrayArray(org.apache.commons.lang3.builder.RecursiveToStringStyleTest)  Time elapsed: 0.001 sec  <<< FAILURE!
org.junit.ComparisonFailure: expected:<...g.Integer@66d89fb1[{[{1,2},<null>,{5}]}]> but was:<...g.Integer@66d89fb1[{[[J@c16d8ba,<null>,[J@2feea189]}]>
	at org.junit.Assert.assertEquals(Assert.java:115)
	at org.junit.Assert.assertEquals(Assert.java:144)
	at org.apache.commons.lang3.builder.RecursiveToStringStyleTest.testLongArrayArray(RecursiveToStringStyleTest.java:127)

testLongArray(org.apache.commons.lang3.builder.RecursiveToStringStyleTest)  Time elapsed: 0.001 sec  <<< FAILURE!
org.junit.ComparisonFailure: expected:<...ng.Integer@66d89fb1[[{1,2,-3,4}]]> but was:<...ng.Integer@66d89fb1[[[J@5baf41f4]]>
	at org.junit.Assert.assertEquals(Assert.java:115)
	at org.junit.Assert.assertEquals(Assert.java:144)
	at org.apache.commons.lang3.builder.RecursiveToStringStyleTest.testLongArray(RecursiveToStringStyleTest.java:118)

testObject(org.apache.commons.lang3.builder.RecursiveToStringStyleTest)  Time elapsed: 0.001 sec  <<< FAILURE!
org.junit.ComparisonFailure: expected:<....Integer@66d89fb1[a=[<size=0>]]> but was:<....Integer@66d89fb1[a=[java.util.ArrayList@4f132932]]>
	at org.junit.Assert.assertEquals(Assert.java:115)
	at org.junit.Assert.assertEquals(Assert.java:144)
	at org.apache.commons.lang3.builder.RecursiveToStringStyleTest.testObject(RecursiveToStringStyleTest.java:75)

testPerson(org.apache.commons.lang3.builder.RecursiveToStringStyleTest)  Time elapsed: 0.002 sec  <<< FAILURE!
org.junit.ComparisonFailure: expected:<...erson@72f5ba2c[name=[John Doe,age=33,smoker=false,job=org.apache.commons.lang3.builder.RecursiveToStringStyleTest$Job@6291d9aa[title=Manager]]]> but was:<...erson@72f5ba2c[name=[java.lang.String@77b1a17a,age=33,smoker=false,job=org.apache.commons.lang3.builder.RecursiveToStringStyleTest$Job@6291d9aa]]>
	at org.junit.Assert.assertEquals(Assert.java:115)
	at org.junit.Assert.assertEquals(Assert.java:144)
	at org.apache.commons.lang3.builder.RecursiveToStringStyleTest.testPerson(RecursiveToStringStyleTest.java:93)

testAppendSuper(org.apache.commons.lang3.builder.RecursiveToStringStyleTest)  Time elapsed: 0 sec  <<< FAILURE!
org.junit.ComparisonFailure: expected:<....Integer@66d89fb1[a=[hello]]> but was:<....Integer@66d89fb1[a=[java.lang.String@6fb117f0]]>
	at org.junit.Assert.assertEquals(Assert.java:115)
	at org.junit.Assert.assertEquals(Assert.java:144)
	at org.apache.commons.lang3.builder.RecursiveToStringStyleTest.testAppendSuper(RecursiveToStringStyleTest.java:60)

Running org.apache.commons.lang3.builder.DefaultToStringStyleTest
Tests run: 8, Failures: 5, Errors: 1, Skipped: 0, Time elapsed: 0.017 sec <<< FAILURE! - in org.apache.commons.lang3.builder.DefaultToStringStyleTest
testObjectArray(org.apache.commons.lang3.builder.DefaultToStringStyleTest)  Time elapsed: 0 sec  <<< ERROR!
java.lang.NullPointerException: null
	at org.apache.commons.lang3.builder.ToStringStyle.isRegistered(ToStringStyle.java:28)
	at org.apache.commons.lang3.builder.ToStringStyle.appendInternal(ToStringStyle.java:82)
	at org.apache.commons.lang3.builder.ToStringStyle.appendDetail(ToStringStyle.java:160)
	at org.apache.commons.lang3.builder.ToStringStyle.append(ToStringStyle.java:151)
	at org.apache.commons.lang3.builder.ToStringBuilder.append(ToStringBuilder.java:486)
	at org.apache.commons.lang3.builder.DefaultToStringStyleTest.testObjectArray(DefaultToStringStyleTest.java:104)

testLongArrayArray(org.apache.commons.lang3.builder.DefaultToStringStyleTest)  Time elapsed: 0 sec  <<< FAILURE!
org.junit.ComparisonFailure: expected:<...g.Integer@66d89fb1[{[{1,2},<null>,{5}]}]> but was:<...g.Integer@66d89fb1[{[[J@56b6d31c,<null>,[J@7cddffbd]}]>
	at org.junit.Assert.assertEquals(Assert.java:115)
	at org.junit.Assert.assertEquals(Assert.java:144)
	at org.apache.commons.lang3.builder.DefaultToStringStyleTest.testLongArrayArray(DefaultToStringStyleTest.java:124)

testLongArray(org.apache.commons.lang3.builder.DefaultToStringStyleTest)  Time elapsed: 0.001 sec  <<< FAILURE!
org.junit.ComparisonFailure: expected:<...ng.Integer@66d89fb1[[{1,2,-3,4}]]> but was:<...ng.Integer@66d89fb1[[[J@52c11156]]>
	at org.junit.Assert.assertEquals(Assert.java:115)
	at org.junit.Assert.assertEquals(Assert.java:144)
	at org.apache.commons.lang3.builder.DefaultToStringStyleTest.testLongArray(DefaultToStringStyleTest.java:115)

testObject(org.apache.commons.lang3.builder.DefaultToStringStyleTest)  Time elapsed: 0.001 sec  <<< FAILURE!
org.junit.ComparisonFailure: expected:<....Integer@66d89fb1[a=[<size=0>]]> but was:<....Integer@66d89fb1[a=[java.util.ArrayList@1594f8c]]>
	at org.junit.Assert.assertEquals(Assert.java:115)
	at org.junit.Assert.assertEquals(Assert.java:144)
	at org.apache.commons.lang3.builder.DefaultToStringStyleTest.testObject(DefaultToStringStyleTest.java:76)

testPerson(org.apache.commons.lang3.builder.DefaultToStringStyleTest)  Time elapsed: 0.001 sec  <<< FAILURE!
org.junit.ComparisonFailure: expected:<...Person@e757105[name=[John Doe],age=33,smoker=false...> but was:<...Person@e757105[name=[java.lang.String@77b1a17a],age=33,smoker=false...>
	at org.junit.Assert.assertEquals(Assert.java:115)
	at org.junit.Assert.assertEquals(Assert.java:144)
	at org.apache.commons.lang3.builder.DefaultToStringStyleTest.testPerson(DefaultToStringStyleTest.java:91)

testAppendSuper(org.apache.commons.lang3.builder.DefaultToStringStyleTest)  Time elapsed: 0.001 sec  <<< FAILURE!
org.junit.ComparisonFailure: expected:<....Integer@66d89fb1[a=[hello]]> but was:<....Integer@66d89fb1[a=[java.lang.String@6fb117f0]]>
	at org.junit.Assert.assertEquals(Assert.java:115)
	at org.junit.Assert.assertEquals(Assert.java:144)
	at org.apache.commons.lang3.builder.DefaultToStringStyleTest.testAppendSuper(DefaultToStringStyleTest.java:61)

Running org.apache.commons.lang3.builder.ReflectionToStringBuilderExcludeTest
Tests run: 11, Failures: 11, Errors: 0, Skipped: 0, Time elapsed: 0.002 sec <<< FAILURE! - in org.apache.commons.lang3.builder.ReflectionToStringBuilderExcludeTest
test_toStringExcludeEmptyCollection(org.apache.commons.lang3.builder.ReflectionToStringBuilderExcludeTest)  Time elapsed: 0 sec  <<< FAILURE!
java.lang.AssertionError: null
	at org.junit.Assert.fail(Assert.java:86)
	at org.junit.Assert.assertTrue(Assert.java:41)
	at org.junit.Assert.assertTrue(Assert.java:52)
	at org.apache.commons.lang3.builder.ReflectionToStringBuilderExcludeTest.validateSecretFieldPresent(ReflectionToStringBuilderExcludeTest.java:134)
	at org.apache.commons.lang3.builder.ReflectionToStringBuilderExcludeTest.test_toStringExcludeEmptyCollection(ReflectionToStringBuilderExcludeTest.java:108)

test_toStringExcludeArrayWithNull(org.apache.commons.lang3.builder.ReflectionToStringBuilderExcludeTest)  Time elapsed: 0 sec  <<< FAILURE!
java.lang.AssertionError: null
	at org.junit.Assert.fail(Assert.java:86)
	at org.junit.Assert.assertTrue(Assert.java:41)
	at org.junit.Assert.assertTrue(Assert.java:52)
	at org.apache.commons.lang3.builder.ReflectionToStringBuilderExcludeTest.validateSecretFieldPresent(ReflectionToStringBuilderExcludeTest.java:134)
	at org.apache.commons.lang3.builder.ReflectionToStringBuilderExcludeTest.test_toStringExcludeArrayWithNull(ReflectionToStringBuilderExcludeTest.java:65)

test_toStringExcludeArray(org.apache.commons.lang3.builder.ReflectionToStringBuilderExcludeTest)  Time elapsed: 0 sec  <<< FAILURE!
java.lang.AssertionError: null
	at org.junit.Assert.fail(Assert.java:86)
	at org.junit.Assert.assertTrue(Assert.java:41)
	at org.junit.Assert.assertTrue(Assert.java:52)
	at org.apache.commons.lang3.builder.ReflectionToStringBuilderExcludeTest.validateNonSecretField(ReflectionToStringBuilderExcludeTest.java:125)
	at org.apache.commons.lang3.builder.ReflectionToStringBuilderExcludeTest.validateSecretFieldAbsent(ReflectionToStringBuilderExcludeTest.java:130)
	at org.apache.commons.lang3.builder.ReflectionToStringBuilderExcludeTest.test_toStringExcludeArray(ReflectionToStringBuilderExcludeTest.java:59)

test_toStringExcludeNullCollection(org.apache.commons.lang3.builder.ReflectionToStringBuilderExcludeTest)  Time elapsed: 0 sec  <<< FAILURE!
java.lang.AssertionError: null
	at org.junit.Assert.fail(Assert.java:86)
	at org.junit.Assert.assertTrue(Assert.java:41)
	at org.junit.Assert.assertTrue(Assert.java:52)
	at org.apache.commons.lang3.builder.ReflectionToStringBuilderExcludeTest.validateSecretFieldPresent(ReflectionToStringBuilderExcludeTest.java:134)
	at org.apache.commons.lang3.builder.ReflectionToStringBuilderExcludeTest.test_toStringExcludeNullCollection(ReflectionToStringBuilderExcludeTest.java:120)

test_toStringExcludeCollection(org.apache.commons.lang3.builder.ReflectionToStringBuilderExcludeTest)  Time elapsed: 0 sec  <<< FAILURE!
java.lang.AssertionError: null
	at org.junit.Assert.fail(Assert.java:86)
	at org.junit.Assert.assertTrue(Assert.java:41)
	at org.junit.Assert.assertTrue(Assert.java:52)
	at org.apache.commons.lang3.builder.ReflectionToStringBuilderExcludeTest.validateNonSecretField(ReflectionToStringBuilderExcludeTest.java:125)
	at org.apache.commons.lang3.builder.ReflectionToStringBuilderExcludeTest.validateSecretFieldAbsent(ReflectionToStringBuilderExcludeTest.java:130)
	at org.apache.commons.lang3.builder.ReflectionToStringBuilderExcludeTest.test_toStringExcludeCollection(ReflectionToStringBuilderExcludeTest.java:79)

test_toStringExcludeNullArray(org.apache.commons.lang3.builder.ReflectionToStringBuilderExcludeTest)  Time elapsed: 0 sec  <<< FAILURE!
java.lang.AssertionError: null
	at org.junit.Assert.fail(Assert.java:86)
	at org.junit.Assert.assertTrue(Assert.java:41)
	at org.junit.Assert.assertTrue(Assert.java:52)
	at org.apache.commons.lang3.builder.ReflectionToStringBuilderExcludeTest.validateSecretFieldPresent(ReflectionToStringBuilderExcludeTest.java:134)
	at org.apache.commons.lang3.builder.ReflectionToStringBuilderExcludeTest.test_toStringExcludeNullArray(ReflectionToStringBuilderExcludeTest.java:114)

test_toStringExcludeEmptyArray(org.apache.commons.lang3.builder.ReflectionToStringBuilderExcludeTest)  Time elapsed: 0 sec  <<< FAILURE!
java.lang.AssertionError: null
	at org.junit.Assert.fail(Assert.java:86)
	at org.junit.Assert.assertTrue(Assert.java:41)
	at org.junit.Assert.assertTrue(Assert.java:52)
	at org.apache.commons.lang3.builder.ReflectionToStringBuilderExcludeTest.validateSecretFieldPresent(ReflectionToStringBuilderExcludeTest.java:134)
	at org.apache.commons.lang3.builder.ReflectionToStringBuilderExcludeTest.test_toStringExcludeEmptyArray(ReflectionToStringBuilderExcludeTest.java:102)

test_toStringExclude(org.apache.commons.lang3.builder.ReflectionToStringBuilderExcludeTest)  Time elapsed: 0 sec  <<< FAILURE!
java.lang.AssertionError: null
	at org.junit.Assert.fail(Assert.java:86)
	at org.junit.Assert.assertTrue(Assert.java:41)
	at org.junit.Assert.assertTrue(Assert.java:52)
	at org.apache.commons.lang3.builder.ReflectionToStringBuilderExcludeTest.validateNonSecretField(ReflectionToStringBuilderExcludeTest.java:125)
	at org.apache.commons.lang3.builder.ReflectionToStringBuilderExcludeTest.validateSecretFieldAbsent(ReflectionToStringBuilderExcludeTest.java:130)
	at org.apache.commons.lang3.builder.ReflectionToStringBuilderExcludeTest.test_toStringExclude(ReflectionToStringBuilderExcludeTest.java:53)

test_toStringExcludeCollectionWithNulls(org.apache.commons.lang3.builder.ReflectionToStringBuilderExcludeTest)  Time elapsed: 0 sec  <<< FAILURE!
java.lang.AssertionError: null
	at org.junit.Assert.fail(Assert.java:86)
	at org.junit.Assert.assertTrue(Assert.java:41)
	at org.junit.Assert.assertTrue(Assert.java:52)
	at org.apache.commons.lang3.builder.ReflectionToStringBuilderExcludeTest.validateSecretFieldPresent(ReflectionToStringBuilderExcludeTest.java:134)
	at org.apache.commons.lang3.builder.ReflectionToStringBuilderExcludeTest.test_toStringExcludeCollectionWithNulls(ReflectionToStringBuilderExcludeTest.java:96)

test_toStringExcludeArrayWithNulls(org.apache.commons.lang3.builder.ReflectionToStringBuilderExcludeTest)  Time elapsed: 0 sec  <<< FAILURE!
java.lang.AssertionError: null
	at org.junit.Assert.fail(Assert.java:86)
	at org.junit.Assert.assertTrue(Assert.java:41)
	at org.junit.Assert.assertTrue(Assert.java:52)
	at org.apache.commons.lang3.builder.ReflectionToStringBuilderExcludeTest.validateSecretFieldPresent(ReflectionToStringBuilderExcludeTest.java:134)
	at org.apache.commons.lang3.builder.ReflectionToStringBuilderExcludeTest.test_toStringExcludeArrayWithNulls(ReflectionToStringBuilderExcludeTest.java:71)

test_toStringExcludeCollectionWithNull(org.apache.commons.lang3.builder.ReflectionToStringBuilderExcludeTest)  Time elapsed: 0 sec  <<< FAILURE!
java.lang.AssertionError: null
	at org.junit.Assert.fail(Assert.java:86)
	at org.junit.Assert.assertTrue(Assert.java:41)
	at org.junit.Assert.assertTrue(Assert.java:52)
	at org.apache.commons.lang3.builder.ReflectionToStringBuilderExcludeTest.validateSecretFieldPresent(ReflectionToStringBuilderExcludeTest.java:134)
	at org.apache.commons.lang3.builder.ReflectionToStringBuilderExcludeTest.test_toStringExcludeCollectionWithNull(ReflectionToStringBuilderExcludeTest.java:87)

Running org.apache.commons.lang3.builder.StandardToStringStyleTest
Tests run: 8, Failures: 5, Errors: 1, Skipped: 0, Time elapsed: 0.001 sec <<< FAILURE! - in org.apache.commons.lang3.builder.StandardToStringStyleTest
testObjectArray(org.apache.commons.lang3.builder.StandardToStringStyleTest)  Time elapsed: 0 sec  <<< ERROR!
java.lang.NullPointerException: null
	at org.apache.commons.lang3.builder.ToStringStyle.isRegistered(ToStringStyle.java:28)
	at org.apache.commons.lang3.builder.ToStringStyle.appendInternal(ToStringStyle.java:82)
	at org.apache.commons.lang3.builder.ToStringStyle.appendDetail(ToStringStyle.java:160)
	at org.apache.commons.lang3.builder.ToStringStyle.append(ToStringStyle.java:151)
	at org.apache.commons.lang3.builder.ToStringBuilder.append(ToStringBuilder.java:486)
	at org.apache.commons.lang3.builder.StandardToStringStyleTest.testObjectArray(StandardToStringStyleTest.java:119)

testLongArrayArray(org.apache.commons.lang3.builder.StandardToStringStyleTest)  Time elapsed: 0 sec  <<< FAILURE!
org.junit.ComparisonFailure: expected:<Integer[[[[1, 2], %NULL%, [5]]]]> but was:<Integer[[[[J@158412e1, %NULL%, [J@11f37cd0]]]>
	at org.junit.Assert.assertEquals(Assert.java:115)
	at org.junit.Assert.assertEquals(Assert.java:144)
	at org.apache.commons.lang3.builder.StandardToStringStyleTest.testLongArrayArray(StandardToStringStyleTest.java:139)

testLongArray(org.apache.commons.lang3.builder.StandardToStringStyleTest)  Time elapsed: 0.001 sec  <<< FAILURE!
org.junit.ComparisonFailure: expected:<Integer[[[1, 2, -3, 4]]]> but was:<Integer[[[J@88744e5]]>
	at org.junit.Assert.assertEquals(Assert.java:115)
	at org.junit.Assert.assertEquals(Assert.java:144)
	at org.apache.commons.lang3.builder.StandardToStringStyleTest.testLongArray(StandardToStringStyleTest.java:130)

testObject(org.apache.commons.lang3.builder.StandardToStringStyleTest)  Time elapsed: 0 sec  <<< FAILURE!
org.junit.ComparisonFailure: expected:<Integer[a=[%SIZE=0%]]> but was:<Integer[a=[java.util.ArrayList@68bc1ac2]]>
	at org.junit.Assert.assertEquals(Assert.java:115)
	at org.junit.Assert.assertEquals(Assert.java:144)
	at org.apache.commons.lang3.builder.StandardToStringStyleTest.testObject(StandardToStringStyleTest.java:91)

testPerson(org.apache.commons.lang3.builder.StandardToStringStyleTest)  Time elapsed: 0 sec  <<< FAILURE!
org.junit.ComparisonFailure: expected:<...yleTest.Person[name=[Suzy Queue],age=19,smoker=false...> but was:<...yleTest.Person[name=[java.lang.String@4317f2b1],age=19,smoker=false...>
	at org.junit.Assert.assertEquals(Assert.java:115)
	at org.junit.Assert.assertEquals(Assert.java:144)
	at org.apache.commons.lang3.builder.StandardToStringStyleTest.testPerson(StandardToStringStyleTest.java:106)

testAppendSuper(org.apache.commons.lang3.builder.StandardToStringStyleTest)  Time elapsed: 0 sec  <<< FAILURE!
org.junit.ComparisonFailure: expected:<Integer[a=[hello]]> but was:<Integer[a=[java.lang.String@6fb117f0]]>
	at org.junit.Assert.assertEquals(Assert.java:115)
	at org.junit.Assert.assertEquals(Assert.java:144)
	at org.apache.commons.lang3.builder.StandardToStringStyleTest.testAppendSuper(StandardToStringStyleTest.java:76)

Running org.apache.commons.lang3.builder.ToStringStyleTest
Tests run: 12, Failures: 0, Errors: 0, Skipped: 0, Time elapsed: 0.002 sec - in org.apache.commons.lang3.builder.ToStringStyleTest
Running org.apache.commons.lang3.builder.DiffTest
Tests run: 4, Failures: 0, Errors: 0, Skipped: 0, Time elapsed: 0 sec - in org.apache.commons.lang3.builder.DiffTest
Running org.apache.commons.lang3.builder.SimpleToStringStyleTest
Tests run: 8, Failures: 0, Errors: 6, Skipped: 0, Time elapsed: 0.006 sec <<< FAILURE! - in org.apache.commons.lang3.builder.SimpleToStringStyleTest
testObjectArray(org.apache.commons.lang3.builder.SimpleToStringStyleTest)  Time elapsed: 0 sec  <<< ERROR!
java.lang.NullPointerException: null
	at org.apache.commons.lang3.builder.ToStringStyle.isRegistered(ToStringStyle.java:28)
	at org.apache.commons.lang3.builder.ToStringStyle.appendInternal(ToStringStyle.java:82)
	at org.apache.commons.lang3.builder.ToStringStyle.appendDetail(ToStringStyle.java:160)
	at org.apache.commons.lang3.builder.ToStringStyle.append(ToStringStyle.java:151)
	at org.apache.commons.lang3.builder.ToStringBuilder.append(ToStringBuilder.java:486)
	at org.apache.commons.lang3.builder.SimpleToStringStyleTest.testObjectArray(SimpleToStringStyleTest.java:102)

testLongArrayArray(org.apache.commons.lang3.builder.SimpleToStringStyleTest)  Time elapsed: 0.001 sec  <<< ERROR!
java.lang.NullPointerException: null
	at org.apache.commons.lang3.builder.ToStringStyle.isRegistered(ToStringStyle.java:28)
	at org.apache.commons.lang3.builder.ToStringStyle.appendInternal(ToStringStyle.java:82)
	at org.apache.commons.lang3.builder.ToStringStyle.appendDetail(ToStringStyle.java:160)
	at org.apache.commons.lang3.builder.ToStringStyle.append(ToStringStyle.java:151)
	at org.apache.commons.lang3.builder.ToStringBuilder.append(ToStringBuilder.java:486)
	at org.apache.commons.lang3.builder.SimpleToStringStyleTest.testLongArrayArray(SimpleToStringStyleTest.java:122)

testLongArray(org.apache.commons.lang3.builder.SimpleToStringStyleTest)  Time elapsed: 0 sec  <<< ERROR!
java.lang.NullPointerException: null
	at org.apache.commons.lang3.builder.ToStringStyle.isRegistered(ToStringStyle.java:28)
	at org.apache.commons.lang3.builder.ToStringStyle.appendInternal(ToStringStyle.java:82)
	at org.apache.commons.lang3.builder.ToStringStyle.append(ToStringStyle.java:80)
	at org.apache.commons.lang3.builder.ToStringBuilder.append(ToStringBuilder.java:472)
	at org.apache.commons.lang3.builder.SimpleToStringStyleTest.testLongArray(SimpleToStringStyleTest.java:113)

testObject(org.apache.commons.lang3.builder.SimpleToStringStyleTest)  Time elapsed: 0 sec  <<< ERROR!
java.lang.NullPointerException: null
	at org.apache.commons.lang3.builder.ToStringStyle.isRegistered(ToStringStyle.java:28)
	at org.apache.commons.lang3.builder.ToStringStyle.appendInternal(ToStringStyle.java:82)
	at org.apache.commons.lang3.builder.ToStringStyle.append(ToStringStyle.java:80)
	at org.apache.commons.lang3.builder.ToStringBuilder.append(ToStringBuilder.java:472)
	at org.apache.commons.lang3.builder.SimpleToStringStyleTest.testObject(SimpleToStringStyleTest.java:70)

testPerson(org.apache.commons.lang3.builder.SimpleToStringStyleTest)  Time elapsed: 0.001 sec  <<< ERROR!
java.lang.NullPointerException: null
	at org.apache.commons.lang3.builder.ToStringStyle.isRegistered(ToStringStyle.java:28)
	at org.apache.commons.lang3.builder.ToStringStyle.appendInternal(ToStringStyle.java:82)
	at org.apache.commons.lang3.builder.ToStringStyle.append(ToStringStyle.java:80)
	at org.apache.commons.lang3.builder.ToStringBuilder.append(ToStringBuilder.java:848)
	at org.apache.commons.lang3.builder.SimpleToStringStyleTest.testPerson(SimpleToStringStyleTest.java:89)

testAppendSuper(org.apache.commons.lang3.builder.SimpleToStringStyleTest)  Time elapsed: 0.001 sec  <<< ERROR!
java.lang.NullPointerException: null
	at org.apache.commons.lang3.builder.ToStringStyle.isRegistered(ToStringStyle.java:28)
	at org.apache.commons.lang3.builder.ToStringStyle.appendInternal(ToStringStyle.java:82)
	at org.apache.commons.lang3.builder.ToStringStyle.append(ToStringStyle.java:80)
	at org.apache.commons.lang3.builder.ToStringBuilder.append(ToStringBuilder.java:848)
	at org.apache.commons.lang3.builder.SimpleToStringStyleTest.testAppendSuper(SimpleToStringStyleTest.java:60)

Running org.apache.commons.lang3.builder.MultiLineToStringStyleTest
Tests run: 8, Failures: 5, Errors: 1, Skipped: 0, Time elapsed: 0.008 sec <<< FAILURE! - in org.apache.commons.lang3.builder.MultiLineToStringStyleTest
testObjectArray(org.apache.commons.lang3.builder.MultiLineToStringStyleTest)  Time elapsed: 0.003 sec  <<< ERROR!
java.lang.NullPointerException: null
	at org.apache.commons.lang3.builder.ToStringStyle.isRegistered(ToStringStyle.java:28)
	at org.apache.commons.lang3.builder.ToStringStyle.appendInternal(ToStringStyle.java:82)
	at org.apache.commons.lang3.builder.ToStringStyle.appendDetail(ToStringStyle.java:160)
	at org.apache.commons.lang3.builder.ToStringStyle.append(ToStringStyle.java:151)
	at org.apache.commons.lang3.builder.ToStringBuilder.append(ToStringBuilder.java:486)
	at org.apache.commons.lang3.builder.MultiLineToStringStyleTest.testObjectArray(MultiLineToStringStyleTest.java:105)

testLongArrayArray(org.apache.commons.lang3.builder.MultiLineToStringStyleTest)  Time elapsed: 0 sec  <<< FAILURE!
org.junit.ComparisonFailure: expected:<...nteger@66d89fb1[
  {[{1,2},<null>,{5}]}
]> but was:<...nteger@66d89fb1[
  {[[J@593e64e0,<null>,[J@f50dbe6]}
]>
	at org.junit.Assert.assertEquals(Assert.java:115)
	at org.junit.Assert.assertEquals(Assert.java:144)
	at org.apache.commons.lang3.builder.MultiLineToStringStyleTest.testLongArrayArray(MultiLineToStringStyleTest.java:125)

testLongArray(org.apache.commons.lang3.builder.MultiLineToStringStyleTest)  Time elapsed: 0.001 sec  <<< FAILURE!
org.junit.ComparisonFailure: expected:<...Integer@66d89fb1[
  [{1,2,-3,4}]
]> but was:<...Integer@66d89fb1[
  [[J@594e0e5]
]>
	at org.junit.Assert.assertEquals(Assert.java:115)
	at org.junit.Assert.assertEquals(Assert.java:144)
	at org.apache.commons.lang3.builder.MultiLineToStringStyleTest.testLongArray(MultiLineToStringStyleTest.java:116)

testObject(org.apache.commons.lang3.builder.MultiLineToStringStyleTest)  Time elapsed: 0.001 sec  <<< FAILURE!
org.junit.ComparisonFailure: expected:<...teger@66d89fb1[
  a=[<size=0>]
]> but was:<...teger@66d89fb1[
  a=[java.util.ArrayList@7138dd3f]
]>
	at org.junit.Assert.assertEquals(Assert.java:115)
	at org.junit.Assert.assertEquals(Assert.java:144)
	at org.apache.commons.lang3.builder.MultiLineToStringStyleTest.testObject(MultiLineToStringStyleTest.java:77)

testPerson(org.apache.commons.lang3.builder.MultiLineToStringStyleTest)  Time elapsed: 0 sec  <<< FAILURE!
org.junit.ComparisonFailure: expected:<...on@4c458d2b[
  name=[Jane Doe]
  age=25
  smoker=t...> but was:<...on@4c458d2b[
  name=[java.lang.String@6a37292b]
  age=25
  smoker=t...>
	at org.junit.Assert.assertEquals(Assert.java:115)
	at org.junit.Assert.assertEquals(Assert.java:144)
	at org.apache.commons.lang3.builder.MultiLineToStringStyleTest.testPerson(MultiLineToStringStyleTest.java:92)

testAppendSuper(org.apache.commons.lang3.builder.MultiLineToStringStyleTest)  Time elapsed: 0 sec  <<< FAILURE!
org.junit.ComparisonFailure: expected:<...teger@66d89fb1[
  a=[hello]
]> but was:<...teger@66d89fb1[
  a=[java.lang.String@6fb117f0]
]>
	at org.junit.Assert.assertEquals(Assert.java:115)
	at org.junit.Assert.assertEquals(Assert.java:144)
	at org.apache.commons.lang3.builder.MultiLineToStringStyleTest.testAppendSuper(MultiLineToStringStyleTest.java:62)

Running org.apache.commons.lang3.builder.ToStringStyleConcurrencyTest
Tests run: 3, Failures: 0, Errors: 0, Skipped: 0, Time elapsed: 0.06 sec - in org.apache.commons.lang3.builder.ToStringStyleConcurrencyTest
Running org.apache.commons.lang3.builder.ReflectionToStringBuilderMutateInspectConcurrencyTest
Tests run: 1, Failures: 0, Errors: 0, Skipped: 1, Time elapsed: 0.004 sec - in org.apache.commons.lang3.builder.ReflectionToStringBuilderMutateInspectConcurrencyTest
Running org.apache.commons.lang3.builder.ToStringBuilderTest
Tests run: 74, Failures: 39, Errors: 1, Skipped: 1, Time elapsed: 0.036 sec <<< FAILURE! - in org.apache.commons.lang3.builder.ToStringBuilderTest
testCharArray(org.apache.commons.lang3.builder.ToStringBuilderTest)  Time elapsed: 0 sec  <<< FAILURE!
org.junit.ComparisonFailure: expected:<...ng.Integer@66d89fb1[[{A,2,_,D}]]> but was:<...ng.Integer@66d89fb1[[[C@778d1cbd]]>
	at org.junit.Assert.assertEquals(Assert.java:115)
	at org.junit.Assert.assertEquals(Assert.java:144)
	at org.apache.commons.lang3.builder.ToStringBuilderTest.testCharArray(ToStringBuilderTest.java:768)

testDoubleArrayArray(org.apache.commons.lang3.builder.ToStringBuilderTest)  Time elapsed: 0 sec  <<< FAILURE!
org.junit.ComparisonFailure: expected:<...g.Integer@66d89fb1[{[{1.0,2.29686},<null>,{NaN}]}]> but was:<...g.Integer@66d89fb1[{[[D@9a0e408,<null>,[D@21dace28]}]>
	at org.junit.Assert.assertEquals(Assert.java:115)
	at org.junit.Assert.assertEquals(Assert.java:144)
	at org.apache.commons.lang3.builder.ToStringBuilderTest.testDoubleArrayArray(ToStringBuilderTest.java:857)

testObjectArray(org.apache.commons.lang3.builder.ToStringBuilderTest)  Time elapsed: 0.002 sec  <<< ERROR!
java.lang.NullPointerException: null
	at org.apache.commons.lang3.builder.ToStringStyle.isRegistered(ToStringStyle.java:28)
	at org.apache.commons.lang3.builder.ToStringStyle.appendInternal(ToStringStyle.java:82)
	at org.apache.commons.lang3.builder.ToStringStyle.appendDetail(ToStringStyle.java:160)
	at org.apache.commons.lang3.builder.ToStringStyle.append(ToStringStyle.java:151)
	at org.apache.commons.lang3.builder.ToStringBuilder.append(ToStringBuilder.java:486)
	at org.apache.commons.lang3.builder.ToStringBuilderTest.testObjectArray(ToStringBuilderTest.java:717)

testObjectBuild(org.apache.commons.lang3.builder.ToStringBuilderTest)  Time elapsed: 0 sec  <<< FAILURE!
org.junit.ComparisonFailure: expected:<....Integer@66d89fb1[a=[<size=0>]]> but was:<....Integer@66d89fb1[a=[java.util.ArrayList@315eba99]]>
	at org.junit.Assert.assertEquals(Assert.java:115)
	at org.junit.Assert.assertEquals(Assert.java:144)
	at org.apache.commons.lang3.builder.ToStringBuilderTest.testObjectBuild(ToStringBuilderTest.java:647)

testObjectCycle(org.apache.commons.lang3.builder.ToStringBuilderTest)  Time elapsed: 0 sec  <<< FAILURE!
org.junit.ComparisonFailure: expected:<...$ObjectCycle@2d8cc78[[org.apache.commons.lang3.builder.ToStringBuilderTest$ObjectCycle@422cac21]]]> but was:<...$ObjectCycle@2d8cc78[]]>
	at org.junit.Assert.assertEquals(Assert.java:115)
	at org.junit.Assert.assertEquals(Assert.java:144)
	at org.apache.commons.lang3.builder.ToStringBuilderTest.testObjectCycle(ToStringBuilderTest.java:892)

testSelfInstanceTwoVarsReflectionObjectCycle(org.apache.commons.lang3.builder.ToStringBuilderTest)  Time elapsed: 0.001 sec  <<< FAILURE!
org.junit.ComparisonFailure: expected:<...@46e5dce1,otherType=[The Other Type]]> but was:<...@46e5dce1,otherType=[java.lang.String@fd94e60]]>
	at org.junit.Assert.assertEquals(Assert.java:115)
	at org.junit.Assert.assertEquals(Assert.java:144)
	at org.apache.commons.lang3.builder.ToStringBuilderTest.testSelfInstanceTwoVarsReflectionObjectCycle(ToStringBuilderTest.java:549)

testShortArrayArray(org.apache.commons.lang3.builder.ToStringBuilderTest)  Time elapsed: 0 sec  <<< FAILURE!
org.junit.ComparisonFailure: expected:<...g.Integer@66d89fb1[{[{1,2},<null>,{5}]}]> but was:<...g.Integer@66d89fb1[{[[S@275a83d,<null>,[S@7a783e0d]}]>
	at org.junit.Assert.assertEquals(Assert.java:115)
	at org.junit.Assert.assertEquals(Assert.java:144)
	at org.apache.commons.lang3.builder.ToStringBuilderTest.testShortArrayArray(ToStringBuilderTest.java:827)

testBooleanArrayArray(org.apache.commons.lang3.builder.ToStringBuilderTest)  Time elapsed: 0 sec  <<< FAILURE!
org.junit.ComparisonFailure: expected:<...g.Integer@66d89fb1[{[{true,false},<null>,{false}]}]> but was:<...g.Integer@66d89fb1[{[[Z@6c32064b,<null>,[Z@483b5d6b]}]>
	at org.junit.Assert.assertEquals(Assert.java:115)
	at org.junit.Assert.assertEquals(Assert.java:144)
	at org.apache.commons.lang3.builder.ToStringBuilderTest.testBooleanArrayArray(ToStringBuilderTest.java:877)

testFloatArray(org.apache.commons.lang3.builder.ToStringBuilderTest)  Time elapsed: 0 sec  <<< FAILURE!
org.junit.ComparisonFailure: expected:<...ng.Integer@66d89fb1[[{1.0,2.9876,-3.00001,4.3}]]> but was:<...ng.Integer@66d89fb1[[[F@317240d9]]>
	at org.junit.Assert.assertEquals(Assert.java:115)
	at org.junit.Assert.assertEquals(Assert.java:144)
	at org.apache.commons.lang3.builder.ToStringBuilderTest.testFloatArray(ToStringBuilderTest.java:788)

testByteArray(org.apache.commons.lang3.builder.ToStringBuilderTest)  Time elapsed: 0 sec  <<< FAILURE!
org.junit.ComparisonFailure: expected:<...ng.Integer@66d89fb1[[{1,2,-3,4}]]> but was:<...ng.Integer@66d89fb1[[[B@7040f445]]>
	at org.junit.Assert.assertEquals(Assert.java:115)
	at org.junit.Assert.assertEquals(Assert.java:144)
	at org.apache.commons.lang3.builder.ToStringBuilderTest.testByteArray(ToStringBuilderTest.java:758)

testReflectionLongArrayArray(org.apache.commons.lang3.builder.ToStringBuilderTest)  Time elapsed: 0 sec  <<< FAILURE!
org.junit.ComparisonFailure: expected:<[[J@74ef95c6[{[{1,2},<null>,{5}]}]> but was:<[[J@74ef95c6[{[[J@1d523624,<null>,[J@608486]}]>
	at org.junit.Assert.assertEquals(Assert.java:115)
	at org.junit.Assert.assertEquals(Assert.java:144)
	at org.apache.commons.lang3.builder.ToStringBuilderTest.testReflectionLongArrayArray(ToStringBuilderTest.java:253)

testReflectionArrayArrayCycle(org.apache.commons.lang3.builder.ToStringBuilderTest)  Time elapsed: 0 sec  <<< FAILURE!
org.junit.ComparisonFailure: expected:<...g.Object;@409c799b[{[{[[Ljava.lang.Object;@409c799b,[[Ljava.lang.Object;@409c799b},{[[Ljava.lang.Object;@409c799b,[[Ljava.lang.Object;@409c799b}]}]> but was:<...g.Object;@409c799b[{[[Ljava.lang.Object;@60f3d040,[Ljava.lang.Object;@26ed4b7a]}]>
	at org.junit.Assert.assertEquals(Assert.java:115)
	at org.junit.Assert.assertEquals(Assert.java:144)
	at org.apache.commons.lang3.builder.ToStringBuilderTest.testReflectionArrayArrayCycle(ToStringBuilderTest.java:432)

testLongArrayArray(org.apache.commons.lang3.builder.ToStringBuilderTest)  Time elapsed: 0 sec  <<< FAILURE!
org.junit.ComparisonFailure: expected:<...g.Integer@66d89fb1[{[{1,2},<null>,{5}]}]> but was:<...g.Integer@66d89fb1[{[[J@259881f0,<null>,[J@3f7ac6d8]}]>
	at org.junit.Assert.assertEquals(Assert.java:115)
	at org.junit.Assert.assertEquals(Assert.java:144)
	at org.apache.commons.lang3.builder.ToStringBuilderTest.testLongArrayArray(ToStringBuilderTest.java:807)

testReflectionDoubleArrayArray(org.apache.commons.lang3.builder.ToStringBuilderTest)  Time elapsed: 0 sec  <<< FAILURE!
org.junit.ComparisonFailure: expected:<[[D@1594af77[{[{1.0,2.29686},<null>,{NaN}]}]> but was:<[[D@1594af77[{[[D@548bb8b2,<null>,[D@210ad97b]}]>
	at org.junit.Assert.assertEquals(Assert.java:115)
	at org.junit.Assert.assertEquals(Assert.java:144)
	at org.apache.commons.lang3.builder.ToStringBuilderTest.testReflectionDoubleArrayArray(ToStringBuilderTest.java:298)

testBooleanArray(org.apache.commons.lang3.builder.ToStringBuilderTest)  Time elapsed: 0 sec  <<< FAILURE!
org.junit.ComparisonFailure: expected:<...ng.Integer@66d89fb1[[{true,false,false}]]> but was:<...ng.Integer@66d89fb1[[[Z@11a74355]]>
	at org.junit.Assert.assertEquals(Assert.java:115)
	at org.junit.Assert.assertEquals(Assert.java:144)
	at org.apache.commons.lang3.builder.ToStringBuilderTest.testBooleanArray(ToStringBuilderTest.java:798)

testFloatArrayArray(org.apache.commons.lang3.builder.ToStringBuilderTest)  Time elapsed: 0 sec  <<< FAILURE!
org.junit.ComparisonFailure: expected:<...g.Integer@66d89fb1[{[{1.0,2.29686},<null>,{NaN}]}]> but was:<...g.Integer@66d89fb1[{[[F@7c358a80,<null>,[F@1f181935]}]>
	at org.junit.Assert.assertEquals(Assert.java:115)
	at org.junit.Assert.assertEquals(Assert.java:144)
	at org.apache.commons.lang3.builder.ToStringBuilderTest.testFloatArrayArray(ToStringBuilderTest.java:867)

testReflectionIntArrayArray(org.apache.commons.lang3.builder.ToStringBuilderTest)  Time elapsed: 0 sec  <<< FAILURE!
org.junit.ComparisonFailure: expected:<[[I@8beab46[{[{1,2},<null>,{5}]}]> but was:<[[I@8beab46[{[[I@1dde8526,<null>,[I@7bf7911b]}]>
	at org.junit.Assert.assertEquals(Assert.java:115)
	at org.junit.Assert.assertEquals(Assert.java:144)
	at org.apache.commons.lang3.builder.ToStringBuilderTest.testReflectionIntArrayArray(ToStringBuilderTest.java:262)

testSimpleReflectionStatics(org.apache.commons.lang3.builder.ToStringBuilderTest)  Time elapsed: 0.001 sec  <<< FAILURE!
org.junit.ComparisonFailure: expected:<...50b410[staticString=[staticString],staticInt=12345]> but was:<...50b410[staticString=[java.lang.String@20a8a84c],staticInt=12345]>
	at org.junit.Assert.assertEquals(Assert.java:115)
	at org.junit.Assert.assertEquals(Assert.java:144)
	at org.apache.commons.lang3.builder.ToStringBuilderTest.testSimpleReflectionStatics(ToStringBuilderTest.java:907)

testReflectionStatics(org.apache.commons.lang3.builder.ToStringBuilderTest)  Time elapsed: 0.001 sec  <<< FAILURE!
org.junit.ComparisonFailure: expected:<...5d5d35[staticString=[staticString,staticInt=12345,instanceString=instanceString],instanceInt=67890]> but was:<...5d5d35[staticString=[java.lang.String@20a8a84c,staticInt=12345,instanceString=java.lang.String@171f6179],instanceInt=67890]>
	at org.junit.Assert.assertEquals(Assert.java:115)
	at org.junit.Assert.assertEquals(Assert.java:144)
	at org.apache.commons.lang3.builder.ToStringBuilderTest.testReflectionStatics(ToStringBuilderTest.java:927)

testReflectionhortArrayArray(org.apache.commons.lang3.builder.ToStringBuilderTest)  Time elapsed: 0.001 sec  <<< FAILURE!
org.junit.ComparisonFailure: expected:<[[S@6ed0cc34[{[{1,2},<null>,{5}]}]> but was:<[[S@6ed0cc34[{[[S@4e0ea2c2,<null>,[S@22df9697]}]>
	at org.junit.Assert.assertEquals(Assert.java:115)
	at org.junit.Assert.assertEquals(Assert.java:144)
	at org.apache.commons.lang3.builder.ToStringBuilderTest.testReflectionhortArrayArray(ToStringBuilderTest.java:271)

testReflectionObjectArray(org.apache.commons.lang3.builder.ToStringBuilderTest)  Time elapsed: 0 sec  <<< FAILURE!
org.junit.ComparisonFailure: expected:<...;@517a564[{<null>,5,[{3,6}]}]> but was:<...;@517a564[{<null>,5,[[I@536b4ad8]}]>
	at org.junit.Assert.assertEquals(Assert.java:115)
	at org.junit.Assert.assertEquals(Assert.java:144)
	at org.apache.commons.lang3.builder.ToStringBuilderTest.testReflectionObjectArray(ToStringBuilderTest.java:160)

testReflectionObjectCycle(org.apache.commons.lang3.builder.ToStringBuilderTest)  Time elapsed: 0.002 sec  <<< FAILURE!
org.junit.ComparisonFailure: expected:<...nTestCycleB@727f6c7d[[a=org.apache.commons.lang3.builder.ToStringBuilderTest$ReflectionTestCycleA@28fed5b1]]]> but was:<...nTestCycleB@727f6c7d[]]>
	at org.junit.Assert.assertEquals(Assert.java:115)
	at org.junit.Assert.assertEquals(Assert.java:144)
	at org.apache.commons.lang3.builder.ToStringBuilderTest.testReflectionObjectCycle(ToStringBuilderTest.java:562)

testReflectionBooleanArrayArray(org.apache.commons.lang3.builder.ToStringBuilderTest)  Time elapsed: 0 sec  <<< FAILURE!
org.junit.ComparisonFailure: expected:<[[Z@381702ff[{[{true,false},<null>,{false}]}]> but was:<[[Z@381702ff[{[[Z@6ec5d01d,<null>,[Z@7ce258bb]}]>
	at org.junit.Assert.assertEquals(Assert.java:115)
	at org.junit.Assert.assertEquals(Assert.java:144)
	at org.apache.commons.lang3.builder.ToStringBuilderTest.testReflectionBooleanArrayArray(ToStringBuilderTest.java:307)

testLongArray(org.apache.commons.lang3.builder.ToStringBuilderTest)  Time elapsed: 0 sec  <<< FAILURE!
org.junit.ComparisonFailure: expected:<...ng.Integer@66d89fb1[[{1,2,-3,4}]]> but was:<...ng.Integer@66d89fb1[[[J@702f9d0a]]>
	at org.junit.Assert.assertEquals(Assert.java:115)
	at org.junit.Assert.assertEquals(Assert.java:144)
	at org.apache.commons.lang3.builder.ToStringBuilderTest.testLongArray(ToStringBuilderTest.java:728)

testShortArray(org.apache.commons.lang3.builder.ToStringBuilderTest)  Time elapsed: 0.001 sec  <<< FAILURE!
org.junit.ComparisonFailure: expected:<...ng.Integer@66d89fb1[[{1,2,-3,4}]]> but was:<...ng.Integer@66d89fb1[[[S@6cc986d2]]>
	at org.junit.Assert.assertEquals(Assert.java:115)
	at org.junit.Assert.assertEquals(Assert.java:144)
	at org.apache.commons.lang3.builder.ToStringBuilderTest.testShortArray(ToStringBuilderTest.java:748)

testIntArrayArray(org.apache.commons.lang3.builder.ToStringBuilderTest)  Time elapsed: 0 sec  <<< FAILURE!
org.junit.ComparisonFailure: expected:<...g.Integer@66d89fb1[{[{1,2},<null>,{5}]}]> but was:<...g.Integer@66d89fb1[{[[I@22b27cca,<null>,[I@741ec391]}]>
	at org.junit.Assert.assertEquals(Assert.java:115)
	at org.junit.Assert.assertEquals(Assert.java:144)
	at org.apache.commons.lang3.builder.ToStringBuilderTest.testIntArrayArray(ToStringBuilderTest.java:817)

testInheritedReflectionStatics(org.apache.commons.lang3.builder.ToStringBuilderTest)  Time elapsed: 0.001 sec  <<< FAILURE!
org.junit.ComparisonFailure: expected:<...de560[staticString2=[staticString2],staticInt2=67890]> but was:<...de560[staticString2=[java.lang.String@260a68c8],staticInt2=67890]>
	at org.junit.Assert.assertEquals(Assert.java:115)
	at org.junit.Assert.assertEquals(Assert.java:144)
	at org.apache.commons.lang3.builder.ToStringBuilderTest.testInheritedReflectionStatics(ToStringBuilderTest.java:947)

testReflectionByteArrayArray(org.apache.commons.lang3.builder.ToStringBuilderTest)  Time elapsed: 0 sec  <<< FAILURE!
org.junit.ComparisonFailure: expected:<[[B@756535fa[{[{1,2},<null>,{5}]}]> but was:<[[B@756535fa[{[[B@47baec4c,<null>,[B@40ef965e]}]>
	at org.junit.Assert.assertEquals(Assert.java:115)
	at org.junit.Assert.assertEquals(Assert.java:144)
	at org.apache.commons.lang3.builder.ToStringBuilderTest.testReflectionByteArrayArray(ToStringBuilderTest.java:280)

testReflectionArrayCycleLevel2(org.apache.commons.lang3.builder.ToStringBuilderTest)  Time elapsed: 0 sec  <<< FAILURE!
org.junit.ComparisonFailure: expected:<...g.Object;@317916a0[{[{[Ljava.lang.Object;@317916a0}]}]> but was:<...g.Object;@317916a0[{[[Ljava.lang.Object;@4bc7bc0]}]>
	at org.junit.Assert.assertEquals(Assert.java:115)
	at org.junit.Assert.assertEquals(Assert.java:144)
	at org.apache.commons.lang3.builder.ToStringBuilderTest.testReflectionArrayCycleLevel2(ToStringBuilderTest.java:416)

testAppendToString(org.apache.commons.lang3.builder.ToStringBuilderTest)  Time elapsed: 0 sec  <<< FAILURE!
org.junit.ComparisonFailure: expected:<....Integer@66d89fb1[a=[hello]]> but was:<....Integer@66d89fb1[a=[java.lang.String@6fb117f0]]>
	at org.junit.Assert.assertEquals(Assert.java:115)
	at org.junit.Assert.assertEquals(Assert.java:144)
	at org.apache.commons.lang3.builder.ToStringBuilderTest.testAppendToString(ToStringBuilderTest.java:614)

testReflectionArrayAndObjectCycle(org.apache.commons.lang3.builder.ToStringBuilderTest)  Time elapsed: 0 sec  <<< FAILURE!
org.junit.ComparisonFailure: expected:<...TestFixture@1c997c85[[o=[Ljava.lang.Object;@72607cad]]}]> but was:<...TestFixture@1c997c85[]}]>
	at org.junit.Assert.assertEquals(Assert.java:115)
	at org.junit.Assert.assertEquals(Assert.java:144)
	at org.apache.commons.lang3.builder.ToStringBuilderTest.testReflectionArrayAndObjectCycle(ToStringBuilderTest.java:576)

testReflectionCharArrayArray(org.apache.commons.lang3.builder.ToStringBuilderTest)  Time elapsed: 0 sec  <<< FAILURE!
org.junit.ComparisonFailure: expected:<[[C@20be0e6e[{[{A,B},<null>,{p}]}]> but was:<[[C@20be0e6e[{[[C@1da5688d,<null>,[C@5673102f]}]>
	at org.junit.Assert.assertEquals(Assert.java:115)
	at org.junit.Assert.assertEquals(Assert.java:144)
	at org.apache.commons.lang3.builder.ToStringBuilderTest.testReflectionCharArrayArray(ToStringBuilderTest.java:289)

testIntArray(org.apache.commons.lang3.builder.ToStringBuilderTest)  Time elapsed: 0 sec  <<< FAILURE!
org.junit.ComparisonFailure: expected:<...ng.Integer@66d89fb1[[{1,2,-3,4}]]> but was:<...ng.Integer@66d89fb1[[[I@1c2baa00]]>
	at org.junit.Assert.assertEquals(Assert.java:115)
	at org.junit.Assert.assertEquals(Assert.java:144)
	at org.apache.commons.lang3.builder.ToStringBuilderTest.testIntArray(ToStringBuilderTest.java:738)

testByteArrayArray(org.apache.commons.lang3.builder.ToStringBuilderTest)  Time elapsed: 0 sec  <<< FAILURE!
org.junit.ComparisonFailure: expected:<...g.Integer@66d89fb1[{[{1,2},<null>,{5}]}]> but was:<...g.Integer@66d89fb1[{[[B@76a5f472,<null>,[B@953a539]}]>
	at org.junit.Assert.assertEquals(Assert.java:115)
	at org.junit.Assert.assertEquals(Assert.java:144)
	at org.apache.commons.lang3.builder.ToStringBuilderTest.testByteArrayArray(ToStringBuilderTest.java:837)

testCharArrayArray(org.apache.commons.lang3.builder.ToStringBuilderTest)  Time elapsed: 0.001 sec  <<< FAILURE!
org.junit.ComparisonFailure: expected:<...g.Integer@66d89fb1[{[{A,B},<null>,{p}]}]> but was:<...g.Integer@66d89fb1[{[[C@6a0d8573,<null>,[C@1db4776a]}]>
	at org.junit.Assert.assertEquals(Assert.java:115)
	at org.junit.Assert.assertEquals(Assert.java:144)
	at org.apache.commons.lang3.builder.ToStringBuilderTest.testCharArrayArray(ToStringBuilderTest.java:847)

testObject(org.apache.commons.lang3.builder.ToStringBuilderTest)  Time elapsed: 0.001 sec  <<< FAILURE!
org.junit.ComparisonFailure: expected:<....Integer@66d89fb1[a=[<size=0>]]> but was:<....Integer@66d89fb1[a=[java.util.ArrayList@216c6a89]]>
	at org.junit.Assert.assertEquals(Assert.java:115)
	at org.junit.Assert.assertEquals(Assert.java:144)
	at org.apache.commons.lang3.builder.ToStringBuilderTest.testObject(ToStringBuilderTest.java:629)

testAppendSuper(org.apache.commons.lang3.builder.ToStringBuilderTest)  Time elapsed: 0 sec  <<< FAILURE!
org.junit.ComparisonFailure: expected:<....Integer@66d89fb1[a=[hello]]> but was:<....Integer@66d89fb1[a=[java.lang.String@6fb117f0]]>
	at org.junit.Assert.assertEquals(Assert.java:115)
	at org.junit.Assert.assertEquals(Assert.java:144)
	at org.apache.commons.lang3.builder.ToStringBuilderTest.testAppendSuper(ToStringBuilderTest.java:604)

testInnerClassReflection(org.apache.commons.lang3.builder.ToStringBuilderTest)  Time elapsed: 0.001 sec  <<< FAILURE!
org.junit.ComparisonFailure: expected:<...Outer$Inner@533d9c96[[]]]> but was:<...Outer$Inner@533d9c96[]]>
	at org.junit.Assert.assertEquals(Assert.java:115)
	at org.junit.Assert.assertEquals(Assert.java:144)
	at org.apache.commons.lang3.builder.ToStringBuilderTest.testInnerClassReflection(ToStringBuilderTest.java:376)

testDoubleArray(org.apache.commons.lang3.builder.ToStringBuilderTest)  Time elapsed: 0.001 sec  <<< FAILURE!
org.junit.ComparisonFailure: expected:<...ng.Integer@66d89fb1[[{1.0,2.9876,-3.00001,4.3}]]> but was:<...ng.Integer@66d89fb1[[[D@628e2b14]]>
	at org.junit.Assert.assertEquals(Assert.java:115)
	at org.junit.Assert.assertEquals(Assert.java:144)
	at org.apache.commons.lang3.builder.ToStringBuilderTest.testDoubleArray(ToStringBuilderTest.java:778)

testReflectionFloatArrayArray(org.apache.commons.lang3.builder.ToStringBuilderTest)  Time elapsed: 0 sec  <<< FAILURE!
org.junit.ComparisonFailure: expected:<[[F@63ae6098[{[{1.0,2.29686},<null>,{NaN}]}]> but was:<[[F@63ae6098[{[[F@4d47ce48,<null>,[F@2538009b]}]>
	at org.junit.Assert.assertEquals(Assert.java:115)
	at org.junit.Assert.assertEquals(Assert.java:144)
	at org.apache.commons.lang3.builder.ToStringBuilderTest.testReflectionFloatArrayArray(ToStringBuilderTest.java:243)

Running org.apache.commons.lang3.builder.EqualsBuilderTest
Tests run: 48, Failures: 0, Errors: 0, Skipped: 0, Time elapsed: 0.009 sec - in org.apache.commons.lang3.builder.EqualsBuilderTest
Running org.apache.commons.lang3.builder.HashCodeBuilderAndEqualsBuilderTest
Tests run: 4, Failures: 0, Errors: 0, Skipped: 0, Time elapsed: 0.006 sec - in org.apache.commons.lang3.builder.HashCodeBuilderAndEqualsBuilderTest
Running org.apache.commons.lang3.builder.ReflectionToStringBuilderConcurrencyTest
Tests run: 3, Failures: 0, Errors: 0, Skipped: 3, Time elapsed: 0.001 sec - in org.apache.commons.lang3.builder.ReflectionToStringBuilderConcurrencyTest
Running org.apache.commons.lang3.builder.JsonToStringStyleTest
Tests run: 9, Failures: 0, Errors: 3, Skipped: 0, Time elapsed: 0.004 sec <<< FAILURE! - in org.apache.commons.lang3.builder.JsonToStringStyleTest
testObject(org.apache.commons.lang3.builder.JsonToStringStyleTest)  Time elapsed: 0 sec  <<< ERROR!
java.lang.NullPointerException: null
	at org.apache.commons.lang3.builder.ToStringStyle.isRegistered(ToStringStyle.java:28)
	at org.apache.commons.lang3.builder.ToStringStyle.appendInternal(ToStringStyle.java:82)
	at org.apache.commons.lang3.builder.ToStringStyle.append(ToStringStyle.java:80)
	at org.apache.commons.lang3.builder.ToStringStyle$JsonToStringStyle.append(ToStringStyle.java:416)
	at org.apache.commons.lang3.builder.ToStringBuilder.append(ToStringBuilder.java:848)
	at org.apache.commons.lang3.builder.JsonToStringStyleTest.testObject(JsonToStringStyleTest.java:114)

testPerson(org.apache.commons.lang3.builder.JsonToStringStyleTest)  Time elapsed: 0 sec  <<< ERROR!
java.lang.NullPointerException: null
	at org.apache.commons.lang3.builder.ToStringStyle.isRegistered(ToStringStyle.java:28)
	at org.apache.commons.lang3.builder.ToStringStyle.appendInternal(ToStringStyle.java:82)
	at org.apache.commons.lang3.builder.ToStringStyle.append(ToStringStyle.java:80)
	at org.apache.commons.lang3.builder.ToStringStyle$JsonToStringStyle.append(ToStringStyle.java:416)
	at org.apache.commons.lang3.builder.ToStringBuilder.append(ToStringBuilder.java:848)
	at org.apache.commons.lang3.builder.JsonToStringStyleTest.testPerson(JsonToStringStyleTest.java:192)

testAppendSuper(org.apache.commons.lang3.builder.JsonToStringStyleTest)  Time elapsed: 0 sec  <<< ERROR!
java.lang.NullPointerException: null
	at org.apache.commons.lang3.builder.ToStringStyle.isRegistered(ToStringStyle.java:28)
	at org.apache.commons.lang3.builder.ToStringStyle.appendInternal(ToStringStyle.java:82)
	at org.apache.commons.lang3.builder.ToStringStyle.append(ToStringStyle.java:80)
	at org.apache.commons.lang3.builder.ToStringStyle$JsonToStringStyle.append(ToStringStyle.java:416)
	at org.apache.commons.lang3.builder.ToStringBuilder.append(ToStringBuilder.java:848)
	at org.apache.commons.lang3.builder.JsonToStringStyleTest.testAppendSuper(JsonToStringStyleTest.java:74)

Running org.apache.commons.lang3.builder.NoClassNameToStringStyleTest
Tests run: 8, Failures: 0, Errors: 6, Skipped: 0, Time elapsed: 0.001 sec <<< FAILURE! - in org.apache.commons.lang3.builder.NoClassNameToStringStyleTest
testObjectArray(org.apache.commons.lang3.builder.NoClassNameToStringStyleTest)  Time elapsed: 0 sec  <<< ERROR!
java.lang.NullPointerException: null
	at org.apache.commons.lang3.builder.ToStringStyle.isRegistered(ToStringStyle.java:28)
	at org.apache.commons.lang3.builder.ToStringStyle.appendInternal(ToStringStyle.java:82)
	at org.apache.commons.lang3.builder.ToStringStyle.appendDetail(ToStringStyle.java:160)
	at org.apache.commons.lang3.builder.ToStringStyle.append(ToStringStyle.java:151)
	at org.apache.commons.lang3.builder.ToStringBuilder.append(ToStringBuilder.java:486)
	at org.apache.commons.lang3.builder.NoClassNameToStringStyleTest.testObjectArray(NoClassNameToStringStyleTest.java:102)

testLongArrayArray(org.apache.commons.lang3.builder.NoClassNameToStringStyleTest)  Time elapsed: 0 sec  <<< ERROR!
java.lang.NullPointerException: null
	at org.apache.commons.lang3.builder.ToStringStyle.isRegistered(ToStringStyle.java:28)
	at org.apache.commons.lang3.builder.ToStringStyle.appendInternal(ToStringStyle.java:82)
	at org.apache.commons.lang3.builder.ToStringStyle.appendDetail(ToStringStyle.java:160)
	at org.apache.commons.lang3.builder.ToStringStyle.append(ToStringStyle.java:151)
	at org.apache.commons.lang3.builder.ToStringBuilder.append(ToStringBuilder.java:486)
	at org.apache.commons.lang3.builder.NoClassNameToStringStyleTest.testLongArrayArray(NoClassNameToStringStyleTest.java:122)

testLongArray(org.apache.commons.lang3.builder.NoClassNameToStringStyleTest)  Time elapsed: 0 sec  <<< ERROR!
java.lang.NullPointerException: null
	at org.apache.commons.lang3.builder.ToStringStyle.isRegistered(ToStringStyle.java:28)
	at org.apache.commons.lang3.builder.ToStringStyle.appendInternal(ToStringStyle.java:82)
	at org.apache.commons.lang3.builder.ToStringStyle.append(ToStringStyle.java:80)
	at org.apache.commons.lang3.builder.ToStringBuilder.append(ToStringBuilder.java:472)
	at org.apache.commons.lang3.builder.NoClassNameToStringStyleTest.testLongArray(NoClassNameToStringStyleTest.java:113)

testObject(org.apache.commons.lang3.builder.NoClassNameToStringStyleTest)  Time elapsed: 0 sec  <<< ERROR!
java.lang.NullPointerException: null
	at org.apache.commons.lang3.builder.ToStringStyle.isRegistered(ToStringStyle.java:28)
	at org.apache.commons.lang3.builder.ToStringStyle.appendInternal(ToStringStyle.java:82)
	at org.apache.commons.lang3.builder.ToStringStyle.append(ToStringStyle.java:80)
	at org.apache.commons.lang3.builder.ToStringBuilder.append(ToStringBuilder.java:472)
	at org.apache.commons.lang3.builder.NoClassNameToStringStyleTest.testObject(NoClassNameToStringStyleTest.java:70)

testPerson(org.apache.commons.lang3.builder.NoClassNameToStringStyleTest)  Time elapsed: 0 sec  <<< ERROR!
java.lang.NullPointerException: null
	at org.apache.commons.lang3.builder.ToStringStyle.isRegistered(ToStringStyle.java:28)
	at org.apache.commons.lang3.builder.ToStringStyle.appendInternal(ToStringStyle.java:82)
	at org.apache.commons.lang3.builder.ToStringStyle.append(ToStringStyle.java:80)
	at org.apache.commons.lang3.builder.ToStringBuilder.append(ToStringBuilder.java:848)
	at org.apache.commons.lang3.builder.NoClassNameToStringStyleTest.testPerson(NoClassNameToStringStyleTest.java:89)

testAppendSuper(org.apache.commons.lang3.builder.NoClassNameToStringStyleTest)  Time elapsed: 0 sec  <<< ERROR!
java.lang.NullPointerException: null
	at org.apache.commons.lang3.builder.ToStringStyle.isRegistered(ToStringStyle.java:28)
	at org.apache.commons.lang3.builder.ToStringStyle.appendInternal(ToStringStyle.java:82)
	at org.apache.commons.lang3.builder.ToStringStyle.append(ToStringStyle.java:80)
	at org.apache.commons.lang3.builder.ToStringBuilder.append(ToStringBuilder.java:848)
	at org.apache.commons.lang3.builder.NoClassNameToStringStyleTest.testAppendSuper(NoClassNameToStringStyleTest.java:60)

Running org.apache.commons.lang3.builder.DiffBuilderTest
Tests run: 30, Failures: 0, Errors: 0, Skipped: 0, Time elapsed: 0.029 sec - in org.apache.commons.lang3.builder.DiffBuilderTest
Running org.apache.commons.lang3.builder.HashCodeBuilderTest
Tests run: 44, Failures: 0, Errors: 0, Skipped: 0, Time elapsed: 0.016 sec - in org.apache.commons.lang3.builder.HashCodeBuilderTest
Running org.apache.commons.lang3.concurrent.AtomicInitializerTest
Tests run: 3, Failures: 0, Errors: 0, Skipped: 0, Time elapsed: 0.009 sec - in org.apache.commons.lang3.concurrent.AtomicInitializerTest
Running org.apache.commons.lang3.concurrent.CallableBackgroundInitializerTest
Tests run: 4, Failures: 0, Errors: 0, Skipped: 0, Time elapsed: 0.002 sec - in org.apache.commons.lang3.concurrent.CallableBackgroundInitializerTest
Running org.apache.commons.lang3.concurrent.BackgroundInitializerTest
Tests run: 15, Failures: 0, Errors: 0, Skipped: 0, Time elapsed: 0.011 sec - in org.apache.commons.lang3.concurrent.BackgroundInitializerTest
Running org.apache.commons.lang3.concurrent.LazyInitializerTest
Tests run: 3, Failures: 0, Errors: 0, Skipped: 0, Time elapsed: 0.003 sec - in org.apache.commons.lang3.concurrent.LazyInitializerTest
Running org.apache.commons.lang3.concurrent.BasicThreadFactoryTest
Tests run: 15, Failures: 0, Errors: 0, Skipped: 0, Time elapsed: 0.034 sec - in org.apache.commons.lang3.concurrent.BasicThreadFactoryTest
Running org.apache.commons.lang3.concurrent.ConstantInitializerTest
Tests run: 7, Failures: 0, Errors: 0, Skipped: 0, Time elapsed: 0.001 sec - in org.apache.commons.lang3.concurrent.ConstantInitializerTest
Running org.apache.commons.lang3.concurrent.MultiBackgroundInitializerTest
Tests run: 17, Failures: 0, Errors: 0, Skipped: 0, Time elapsed: 0.016 sec - in org.apache.commons.lang3.concurrent.MultiBackgroundInitializerTest
Running org.apache.commons.lang3.concurrent.AtomicSafeInitializerTest
Tests run: 4, Failures: 0, Errors: 0, Skipped: 0, Time elapsed: 0.006 sec - in org.apache.commons.lang3.concurrent.AtomicSafeInitializerTest
Running org.apache.commons.lang3.concurrent.ConcurrentUtilsTest
Tests run: 40, Failures: 0, Errors: 0, Skipped: 0, Time elapsed: 0.018 sec - in org.apache.commons.lang3.concurrent.ConcurrentUtilsTest
Running org.apache.commons.lang3.concurrent.TimedSemaphoreTest
Tests run: 15, Failures: 0, Errors: 0, Skipped: 0, Time elapsed: 1.196 sec - in org.apache.commons.lang3.concurrent.TimedSemaphoreTest
Running org.apache.commons.lang3.StringUtilsSubstringTest
Tests run: 14, Failures: 0, Errors: 0, Skipped: 0, Time elapsed: 0.002 sec - in org.apache.commons.lang3.StringUtilsSubstringTest
Running org.apache.commons.lang3.SystemUtilsTest
Tests run: 12, Failures: 0, Errors: 0, Skipped: 0, Time elapsed: 0.002 sec - in org.apache.commons.lang3.SystemUtilsTest
Running org.apache.commons.lang3.CharRangeTest
Tests run: 16, Failures: 0, Errors: 0, Skipped: 0, Time elapsed: 0.03 sec - in org.apache.commons.lang3.CharRangeTest
Running org.apache.commons.lang3.CharSetTest
Tests run: 14, Failures: 0, Errors: 0, Skipped: 0, Time elapsed: 0.008 sec - in org.apache.commons.lang3.CharSetTest
Running org.apache.commons.lang3.StringUtilsStartsEndsWithTest
Tests run: 6, Failures: 0, Errors: 0, Skipped: 0, Time elapsed: 0.001 sec - in org.apache.commons.lang3.StringUtilsStartsEndsWithTest
Running org.apache.commons.lang3.RandomStringUtilsTest
Tests run: 11, Failures: 0, Errors: 0, Skipped: 0, Time elapsed: 0.032 sec - in org.apache.commons.lang3.RandomStringUtilsTest
Running org.apache.commons.lang3.SerializationUtilsTest
Tests run: 26, Failures: 0, Errors: 0, Skipped: 0, Time elapsed: 0.037 sec - in org.apache.commons.lang3.SerializationUtilsTest
Running org.apache.commons.lang3.time.StopWatchTest
Tests run: 8, Failures: 0, Errors: 0, Skipped: 0, Time elapsed: 4.763 sec - in org.apache.commons.lang3.time.StopWatchTest
Running org.apache.commons.lang3.time.DateUtilsRoundingTest
Tests run: 22, Failures: 0, Errors: 0, Skipped: 0, Time elapsed: 0.159 sec - in org.apache.commons.lang3.time.DateUtilsRoundingTest
Running org.apache.commons.lang3.time.FastDateParserTest
Tests run: 33, Failures: 0, Errors: 0, Skipped: 0, Time elapsed: 2.154 sec - in org.apache.commons.lang3.time.FastDateParserTest
Running org.apache.commons.lang3.time.FastDateFormat_ParserTest
Tests run: 33, Failures: 0, Errors: 0, Skipped: 0, Time elapsed: 0.735 sec - in org.apache.commons.lang3.time.FastDateFormat_ParserTest
Running org.apache.commons.lang3.time.DurationFormatUtilsTest
Tests run: 25, Failures: 0, Errors: 0, Skipped: 0, Time elapsed: 0.492 sec - in org.apache.commons.lang3.time.DurationFormatUtilsTest
Running org.apache.commons.lang3.time.DateFormatUtilsTest
Tests run: 10, Failures: 0, Errors: 0, Skipped: 0, Time elapsed: 0.002 sec - in org.apache.commons.lang3.time.DateFormatUtilsTest
Running org.apache.commons.lang3.time.DateUtilsFragmentTest
Tests run: 57, Failures: 0, Errors: 0, Skipped: 0, Time elapsed: 0.014 sec - in org.apache.commons.lang3.time.DateUtilsFragmentTest
Running org.apache.commons.lang3.time.FastDatePrinterTimeZonesTest
Tests run: 617, Failures: 0, Errors: 0, Skipped: 0, Time elapsed: 0.208 sec - in org.apache.commons.lang3.time.FastDatePrinterTimeZonesTest
Running org.apache.commons.lang3.time.FastDateFormatTest
>>FastDateFormatTest: FastDateParser:34294  SimpleDateFormat:3660
Tests run: 14, Failures: 0, Errors: 0, Skipped: 0, Time elapsed: 4.125 sec - in org.apache.commons.lang3.time.FastDateFormatTest
Running org.apache.commons.lang3.time.FastDateFormat_PrinterTest
Tests run: 17, Failures: 0, Errors: 0, Skipped: 0, Time elapsed: 0.007 sec - in org.apache.commons.lang3.time.FastDateFormat_PrinterTest
Running org.apache.commons.lang3.time.FastDatePrinterTest
Tests run: 17, Failures: 0, Errors: 0, Skipped: 0, Time elapsed: 0.003 sec - in org.apache.commons.lang3.time.FastDatePrinterTest
Running org.apache.commons.lang3.time.FastDateParserSDFTest
Tests run: 276, Failures: 0, Errors: 0, Skipped: 92, Time elapsed: 0.063 sec - in org.apache.commons.lang3.time.FastDateParserSDFTest
Running org.apache.commons.lang3.time.DateUtilsTest
DateUtilsTest: Default Locale=en_US
Tests run: 38, Failures: 0, Errors: 0, Skipped: 0, Time elapsed: 0.02 sec - in org.apache.commons.lang3.time.DateUtilsTest
Running org.apache.commons.lang3.reflect.InheritanceUtilsTest
Tests run: 9, Failures: 0, Errors: 0, Skipped: 0, Time elapsed: 0.003 sec - in org.apache.commons.lang3.reflect.InheritanceUtilsTest
Running org.apache.commons.lang3.reflect.MethodUtilsTest
Tests run: 23, Failures: 0, Errors: 0, Skipped: 0, Time elapsed: 0.032 sec - in org.apache.commons.lang3.reflect.MethodUtilsTest
Running org.apache.commons.lang3.reflect.ConstructorUtilsTest
Tests run: 7, Failures: 0, Errors: 0, Skipped: 0, Time elapsed: 0.006 sec - in org.apache.commons.lang3.reflect.ConstructorUtilsTest
Running org.apache.commons.lang3.reflect.FieldUtilsTest
Tests run: 64, Failures: 0, Errors: 0, Skipped: 0, Time elapsed: 0.026 sec - in org.apache.commons.lang3.reflect.FieldUtilsTest
Running org.apache.commons.lang3.reflect.TypeLiteralTest
Tests run: 4, Failures: 0, Errors: 0, Skipped: 0, Time elapsed: 0.005 sec - in org.apache.commons.lang3.reflect.TypeLiteralTest
Running org.apache.commons.lang3.reflect.TypeUtilsTest
Tests run: 19, Failures: 0, Errors: 0, Skipped: 0, Time elapsed: 0.045 sec - in org.apache.commons.lang3.reflect.TypeUtilsTest
Running org.apache.commons.lang3.mutable.MutableByteTest
Tests run: 17, Failures: 0, Errors: 0, Skipped: 0, Time elapsed: 0.002 sec - in org.apache.commons.lang3.mutable.MutableByteTest
Running org.apache.commons.lang3.mutable.MutableShortTest
Tests run: 14, Failures: 0, Errors: 0, Skipped: 0, Time elapsed: 0.001 sec - in org.apache.commons.lang3.mutable.MutableShortTest
Running org.apache.commons.lang3.mutable.MutableIntTest
Tests run: 17, Failures: 0, Errors: 0, Skipped: 0, Time elapsed: 0.004 sec - in org.apache.commons.lang3.mutable.MutableIntTest
Running org.apache.commons.lang3.mutable.MutableDoubleTest
Tests run: 18, Failures: 0, Errors: 0, Skipped: 0, Time elapsed: 0.005 sec - in org.apache.commons.lang3.mutable.MutableDoubleTest
Running org.apache.commons.lang3.mutable.MutableFloatTest
Tests run: 18, Failures: 0, Errors: 0, Skipped: 0, Time elapsed: 0.004 sec - in org.apache.commons.lang3.mutable.MutableFloatTest
Running org.apache.commons.lang3.mutable.MutableLongTest
Tests run: 17, Failures: 0, Errors: 0, Skipped: 0, Time elapsed: 0.002 sec - in org.apache.commons.lang3.mutable.MutableLongTest
Running org.apache.commons.lang3.mutable.MutableBooleanTest
Tests run: 9, Failures: 0, Errors: 0, Skipped: 0, Time elapsed: 0.003 sec - in org.apache.commons.lang3.mutable.MutableBooleanTest
Running org.apache.commons.lang3.mutable.MutableObjectTest
Tests run: 5, Failures: 0, Errors: 0, Skipped: 0, Time elapsed: 0 sec - in org.apache.commons.lang3.mutable.MutableObjectTest
Running org.apache.commons.lang3.text.translate.UnicodeEscaperTest
Tests run: 3, Failures: 0, Errors: 0, Skipped: 0, Time elapsed: 0 sec - in org.apache.commons.lang3.text.translate.UnicodeEscaperTest
Running org.apache.commons.lang3.text.translate.EntityArraysTest
Tests run: 3, Failures: 0, Errors: 0, Skipped: 0, Time elapsed: 0 sec - in org.apache.commons.lang3.text.translate.EntityArraysTest
Running org.apache.commons.lang3.text.translate.UnicodeUnpairedSurrogateRemoverTest
Tests run: 2, Failures: 0, Errors: 0, Skipped: 0, Time elapsed: 0 sec - in org.apache.commons.lang3.text.translate.UnicodeUnpairedSurrogateRemoverTest
Running org.apache.commons.lang3.text.translate.NumericEntityUnescaperTest
Tests run: 3, Failures: 0, Errors: 0, Skipped: 0, Time elapsed: 0.001 sec - in org.apache.commons.lang3.text.translate.NumericEntityUnescaperTest
Running org.apache.commons.lang3.text.translate.NumericEntityEscaperTest
Tests run: 4, Failures: 0, Errors: 0, Skipped: 0, Time elapsed: 0 sec - in org.apache.commons.lang3.text.translate.NumericEntityEscaperTest
Running org.apache.commons.lang3.text.translate.LookupTranslatorTest
Tests run: 2, Failures: 0, Errors: 0, Skipped: 0, Time elapsed: 0 sec - in org.apache.commons.lang3.text.translate.LookupTranslatorTest
Running org.apache.commons.lang3.text.translate.UnicodeUnescaperTest
Tests run: 3, Failures: 0, Errors: 0, Skipped: 0, Time elapsed: 0 sec - in org.apache.commons.lang3.text.translate.UnicodeUnescaperTest
Running org.apache.commons.lang3.text.translate.OctalUnescaperTest
Tests run: 1, Failures: 0, Errors: 0, Skipped: 0, Time elapsed: 0 sec - in org.apache.commons.lang3.text.translate.OctalUnescaperTest
Running org.apache.commons.lang3.text.StrMatcherTest
Tests run: 14, Failures: 0, Errors: 0, Skipped: 0, Time elapsed: 0.001 sec - in org.apache.commons.lang3.text.StrMatcherTest
Running org.apache.commons.lang3.text.StrTokenizerTest
Tests run: 55, Failures: 0, Errors: 8, Skipped: 0, Time elapsed: 0.012 sec <<< FAILURE! - in org.apache.commons.lang3.text.StrTokenizerTest
test1(org.apache.commons.lang3.text.StrTokenizerTest)  Time elapsed: 0.001 sec  <<< ERROR!
java.lang.NullPointerException: null
	at org.apache.commons.lang3.builder.ToStringStyle.isRegistered(ToStringStyle.java:28)
	at org.apache.commons.lang3.builder.ToStringStyle.appendInternal(ToStringStyle.java:82)
	at org.apache.commons.lang3.builder.ToStringStyle.append(ToStringStyle.java:80)
	at org.apache.commons.lang3.builder.ToStringBuilder.append(ToStringBuilder.java:472)
	at org.apache.commons.lang3.ArrayUtils.toString(ArrayUtils.java:180)
	at org.apache.commons.lang3.ArrayUtils.toString(ArrayUtils.java:161)
	at org.apache.commons.lang3.text.StrTokenizerTest.test1(StrTokenizerTest.java:60)

test2(org.apache.commons.lang3.text.StrTokenizerTest)  Time elapsed: 0 sec  <<< ERROR!
java.lang.NullPointerException: null
	at org.apache.commons.lang3.builder.ToStringStyle.isRegistered(ToStringStyle.java:28)
	at org.apache.commons.lang3.builder.ToStringStyle.appendInternal(ToStringStyle.java:82)
	at org.apache.commons.lang3.builder.ToStringStyle.append(ToStringStyle.java:80)
	at org.apache.commons.lang3.builder.ToStringBuilder.append(ToStringBuilder.java:472)
	at org.apache.commons.lang3.ArrayUtils.toString(ArrayUtils.java:180)
	at org.apache.commons.lang3.ArrayUtils.toString(ArrayUtils.java:161)
	at org.apache.commons.lang3.text.StrTokenizerTest.test2(StrTokenizerTest.java:81)

test3(org.apache.commons.lang3.text.StrTokenizerTest)  Time elapsed: 0 sec  <<< ERROR!
java.lang.NullPointerException: null
	at org.apache.commons.lang3.builder.ToStringStyle.isRegistered(ToStringStyle.java:28)
	at org.apache.commons.lang3.builder.ToStringStyle.appendInternal(ToStringStyle.java:82)
	at org.apache.commons.lang3.builder.ToStringStyle.append(ToStringStyle.java:80)
	at org.apache.commons.lang3.builder.ToStringBuilder.append(ToStringBuilder.java:472)
	at org.apache.commons.lang3.ArrayUtils.toString(ArrayUtils.java:180)
	at org.apache.commons.lang3.ArrayUtils.toString(ArrayUtils.java:161)
	at org.apache.commons.lang3.text.StrTokenizerTest.test3(StrTokenizerTest.java:102)

test4(org.apache.commons.lang3.text.StrTokenizerTest)  Time elapsed: 0.001 sec  <<< ERROR!
java.lang.NullPointerException: null
	at org.apache.commons.lang3.builder.ToStringStyle.isRegistered(ToStringStyle.java:28)
	at org.apache.commons.lang3.builder.ToStringStyle.appendInternal(ToStringStyle.java:82)
	at org.apache.commons.lang3.builder.ToStringStyle.append(ToStringStyle.java:80)
	at org.apache.commons.lang3.builder.ToStringBuilder.append(ToStringBuilder.java:472)
	at org.apache.commons.lang3.ArrayUtils.toString(ArrayUtils.java:180)
	at org.apache.commons.lang3.ArrayUtils.toString(ArrayUtils.java:161)
	at org.apache.commons.lang3.text.StrTokenizerTest.test4(StrTokenizerTest.java:123)

test5(org.apache.commons.lang3.text.StrTokenizerTest)  Time elapsed: 0 sec  <<< ERROR!
java.lang.NullPointerException: null
	at org.apache.commons.lang3.builder.ToStringStyle.isRegistered(ToStringStyle.java:28)
	at org.apache.commons.lang3.builder.ToStringStyle.appendInternal(ToStringStyle.java:82)
	at org.apache.commons.lang3.builder.ToStringStyle.append(ToStringStyle.java:80)
	at org.apache.commons.lang3.builder.ToStringBuilder.append(ToStringBuilder.java:472)
	at org.apache.commons.lang3.ArrayUtils.toString(ArrayUtils.java:180)
	at org.apache.commons.lang3.ArrayUtils.toString(ArrayUtils.java:161)
	at org.apache.commons.lang3.text.StrTokenizerTest.test5(StrTokenizerTest.java:145)

test6(org.apache.commons.lang3.text.StrTokenizerTest)  Time elapsed: 0.001 sec  <<< ERROR!
java.lang.NullPointerException: null
	at org.apache.commons.lang3.builder.ToStringStyle.isRegistered(ToStringStyle.java:28)
	at org.apache.commons.lang3.builder.ToStringStyle.appendInternal(ToStringStyle.java:82)
	at org.apache.commons.lang3.builder.ToStringStyle.append(ToStringStyle.java:80)
	at org.apache.commons.lang3.builder.ToStringBuilder.append(ToStringBuilder.java:472)
	at org.apache.commons.lang3.ArrayUtils.toString(ArrayUtils.java:180)
	at org.apache.commons.lang3.ArrayUtils.toString(ArrayUtils.java:161)
	at org.apache.commons.lang3.text.StrTokenizerTest.test6(StrTokenizerTest.java:179)

test7(org.apache.commons.lang3.text.StrTokenizerTest)  Time elapsed: 0 sec  <<< ERROR!
java.lang.NullPointerException: null
	at org.apache.commons.lang3.builder.ToStringStyle.isRegistered(ToStringStyle.java:28)
	at org.apache.commons.lang3.builder.ToStringStyle.appendInternal(ToStringStyle.java:82)
	at org.apache.commons.lang3.builder.ToStringStyle.append(ToStringStyle.java:80)
	at org.apache.commons.lang3.builder.ToStringBuilder.append(ToStringBuilder.java:472)
	at org.apache.commons.lang3.ArrayUtils.toString(ArrayUtils.java:180)
	at org.apache.commons.lang3.ArrayUtils.toString(ArrayUtils.java:161)
	at org.apache.commons.lang3.text.StrTokenizerTest.test7(StrTokenizerTest.java:202)

test8(org.apache.commons.lang3.text.StrTokenizerTest)  Time elapsed: 0 sec  <<< ERROR!
java.lang.NullPointerException: null
	at org.apache.commons.lang3.builder.ToStringStyle.isRegistered(ToStringStyle.java:28)
	at org.apache.commons.lang3.builder.ToStringStyle.appendInternal(ToStringStyle.java:82)
	at org.apache.commons.lang3.builder.ToStringStyle.append(ToStringStyle.java:80)
	at org.apache.commons.lang3.builder.ToStringBuilder.append(ToStringBuilder.java:472)
	at org.apache.commons.lang3.ArrayUtils.toString(ArrayUtils.java:180)
	at org.apache.commons.lang3.ArrayUtils.toString(ArrayUtils.java:161)
	at org.apache.commons.lang3.text.StrTokenizerTest.test8(StrTokenizerTest.java:223)

Running org.apache.commons.lang3.text.FormattableUtilsTest
Tests run: 5, Failures: 0, Errors: 0, Skipped: 0, Time elapsed: 0 sec - in org.apache.commons.lang3.text.FormattableUtilsTest
Running org.apache.commons.lang3.text.CompositeFormatTest
Tests run: 2, Failures: 0, Errors: 0, Skipped: 0, Time elapsed: 0 sec - in org.apache.commons.lang3.text.CompositeFormatTest
Running org.apache.commons.lang3.text.WordUtilsTest
Tests run: 12, Failures: 0, Errors: 0, Skipped: 0, Time elapsed: 0.003 sec - in org.apache.commons.lang3.text.WordUtilsTest
Running org.apache.commons.lang3.text.StrLookupTest
Tests run: 5, Failures: 0, Errors: 0, Skipped: 0, Time elapsed: 0.002 sec - in org.apache.commons.lang3.text.StrLookupTest
Running org.apache.commons.lang3.text.StrBuilderAppendInsertTest
Tests run: 51, Failures: 0, Errors: 0, Skipped: 0, Time elapsed: 0.011 sec - in org.apache.commons.lang3.text.StrBuilderAppendInsertTest
Running org.apache.commons.lang3.text.ExtendedMessageFormatTest
Tests run: 10, Failures: 0, Errors: 0, Skipped: 0, Time elapsed: 0.723 sec - in org.apache.commons.lang3.text.ExtendedMessageFormatTest
Running org.apache.commons.lang3.text.StrSubstitutorTest
Tests run: 40, Failures: 0, Errors: 0, Skipped: 0, Time elapsed: 0.031 sec - in org.apache.commons.lang3.text.StrSubstitutorTest
Running org.apache.commons.lang3.text.StrBuilderTest
Tests run: 90, Failures: 0, Errors: 0, Skipped: 0, Time elapsed: 0.042 sec - in org.apache.commons.lang3.text.StrBuilderTest
Running org.apache.commons.lang3.StringEscapeUtilsTest
Tests run: 28, Failures: 0, Errors: 0, Skipped: 0, Time elapsed: 0.366 sec - in org.apache.commons.lang3.StringEscapeUtilsTest
Running org.apache.commons.lang3.AnnotationUtilsTest
Tests run: 10, Failures: 1, Errors: 0, Skipped: 0, Time elapsed: 0.019 sec <<< FAILURE! - in org.apache.commons.lang3.AnnotationUtilsTest
testToString(org.apache.commons.lang3.AnnotationUtilsTest)  Time elapsed: 0.002 sec  <<< FAILURE!
java.lang.AssertionError: null
	at org.junit.Assert.fail(Assert.java:86)
	at org.junit.Assert.assertTrue(Assert.java:41)
	at org.junit.Assert.assertTrue(Assert.java:52)
	at org.apache.commons.lang3.AnnotationUtilsTest.testToString(AnnotationUtilsTest.java:503)

Running org.apache.commons.lang3.ConversionTest
Tests run: 42, Failures: 0, Errors: 0, Skipped: 0, Time elapsed: 0.013 sec - in org.apache.commons.lang3.ConversionTest
Running org.apache.commons.lang3.StringUtilsTrimEmptyTest
Tests run: 15, Failures: 0, Errors: 0, Skipped: 0, Time elapsed: 0.006 sec - in org.apache.commons.lang3.StringUtilsTrimEmptyTest
Running org.apache.commons.lang3.EnumUtilsTest
Tests run: 34, Failures: 0, Errors: 0, Skipped: 0, Time elapsed: 0.009 sec - in org.apache.commons.lang3.EnumUtilsTest
Running org.apache.commons.lang3.exception.ExceptionUtilsTest
Tests run: 28, Failures: 0, Errors: 0, Skipped: 0, Time elapsed: 0.024 sec - in org.apache.commons.lang3.exception.ExceptionUtilsTest
Running org.apache.commons.lang3.exception.DefaultExceptionContextTest
Tests run: 8, Failures: 0, Errors: 0, Skipped: 0, Time elapsed: 0.004 sec - in org.apache.commons.lang3.exception.DefaultExceptionContextTest
Running org.apache.commons.lang3.exception.ContextedExceptionTest
Tests run: 14, Failures: 0, Errors: 0, Skipped: 0, Time elapsed: 0.01 sec - in org.apache.commons.lang3.exception.ContextedExceptionTest
Running org.apache.commons.lang3.exception.ContextedRuntimeExceptionTest
Tests run: 14, Failures: 0, Errors: 0, Skipped: 0, Time elapsed: 0.01 sec - in org.apache.commons.lang3.exception.ContextedRuntimeExceptionTest
Running org.apache.commons.lang3.BitFieldTest
Tests run: 15, Failures: 0, Errors: 0, Skipped: 0, Time elapsed: 0.002 sec - in org.apache.commons.lang3.BitFieldTest
Running org.apache.commons.lang3.ArrayUtilsRemoveMultipleTest
Tests run: 55, Failures: 0, Errors: 0, Skipped: 0, Time elapsed: 0.014 sec - in org.apache.commons.lang3.ArrayUtilsRemoveMultipleTest
Running org.apache.commons.lang3.HashSetvBitSetTest
Ratio=9% array=100 count=1 extract=12341496 bitset=1187809
Ratio=4% array=100 count=10 extract=26529327 bitset=1267113
Ratio=13% array=100 count=50 extract=12141175 bitset=1657389
Ratio=4% array=100 count=100 extract=9695766 bitset=451696
Ratio=99% array=1000 count=10 extract=5853462 bitset=5823637
Ratio=32% array=1000 count=100 extract=14440513 bitset=4672691
Ratio=14% array=1000 count=500 extract=46691001 bitset=6714744
Ratio=1% array=1000 count=1000 extract=69065203 bitset=709888
Ratio=721% count=0 hash=169900 bits=1226233
Ratio=30% count=5 hash=621548 bits=188272
Ratio=27% count=10 hash=912857 bits=251204
Ratio=23% count=200 hash=17771943 bits=4244597
Ratio=17% count=50 hash=5775546 bits=996714
Ratio=27% count=100 hash=8621247 bits=2373023
Ratio=22% count=1000 hash=72045206 bits=15939946
Ratio=21% count=2000 hash=151171041 bits=32580857
Tests run: 2, Failures: 0, Errors: 0, Skipped: 0, Time elapsed: 0.628 sec - in org.apache.commons.lang3.HashSetvBitSetTest
Running org.apache.commons.lang3.StringUtilsTest
Tests run: 124, Failures: 0, Errors: 0, Skipped: 0, Time elapsed: 0.088 sec - in org.apache.commons.lang3.StringUtilsTest
Running org.apache.commons.lang3.ArrayUtilsRemoveTest
Tests run: 19, Failures: 0, Errors: 0, Skipped: 0, Time elapsed: 0.001 sec - in org.apache.commons.lang3.ArrayUtilsRemoveTest
Running org.apache.commons.lang3.ObjectUtilsTest
Tests run: 36, Failures: 0, Errors: 0, Skipped: 0, Time elapsed: 0.006 sec - in org.apache.commons.lang3.ObjectUtilsTest
Running org.apache.commons.lang3.ClassPathUtilsTest
Tests run: 13, Failures: 0, Errors: 0, Skipped: 0, Time elapsed: 0.002 sec - in org.apache.commons.lang3.ClassPathUtilsTest
Running org.apache.commons.lang3.math.NumberUtilsTest
Tests run: 91, Failures: 0, Errors: 0, Skipped: 0, Time elapsed: 0.037 sec - in org.apache.commons.lang3.math.NumberUtilsTest
Running org.apache.commons.lang3.math.IEEE754rUtilsTest
Tests run: 3, Failures: 0, Errors: 0, Skipped: 0, Time elapsed: 0.001 sec - in org.apache.commons.lang3.math.IEEE754rUtilsTest
Running org.apache.commons.lang3.math.FractionTest
Tests run: 25, Failures: 0, Errors: 0, Skipped: 0, Time elapsed: 0.421 sec - in org.apache.commons.lang3.math.FractionTest
Running org.apache.commons.lang3.BooleanUtilsTest
Tests run: 72, Failures: 0, Errors: 0, Skipped: 0, Time elapsed: 0.01 sec - in org.apache.commons.lang3.BooleanUtilsTest
Running org.apache.commons.lang3.CharSequenceUtilsTest
Tests run: 2, Failures: 0, Errors: 0, Skipped: 0, Time elapsed: 0 sec - in org.apache.commons.lang3.CharSequenceUtilsTest
Running org.apache.commons.lang3.CharSetUtilsTest
Tests run: 11, Failures: 0, Errors: 0, Skipped: 0, Time elapsed: 0.001 sec - in org.apache.commons.lang3.CharSetUtilsTest
Running org.apache.commons.lang3.ArrayUtilsAddTest
Tests run: 13, Failures: 0, Errors: 0, Skipped: 0, Time elapsed: 0.002 sec - in org.apache.commons.lang3.ArrayUtilsAddTest
Running org.apache.commons.lang3.CharEncodingTest
Tests run: 6, Failures: 0, Errors: 0, Skipped: 0, Time elapsed: 0.011 sec - in org.apache.commons.lang3.CharEncodingTest
Running org.apache.commons.lang3.ClassUtilsTest
Tests run: 57, Failures: 0, Errors: 0, Skipped: 0, Time elapsed: 0.022 sec - in org.apache.commons.lang3.ClassUtilsTest
Running org.apache.commons.lang3.RangeTest
Tests run: 24, Failures: 0, Errors: 0, Skipped: 0, Time elapsed: 0.007 sec - in org.apache.commons.lang3.RangeTest
Running org.apache.commons.lang3.event.EventUtilsTest
Tests run: 8, Failures: 0, Errors: 0, Skipped: 0, Time elapsed: 0.01 sec - in org.apache.commons.lang3.event.EventUtilsTest
Running org.apache.commons.lang3.event.EventListenerSupportTest
Tests run: 9, Failures: 0, Errors: 0, Skipped: 0, Time elapsed: 0.022 sec - in org.apache.commons.lang3.event.EventListenerSupportTest
Running org.apache.commons.lang3.ArrayUtilsTest
Tests run: 205, Failures: 0, Errors: 1, Skipped: 0, Time elapsed: 0.039 sec <<< FAILURE! - in org.apache.commons.lang3.ArrayUtilsTest
testToString(org.apache.commons.lang3.ArrayUtilsTest)  Time elapsed: 0 sec  <<< ERROR!
java.lang.NullPointerException: null
	at org.apache.commons.lang3.builder.ToStringStyle.isRegistered(ToStringStyle.java:28)
	at org.apache.commons.lang3.builder.ToStringStyle.appendInternal(ToStringStyle.java:82)
	at org.apache.commons.lang3.builder.ToStringStyle.append(ToStringStyle.java:80)
	at org.apache.commons.lang3.builder.ToStringBuilder.append(ToStringBuilder.java:472)
	at org.apache.commons.lang3.ArrayUtils.toString(ArrayUtils.java:180)
	at org.apache.commons.lang3.ArrayUtils.toString(ArrayUtils.java:161)
	at org.apache.commons.lang3.ArrayUtilsTest.testToString(ArrayUtilsTest.java:53)

Running org.apache.commons.lang3.CharUtilsTest
Tests run: 24, Failures: 0, Errors: 0, Skipped: 0, Time elapsed: 0.003 sec - in org.apache.commons.lang3.CharUtilsTest
Running org.apache.commons.lang3.NotImplementedExceptionTest
Tests run: 1, Failures: 0, Errors: 0, Skipped: 0, Time elapsed: 0.001 sec - in org.apache.commons.lang3.NotImplementedExceptionTest
Running org.apache.commons.lang3.StringUtilsEqualsIndexOfTest
Tests run: 50, Failures: 0, Errors: 0, Skipped: 0, Time elapsed: 0.007 sec - in org.apache.commons.lang3.StringUtilsEqualsIndexOfTest
Running org.apache.commons.lang3.RandomUtilsTest
Tests run: 23, Failures: 0, Errors: 0, Skipped: 0, Time elapsed: 0 sec - in org.apache.commons.lang3.RandomUtilsTest

Results :

Failed tests: 
  AnnotationUtilsTest.testToString:503 null
  DefaultToStringStyleTest.testAppendSuper:61 expected:<....Integer@66d89fb1[a=[hello]]> but was:<....Integer@66d89fb1[a=[java.lang.String@6fb117f0]]>
  DefaultToStringStyleTest.testLongArray:115 expected:<...ng.Integer@66d89fb1[[{1,2,-3,4}]]> but was:<...ng.Integer@66d89fb1[[[J@52c11156]]>
  DefaultToStringStyleTest.testLongArrayArray:124 expected:<...g.Integer@66d89fb1[{[{1,2},<null>,{5}]}]> but was:<...g.Integer@66d89fb1[{[[J@56b6d31c,<null>,[J@7cddffbd]}]>
  DefaultToStringStyleTest.testObject:76 expected:<....Integer@66d89fb1[a=[<size=0>]]> but was:<....Integer@66d89fb1[a=[java.util.ArrayList@1594f8c]]>
  DefaultToStringStyleTest.testPerson:91 expected:<...Person@e757105[name=[John Doe],age=33,smoker=false...> but was:<...Person@e757105[name=[java.lang.String@77b1a17a],age=33,smoker=false...>
  MultiLineToStringStyleTest.testAppendSuper:62 expected:<...teger@66d89fb1[
  a=[hello]
]> but was:<...teger@66d89fb1[
  a=[java.lang.String@6fb117f0]
]>
  MultiLineToStringStyleTest.testLongArray:116 expected:<...Integer@66d89fb1[
  [{1,2,-3,4}]
]> but was:<...Integer@66d89fb1[
  [[J@594e0e5]
]>
  MultiLineToStringStyleTest.testLongArrayArray:125 expected:<...nteger@66d89fb1[
  {[{1,2},<null>,{5}]}
]> but was:<...nteger@66d89fb1[
  {[[J@593e64e0,<null>,[J@f50dbe6]}
]>
  MultiLineToStringStyleTest.testObject:77 expected:<...teger@66d89fb1[
  a=[<size=0>]
]> but was:<...teger@66d89fb1[
  a=[java.util.ArrayList@7138dd3f]
]>
  MultiLineToStringStyleTest.testPerson:92 expected:<...on@4c458d2b[
  name=[Jane Doe]
  age=25
  smoker=t...> but was:<...on@4c458d2b[
  name=[java.lang.String@6a37292b]
  age=25
  smoker=t...>
  MultilineRecursiveToStringStyleTest.boolArray:113 expected:<...b50639[
  boolArray=[{
    true,
    false,
    true
  }],
  charArray=<null>...> but was:<...b50639[
  boolArray=[[Z@27abb00a],
  charArray=<null>...>
  MultilineRecursiveToStringStyleTest.charArray:131 expected:<...<null>,
  charArray=[{
    a,
    A
  }],
  intArray=<null>,...> but was:<...<null>,
  charArray=[[C@75225d4a],
  intArray=<null>,...>
  MultilineRecursiveToStringStyleTest.doubleArray:167 expected:<...ull>,
  doubleArray=[{
    1.0,
    2.0
  }],
  longArray=<null>...> but was:<...ull>,
  doubleArray=[[D@6b2fd0b3],
  longArray=<null>...>
  MultilineRecursiveToStringStyleTest.intArray:149 expected:<...=<null>,
  intArray=[{
    1,
    2
  }],
  doubleArray=<nul...> but was:<...=<null>,
  intArray=[[I@42eb40fe],
  doubleArray=<nul...>
  MultilineRecursiveToStringStyleTest.longArray:185 expected:<...<null>,
  longArray=[{
    1,
    2
  }],
  stringArray=<nul...> but was:<...<null>,
  longArray=[[J@63cb6c2c],
  stringArray=<nul...>
  MultilineRecursiveToStringStyleTest.nestedAndArray:80 expected:<...l.ArrayList@33318b82[{
    org.apache.commons.lang3.builder.MultilineRecursiveToStringStyleTest$Transaction@79be1e0f[
      amount=100.0,
      date=2014.10.14
    ],
    org.apache.commons.lang3.builder.MultilineRecursiveToStringStyleTest$Transaction@30a7a93a[
      amount=50.0,
      date=2014.10.15
    ]
  }]
]> but was:<...l.ArrayList@33318b82[]
]>
  MultilineRecursiveToStringStyleTest.nestedElements:57 expected:<...er@231ae15a[
  name=[Douglas Adams,
  bank=org.apache.commons.lang3.builder.MultilineRecursiveToStringStyleTest$Bank@39c0edb7[
    name=ASF Bank
  ]],
  accounts=<null>
...> but was:<...er@231ae15a[
  name=[java.lang.String@430e0623,
  bank=org.apache.commons.lang3.builder.MultilineRecursiveToStringStyleTest$Bank@39c0edb7],
  accounts=<null>
...>
  MultilineRecursiveToStringStyleTest.simpleObject:42 expected:<...mount=100.0,
  date=[2014.10.15]
]> but was:<...mount=100.0,
  date=[java.lang.String@598d406b]
]>
  MultilineRecursiveToStringStyleTest.stringArray:203 expected:<...ull>,
  stringArray=[{
    a,
    A
  }]
]> but was:<...ull>,
  stringArray=[[Ljava.lang.String;@710765e5]
]>
  NoFieldNamesToStringStyleTest.testAppendSuper:61 expected:<...ng.Integer@66d89fb1[[hello]]> but was:<...ng.Integer@66d89fb1[[java.lang.String@6fb117f0]]>
  NoFieldNamesToStringStyleTest.testLongArray:115 expected:<...ng.Integer@66d89fb1[[{1,2,-3,4}]]> but was:<...ng.Integer@66d89fb1[[[J@52ba2221]]>
  NoFieldNamesToStringStyleTest.testLongArrayArray:124 expected:<...g.Integer@66d89fb1[{[{1,2},<null>,{5}]}]> but was:<...g.Integer@66d89fb1[{[[J@19565a99,<null>,[J@7455ffcd]}]>
  NoFieldNamesToStringStyleTest.testObject:76 expected:<...ng.Integer@66d89fb1[[<size=0>]]> but was:<...ng.Integer@66d89fb1[[java.util.ArrayList@1e86471]]>
  NoFieldNamesToStringStyleTest.testPerson:91 expected:<...est$Person@401a37b1[[Ron Paul],72,false]> but was:<...est$Person@401a37b1[[java.lang.String@793e6657],72,false]>
  RecursiveToStringStyleTest.testAppendSuper:60 expected:<....Integer@66d89fb1[a=[hello]]> but was:<....Integer@66d89fb1[a=[java.lang.String@6fb117f0]]>
  RecursiveToStringStyleTest.testLongArray:118 expected:<...ng.Integer@66d89fb1[[{1,2,-3,4}]]> but was:<...ng.Integer@66d89fb1[[[J@5baf41f4]]>
  RecursiveToStringStyleTest.testLongArrayArray:127 expected:<...g.Integer@66d89fb1[{[{1,2},<null>,{5}]}]> but was:<...g.Integer@66d89fb1[{[[J@c16d8ba,<null>,[J@2feea189]}]>
  RecursiveToStringStyleTest.testObject:75 expected:<....Integer@66d89fb1[a=[<size=0>]]> but was:<....Integer@66d89fb1[a=[java.util.ArrayList@4f132932]]>
  RecursiveToStringStyleTest.testPerson:93 expected:<...erson@72f5ba2c[name=[John Doe,age=33,smoker=false,job=org.apache.commons.lang3.builder.RecursiveToStringStyleTest$Job@6291d9aa[title=Manager]]]> but was:<...erson@72f5ba2c[name=[java.lang.String@77b1a17a,age=33,smoker=false,job=org.apache.commons.lang3.builder.RecursiveToStringStyleTest$Job@6291d9aa]]>
  ReflectionToStringBuilderExcludeTest.test_toStringExclude:53->validateSecretFieldAbsent:130->validateNonSecretField:125 null
  ReflectionToStringBuilderExcludeTest.test_toStringExcludeArray:59->validateSecretFieldAbsent:130->validateNonSecretField:125 null
  ReflectionToStringBuilderExcludeTest.test_toStringExcludeArrayWithNull:65->validateSecretFieldPresent:134 null
  ReflectionToStringBuilderExcludeTest.test_toStringExcludeArrayWithNulls:71->validateSecretFieldPresent:134 null
  ReflectionToStringBuilderExcludeTest.test_toStringExcludeCollection:79->validateSecretFieldAbsent:130->validateNonSecretField:125 null
  ReflectionToStringBuilderExcludeTest.test_toStringExcludeCollectionWithNull:87->validateSecretFieldPresent:134 null
  ReflectionToStringBuilderExcludeTest.test_toStringExcludeCollectionWithNulls:96->validateSecretFieldPresent:134 null
  ReflectionToStringBuilderExcludeTest.test_toStringExcludeEmptyArray:102->validateSecretFieldPresent:134 null
  ReflectionToStringBuilderExcludeTest.test_toStringExcludeEmptyCollection:108->validateSecretFieldPresent:134 null
  ReflectionToStringBuilderExcludeTest.test_toStringExcludeNullArray:114->validateSecretFieldPresent:134 null
  ReflectionToStringBuilderExcludeTest.test_toStringExcludeNullCollection:120->validateSecretFieldPresent:134 null
  ShortPrefixToStringStyleTest.testAppendSuper:61 expected:<Integer[a=[hello]]> but was:<Integer[a=[java.lang.String@6fb117f0]]>
  ShortPrefixToStringStyleTest.testLongArray:115 expected:<Integer[[{1,2,-3,4}]]> but was:<Integer[[[J@1a27a268]]>
  ShortPrefixToStringStyleTest.testLongArrayArray:124 expected:<Integer[{[{1,2},<null>,{5}]}]> but was:<Integer[{[[J@539ac6d9,<null>,[J@5674fb70]}]>
  ShortPrefixToStringStyleTest.testObject:76 expected:<Integer[a=[<size=0>]]> but was:<Integer[a=[java.util.ArrayList@20176742]]>
  ShortPrefixToStringStyleTest.testPerson:91 expected:<...yleTest.Person[name=[John Q. Public],age=45,smoker=true]> but was:<...yleTest.Person[name=[java.lang.String@78d1cbf1],age=45,smoker=true]>
  StandardToStringStyleTest.testAppendSuper:76 expected:<Integer[a=[hello]]> but was:<Integer[a=[java.lang.String@6fb117f0]]>
  StandardToStringStyleTest.testLongArray:130 expected:<Integer[[[1, 2, -3, 4]]]> but was:<Integer[[[J@88744e5]]>
  StandardToStringStyleTest.testLongArrayArray:139 expected:<Integer[[[[1, 2], %NULL%, [5]]]]> but was:<Integer[[[[J@158412e1, %NULL%, [J@11f37cd0]]]>
  StandardToStringStyleTest.testObject:91 expected:<Integer[a=[%SIZE=0%]]> but was:<Integer[a=[java.util.ArrayList@68bc1ac2]]>
  StandardToStringStyleTest.testPerson:106 expected:<...yleTest.Person[name=[Suzy Queue],age=19,smoker=false...> but was:<...yleTest.Person[name=[java.lang.String@4317f2b1],age=19,smoker=false...>
  ToStringBuilderTest.testAppendSuper:604 expected:<....Integer@66d89fb1[a=[hello]]> but was:<....Integer@66d89fb1[a=[java.lang.String@6fb117f0]]>
  ToStringBuilderTest.testAppendToString:614 expected:<....Integer@66d89fb1[a=[hello]]> but was:<....Integer@66d89fb1[a=[java.lang.String@6fb117f0]]>
  ToStringBuilderTest.testBooleanArray:798 expected:<...ng.Integer@66d89fb1[[{true,false,false}]]> but was:<...ng.Integer@66d89fb1[[[Z@11a74355]]>
  ToStringBuilderTest.testBooleanArrayArray:877 expected:<...g.Integer@66d89fb1[{[{true,false},<null>,{false}]}]> but was:<...g.Integer@66d89fb1[{[[Z@6c32064b,<null>,[Z@483b5d6b]}]>
  ToStringBuilderTest.testByteArray:758 expected:<...ng.Integer@66d89fb1[[{1,2,-3,4}]]> but was:<...ng.Integer@66d89fb1[[[B@7040f445]]>
  ToStringBuilderTest.testByteArrayArray:837 expected:<...g.Integer@66d89fb1[{[{1,2},<null>,{5}]}]> but was:<...g.Integer@66d89fb1[{[[B@76a5f472,<null>,[B@953a539]}]>
  ToStringBuilderTest.testCharArray:768 expected:<...ng.Integer@66d89fb1[[{A,2,_,D}]]> but was:<...ng.Integer@66d89fb1[[[C@778d1cbd]]>
  ToStringBuilderTest.testCharArrayArray:847 expected:<...g.Integer@66d89fb1[{[{A,B},<null>,{p}]}]> but was:<...g.Integer@66d89fb1[{[[C@6a0d8573,<null>,[C@1db4776a]}]>
  ToStringBuilderTest.testDoubleArray:778 expected:<...ng.Integer@66d89fb1[[{1.0,2.9876,-3.00001,4.3}]]> but was:<...ng.Integer@66d89fb1[[[D@628e2b14]]>
  ToStringBuilderTest.testDoubleArrayArray:857 expected:<...g.Integer@66d89fb1[{[{1.0,2.29686},<null>,{NaN}]}]> but was:<...g.Integer@66d89fb1[{[[D@9a0e408,<null>,[D@21dace28]}]>
  ToStringBuilderTest.testFloatArray:788 expected:<...ng.Integer@66d89fb1[[{1.0,2.9876,-3.00001,4.3}]]> but was:<...ng.Integer@66d89fb1[[[F@317240d9]]>
  ToStringBuilderTest.testFloatArrayArray:867 expected:<...g.Integer@66d89fb1[{[{1.0,2.29686},<null>,{NaN}]}]> but was:<...g.Integer@66d89fb1[{[[F@7c358a80,<null>,[F@1f181935]}]>
  ToStringBuilderTest.testInheritedReflectionStatics:947 expected:<...de560[staticString2=[staticString2],staticInt2=67890]> but was:<...de560[staticString2=[java.lang.String@260a68c8],staticInt2=67890]>
  ToStringBuilderTest.testInnerClassReflection:376 expected:<...Outer$Inner@533d9c96[[]]]> but was:<...Outer$Inner@533d9c96[]]>
  ToStringBuilderTest.testIntArray:738 expected:<...ng.Integer@66d89fb1[[{1,2,-3,4}]]> but was:<...ng.Integer@66d89fb1[[[I@1c2baa00]]>
  ToStringBuilderTest.testIntArrayArray:817 expected:<...g.Integer@66d89fb1[{[{1,2},<null>,{5}]}]> but was:<...g.Integer@66d89fb1[{[[I@22b27cca,<null>,[I@741ec391]}]>
  ToStringBuilderTest.testLongArray:728 expected:<...ng.Integer@66d89fb1[[{1,2,-3,4}]]> but was:<...ng.Integer@66d89fb1[[[J@702f9d0a]]>
  ToStringBuilderTest.testLongArrayArray:807 expected:<...g.Integer@66d89fb1[{[{1,2},<null>,{5}]}]> but was:<...g.Integer@66d89fb1[{[[J@259881f0,<null>,[J@3f7ac6d8]}]>
  ToStringBuilderTest.testObject:629 expected:<....Integer@66d89fb1[a=[<size=0>]]> but was:<....Integer@66d89fb1[a=[java.util.ArrayList@216c6a89]]>
  ToStringBuilderTest.testObjectBuild:647 expected:<....Integer@66d89fb1[a=[<size=0>]]> but was:<....Integer@66d89fb1[a=[java.util.ArrayList@315eba99]]>
  ToStringBuilderTest.testObjectCycle:892 expected:<...$ObjectCycle@2d8cc78[[org.apache.commons.lang3.builder.ToStringBuilderTest$ObjectCycle@422cac21]]]> but was:<...$ObjectCycle@2d8cc78[]]>
  ToStringBuilderTest.testReflectionArrayAndObjectCycle:576 expected:<...TestFixture@1c997c85[[o=[Ljava.lang.Object;@72607cad]]}]> but was:<...TestFixture@1c997c85[]}]>
  ToStringBuilderTest.testReflectionArrayArrayCycle:432 expected:<...g.Object;@409c799b[{[{[[Ljava.lang.Object;@409c799b,[[Ljava.lang.Object;@409c799b},{[[Ljava.lang.Object;@409c799b,[[Ljava.lang.Object;@409c799b}]}]> but was:<...g.Object;@409c799b[{[[Ljava.lang.Object;@60f3d040,[Ljava.lang.Object;@26ed4b7a]}]>
  ToStringBuilderTest.testReflectionArrayCycleLevel2:416 expected:<...g.Object;@317916a0[{[{[Ljava.lang.Object;@317916a0}]}]> but was:<...g.Object;@317916a0[{[[Ljava.lang.Object;@4bc7bc0]}]>
  ToStringBuilderTest.testReflectionBooleanArrayArray:307 expected:<[[Z@381702ff[{[{true,false},<null>,{false}]}]> but was:<[[Z@381702ff[{[[Z@6ec5d01d,<null>,[Z@7ce258bb]}]>
  ToStringBuilderTest.testReflectionByteArrayArray:280 expected:<[[B@756535fa[{[{1,2},<null>,{5}]}]> but was:<[[B@756535fa[{[[B@47baec4c,<null>,[B@40ef965e]}]>
  ToStringBuilderTest.testReflectionCharArrayArray:289 expected:<[[C@20be0e6e[{[{A,B},<null>,{p}]}]> but was:<[[C@20be0e6e[{[[C@1da5688d,<null>,[C@5673102f]}]>
  ToStringBuilderTest.testReflectionDoubleArrayArray:298 expected:<[[D@1594af77[{[{1.0,2.29686},<null>,{NaN}]}]> but was:<[[D@1594af77[{[[D@548bb8b2,<null>,[D@210ad97b]}]>
  ToStringBuilderTest.testReflectionFloatArrayArray:243 expected:<[[F@63ae6098[{[{1.0,2.29686},<null>,{NaN}]}]> but was:<[[F@63ae6098[{[[F@4d47ce48,<null>,[F@2538009b]}]>
  ToStringBuilderTest.testReflectionIntArrayArray:262 expected:<[[I@8beab46[{[{1,2},<null>,{5}]}]> but was:<[[I@8beab46[{[[I@1dde8526,<null>,[I@7bf7911b]}]>
  ToStringBuilderTest.testReflectionLongArrayArray:253 expected:<[[J@74ef95c6[{[{1,2},<null>,{5}]}]> but was:<[[J@74ef95c6[{[[J@1d523624,<null>,[J@608486]}]>
  ToStringBuilderTest.testReflectionObjectArray:160 expected:<...;@517a564[{<null>,5,[{3,6}]}]> but was:<...;@517a564[{<null>,5,[[I@536b4ad8]}]>
  ToStringBuilderTest.testReflectionObjectCycle:562 expected:<...nTestCycleB@727f6c7d[[a=org.apache.commons.lang3.builder.ToStringBuilderTest$ReflectionTestCycleA@28fed5b1]]]> but was:<...nTestCycleB@727f6c7d[]]>
  ToStringBuilderTest.testReflectionStatics:927 expected:<...5d5d35[staticString=[staticString,staticInt=12345,instanceString=instanceString],instanceInt=67890]> but was:<...5d5d35[staticString=[java.lang.String@20a8a84c,staticInt=12345,instanceString=java.lang.String@171f6179],instanceInt=67890]>
  ToStringBuilderTest.testReflectionhortArrayArray:271 expected:<[[S@6ed0cc34[{[{1,2},<null>,{5}]}]> but was:<[[S@6ed0cc34[{[[S@4e0ea2c2,<null>,[S@22df9697]}]>
  ToStringBuilderTest.testSelfInstanceTwoVarsReflectionObjectCycle:549 expected:<...@46e5dce1,otherType=[The Other Type]]> but was:<...@46e5dce1,otherType=[java.lang.String@fd94e60]]>
  ToStringBuilderTest.testShortArray:748 expected:<...ng.Integer@66d89fb1[[{1,2,-3,4}]]> but was:<...ng.Integer@66d89fb1[[[S@6cc986d2]]>
  ToStringBuilderTest.testShortArrayArray:827 expected:<...g.Integer@66d89fb1[{[{1,2},<null>,{5}]}]> but was:<...g.Integer@66d89fb1[{[[S@275a83d,<null>,[S@7a783e0d]}]>
  ToStringBuilderTest.testSimpleReflectionStatics:907 expected:<...50b410[staticString=[staticString],staticInt=12345]> but was:<...50b410[staticString=[java.lang.String@20a8a84c],staticInt=12345]>

Tests in error: 
  ArrayUtilsTest.testToString:53 » NullPointer
  DefaultToStringStyleTest.testObjectArray:104 » NullPointer
  JsonToStringStyleTest.testAppendSuper:74 » NullPointer
  JsonToStringStyleTest.testObject:114 » NullPointer
  JsonToStringStyleTest.testPerson:192 » NullPointer
  MultiLineToStringStyleTest.testObjectArray:105 » NullPointer
  NoClassNameToStringStyleTest.testAppendSuper:60 » NullPointer
  NoClassNameToStringStyleTest.testLongArray:113 » NullPointer
  NoClassNameToStringStyleTest.testLongArrayArray:122 » NullPointer
  NoClassNameToStringStyleTest.testObject:70 » NullPointer
  NoClassNameToStringStyleTest.testObjectArray:102 » NullPointer
  NoClassNameToStringStyleTest.testPerson:89 » NullPointer
  NoFieldNamesToStringStyleTest.testObjectArray:104 » NullPointer
  RecursiveToStringStyleTest.testObjectArray:107 » NullPointer
  ShortPrefixToStringStyleTest.testObjectArray:104 » NullPointer
  SimpleToStringStyleTest.testAppendSuper:60 » NullPointer
  SimpleToStringStyleTest.testLongArray:113 » NullPointer
  SimpleToStringStyleTest.testLongArrayArray:122 » NullPointer
  SimpleToStringStyleTest.testObject:70 » NullPointer
  SimpleToStringStyleTest.testObjectArray:102 » NullPointer
  SimpleToStringStyleTest.testPerson:89 » NullPointer
  StandardToStringStyleTest.testObjectArray:119 » NullPointer
  ToStringBuilderTest.testObjectArray:717 » NullPointer
  StrTokenizerTest.test1:60 » NullPointer
  StrTokenizerTest.test2:81 » NullPointer
  StrTokenizerTest.test3:102 » NullPointer
  StrTokenizerTest.test4:123 » NullPointer
  StrTokenizerTest.test5:145 » NullPointer
  StrTokenizerTest.test6:179 » NullPointer
  StrTokenizerTest.test7:202 » NullPointer
  StrTokenizerTest.test8:223 » NullPointer


Tests run: 3526, Failures: 90, Errors: 31, Skipped: 97

[INFO] ------------------------------------------------------------------------
[INFO] BUILD FAILURE
[INFO] ------------------------------------------------------------------------
[INFO] Total time: 31.052s
[INFO] Finished at: Tue Aug 04 09:21:08 BST 2015
[INFO] Final Memory: 26M/500M
[INFO] ------------------------------------------------------------------------
[ERROR] Failed to execute goal org.apache.maven.plugins:maven-surefire-plugin:2.18:test (default-test) on project commons-lang3: There are test failures.
[ERROR] 
[ERROR] Please refer to /home/perham/Study/LittleDarwin/Cases/commons-lang3-3.4-src/target/surefire-reports for the individual test results.
[ERROR] -> [Help 1]
[ERROR] 
[ERROR] To see the full stack trace of the errors, re-run Maven with the -e switch.
[ERROR] Re-run Maven using the -X switch to enable full debug logging.
[ERROR] 
[ERROR] For more information about the errors and possible solutions, please read the following articles:
[ERROR] [Help 1] http://cwiki.apache.org/confluence/display/MAVEN/MojoFailureException
