[INFO] Scanning for projects...
[INFO]                                                                         
[INFO] ------------------------------------------------------------------------
[INFO] Building Apache Commons Lang 3.4
[INFO] ------------------------------------------------------------------------
[INFO] 
[INFO] --- maven-enforcer-plugin:1.3.1:enforce (enforce-maven-3) @ commons-lang3 ---
[INFO] 
[INFO] --- build-helper-maven-plugin:1.8:parse-version (parse-version) @ commons-lang3 ---
[INFO] 
[INFO] --- maven-antrun-plugin:1.8:run (javadoc.resources) @ commons-lang3 ---
[INFO] Executing tasks

main:
[INFO] Executed tasks
[INFO] 
[INFO] --- maven-remote-resources-plugin:1.5:process (default) @ commons-lang3 ---
[INFO] 
[INFO] --- buildnumber-maven-plugin:1.3:create (default) @ commons-lang3 ---
[INFO] Executing: /bin/sh -c cd /home/perham/Study/LittleDarwin/Cases/commons-lang3-3.4-src && svn --non-interactive info
[INFO] Working directory: /home/perham/Study/LittleDarwin/Cases/commons-lang3-3.4-src
[INFO] Storing buildNumber: ?????? at timestamp: 1438676260124
[INFO] Executing: /bin/sh -c cd /home/perham/Study/LittleDarwin/Cases/commons-lang3-3.4-src && svn --non-interactive info
[INFO] Working directory: /home/perham/Study/LittleDarwin/Cases/commons-lang3-3.4-src
[INFO] Storing buildScmBranch: UNKNOWN_BRANCH
[INFO] 
[INFO] --- maven-resources-plugin:2.7:resources (default-resources) @ commons-lang3 ---
[INFO] Using 'ISO-8859-1' encoding to copy filtered resources.
[INFO] Copying 0 resource
[INFO] Copying 2 resources to META-INF
[INFO] 
[INFO] --- maven-compiler-plugin:3.2:compile (default-compile) @ commons-lang3 ---
[INFO] Changes detected - recompiling the module!
[INFO] Compiling 133 source files to /home/perham/Study/LittleDarwin/Cases/commons-lang3-3.4-src/target/classes
[INFO] /home/perham/Study/LittleDarwin/Cases/commons-lang3-3.4-src/src/main/java/org/apache/commons/lang3/SerializationUtils.java: /home/perham/Study/LittleDarwin/Cases/commons-lang3-3.4-src/src/main/java/org/apache/commons/lang3/SerializationUtils.java uses unchecked or unsafe operations.
[INFO] /home/perham/Study/LittleDarwin/Cases/commons-lang3-3.4-src/src/main/java/org/apache/commons/lang3/SerializationUtils.java: Recompile with -Xlint:unchecked for details.
[INFO] 
[INFO] --- maven-bundle-plugin:2.5.3:manifest (bundle-manifest) @ commons-lang3 ---
[INFO] 
[INFO] --- animal-sniffer-maven-plugin:1.13:check (checkAPIcompatibility) @ commons-lang3 ---
[INFO] Checking unresolved references to org.codehaus.mojo.signature:java16:1.0
[INFO] 
[INFO] --- maven-resources-plugin:2.7:testResources (default-testResources) @ commons-lang3 ---
[INFO] Using 'ISO-8859-1' encoding to copy filtered resources.
[INFO] Copying 2 resources
[INFO] Copying 2 resources to META-INF
[INFO] 
[INFO] --- maven-compiler-plugin:3.2:testCompile (default-testCompile) @ commons-lang3 ---
[INFO] Nothing to compile - all classes are up to date
[INFO] 
[INFO] --- maven-surefire-plugin:2.18:test (default-test) @ commons-lang3 ---
[INFO] Surefire report directory: /home/perham/Study/LittleDarwin/Cases/commons-lang3-3.4-src/target/surefire-reports

-------------------------------------------------------
 T E S T S
-------------------------------------------------------
Running org.apache.commons.lang3.ValidateTest
Tests run: 63, Failures: 0, Errors: 0, Skipped: 0, Time elapsed: 0.031 sec - in org.apache.commons.lang3.ValidateTest
Running org.apache.commons.lang3.LocaleUtilsTest
Tests run: 15, Failures: 0, Errors: 0, Skipped: 0, Time elapsed: 0.018 sec - in org.apache.commons.lang3.LocaleUtilsTest
Running org.apache.commons.lang3.tuple.MutableTripleTest
Tests run: 8, Failures: 0, Errors: 0, Skipped: 0, Time elapsed: 0.01 sec - in org.apache.commons.lang3.tuple.MutableTripleTest
Running org.apache.commons.lang3.tuple.TripleTest
Tests run: 10, Failures: 0, Errors: 0, Skipped: 0, Time elapsed: 0.007 sec - in org.apache.commons.lang3.tuple.TripleTest
Running org.apache.commons.lang3.tuple.ImmutablePairTest
Tests run: 6, Failures: 0, Errors: 0, Skipped: 0, Time elapsed: 0.001 sec - in org.apache.commons.lang3.tuple.ImmutablePairTest
Running org.apache.commons.lang3.tuple.MutablePairTest
Tests run: 8, Failures: 0, Errors: 0, Skipped: 0, Time elapsed: 0.001 sec - in org.apache.commons.lang3.tuple.MutablePairTest
Running org.apache.commons.lang3.tuple.ImmutableTripleTest
Tests run: 6, Failures: 0, Errors: 0, Skipped: 0, Time elapsed: 0.001 sec - in org.apache.commons.lang3.tuple.ImmutableTripleTest
Running org.apache.commons.lang3.tuple.PairTest
Tests run: 9, Failures: 0, Errors: 0, Skipped: 0, Time elapsed: 0.002 sec - in org.apache.commons.lang3.tuple.PairTest
Running org.apache.commons.lang3.StringUtilsIsTest
Tests run: 8, Failures: 0, Errors: 0, Skipped: 0, Time elapsed: 0.015 sec - in org.apache.commons.lang3.StringUtilsIsTest
Running org.apache.commons.lang3.JavaVersionTest
Tests run: 3, Failures: 0, Errors: 0, Skipped: 0, Time elapsed: 0 sec - in org.apache.commons.lang3.JavaVersionTest
Running org.apache.commons.lang3.builder.NoFieldNamesToStringStyleTest
Tests run: 8, Failures: 6, Errors: 0, Skipped: 0, Time elapsed: 0.015 sec <<< FAILURE! - in org.apache.commons.lang3.builder.NoFieldNamesToStringStyleTest
testObjectArray(org.apache.commons.lang3.builder.NoFieldNamesToStringStyleTest)  Time elapsed: 0.01 sec  <<< FAILURE!
org.junit.ComparisonFailure: expected:<...er@3edcbc7b[{<null>,[5,{3,6}]}]> but was:<...er@3edcbc7b[{<null>,[java.lang.Integer@3edcbc7b,[I@422bcbb9]}]>
	at org.junit.Assert.assertEquals(Assert.java:115)
	at org.junit.Assert.assertEquals(Assert.java:144)
	at org.apache.commons.lang3.builder.NoFieldNamesToStringStyleTest.testObjectArray(NoFieldNamesToStringStyleTest.java:104)

testLongArrayArray(org.apache.commons.lang3.builder.NoFieldNamesToStringStyleTest)  Time elapsed: 0 sec  <<< FAILURE!
org.junit.ComparisonFailure: expected:<...g.Integer@3edcbc7b[{[{1,2},<null>,{5}]}]> but was:<...g.Integer@3edcbc7b[{[[J@7b2f2f8,<null>,[J@756d7bba]}]>
	at org.junit.Assert.assertEquals(Assert.java:115)
	at org.junit.Assert.assertEquals(Assert.java:144)
	at org.apache.commons.lang3.builder.NoFieldNamesToStringStyleTest.testLongArrayArray(NoFieldNamesToStringStyleTest.java:124)

testLongArray(org.apache.commons.lang3.builder.NoFieldNamesToStringStyleTest)  Time elapsed: 0 sec  <<< FAILURE!
org.junit.ComparisonFailure: expected:<...ng.Integer@3edcbc7b[[{1,2,-3,4}]]> but was:<...ng.Integer@3edcbc7b[[[J@66d62c90]]>
	at org.junit.Assert.assertEquals(Assert.java:115)
	at org.junit.Assert.assertEquals(Assert.java:144)
	at org.apache.commons.lang3.builder.NoFieldNamesToStringStyleTest.testLongArray(NoFieldNamesToStringStyleTest.java:115)

testObject(org.apache.commons.lang3.builder.NoFieldNamesToStringStyleTest)  Time elapsed: 0.003 sec  <<< FAILURE!
org.junit.ComparisonFailure: expected:<...ng.Integer@3edcbc7b[[<size=0>]]> but was:<...ng.Integer@3edcbc7b[[java.util.ArrayList@3a16cef5]]>
	at org.junit.Assert.assertEquals(Assert.java:115)
	at org.junit.Assert.assertEquals(Assert.java:144)
	at org.apache.commons.lang3.builder.NoFieldNamesToStringStyleTest.testObject(NoFieldNamesToStringStyleTest.java:76)

testPerson(org.apache.commons.lang3.builder.NoFieldNamesToStringStyleTest)  Time elapsed: 0.002 sec  <<< FAILURE!
org.junit.ComparisonFailure: expected:<...est$Person@2f6d549e[[Ron Paul],72,false]> but was:<...est$Person@2f6d549e[[java.lang.String@32ce6965],72,false]>
	at org.junit.Assert.assertEquals(Assert.java:115)
	at org.junit.Assert.assertEquals(Assert.java:144)
	at org.apache.commons.lang3.builder.NoFieldNamesToStringStyleTest.testPerson(NoFieldNamesToStringStyleTest.java:91)

testAppendSuper(org.apache.commons.lang3.builder.NoFieldNamesToStringStyleTest)  Time elapsed: 0 sec  <<< FAILURE!
org.junit.ComparisonFailure: expected:<...ng.Integer@3edcbc7b[[hello]]> but was:<...ng.Integer@3edcbc7b[[java.lang.String@d697ff2]]>
	at org.junit.Assert.assertEquals(Assert.java:115)
	at org.junit.Assert.assertEquals(Assert.java:144)
	at org.apache.commons.lang3.builder.NoFieldNamesToStringStyleTest.testAppendSuper(NoFieldNamesToStringStyleTest.java:61)

Running org.apache.commons.lang3.builder.ShortPrefixToStringStyleTest
Tests run: 8, Failures: 6, Errors: 0, Skipped: 0, Time elapsed: 0.001 sec <<< FAILURE! - in org.apache.commons.lang3.builder.ShortPrefixToStringStyleTest
testObjectArray(org.apache.commons.lang3.builder.ShortPrefixToStringStyleTest)  Time elapsed: 0 sec  <<< FAILURE!
org.junit.ComparisonFailure: expected:<Integer[{<null>,[5,{3,6}]}]> but was:<Integer[{<null>,[java.lang.Integer@3edcbc7b,[I@94eefbf]}]>
	at org.junit.Assert.assertEquals(Assert.java:115)
	at org.junit.Assert.assertEquals(Assert.java:144)
	at org.apache.commons.lang3.builder.ShortPrefixToStringStyleTest.testObjectArray(ShortPrefixToStringStyleTest.java:104)

testLongArrayArray(org.apache.commons.lang3.builder.ShortPrefixToStringStyleTest)  Time elapsed: 0 sec  <<< FAILURE!
org.junit.ComparisonFailure: expected:<Integer[{[{1,2},<null>,{5}]}]> but was:<Integer[{[[J@1d5de95f,<null>,[J@846b09]}]>
	at org.junit.Assert.assertEquals(Assert.java:115)
	at org.junit.Assert.assertEquals(Assert.java:144)
	at org.apache.commons.lang3.builder.ShortPrefixToStringStyleTest.testLongArrayArray(ShortPrefixToStringStyleTest.java:124)

testLongArray(org.apache.commons.lang3.builder.ShortPrefixToStringStyleTest)  Time elapsed: 0 sec  <<< FAILURE!
org.junit.ComparisonFailure: expected:<Integer[[{1,2,-3,4}]]> but was:<Integer[[[J@758f1c22]]>
	at org.junit.Assert.assertEquals(Assert.java:115)
	at org.junit.Assert.assertEquals(Assert.java:144)
	at org.apache.commons.lang3.builder.ShortPrefixToStringStyleTest.testLongArray(ShortPrefixToStringStyleTest.java:115)

testObject(org.apache.commons.lang3.builder.ShortPrefixToStringStyleTest)  Time elapsed: 0 sec  <<< FAILURE!
org.junit.ComparisonFailure: expected:<Integer[a=[<size=0>]]> but was:<Integer[a=[java.util.ArrayList@680387a]]>
	at org.junit.Assert.assertEquals(Assert.java:115)
	at org.junit.Assert.assertEquals(Assert.java:144)
	at org.apache.commons.lang3.builder.ShortPrefixToStringStyleTest.testObject(ShortPrefixToStringStyleTest.java:76)

testPerson(org.apache.commons.lang3.builder.ShortPrefixToStringStyleTest)  Time elapsed: 0.001 sec  <<< FAILURE!
org.junit.ComparisonFailure: expected:<...yleTest.Person[name=[John Q. Public],age=45,smoker=true]> but was:<...yleTest.Person[name=[java.lang.String@257b746],age=45,smoker=true]>
	at org.junit.Assert.assertEquals(Assert.java:115)
	at org.junit.Assert.assertEquals(Assert.java:144)
	at org.apache.commons.lang3.builder.ShortPrefixToStringStyleTest.testPerson(ShortPrefixToStringStyleTest.java:91)

testAppendSuper(org.apache.commons.lang3.builder.ShortPrefixToStringStyleTest)  Time elapsed: 0 sec  <<< FAILURE!
org.junit.ComparisonFailure: expected:<Integer[a=[hello]]> but was:<Integer[a=[java.lang.String@d697ff2]]>
	at org.junit.Assert.assertEquals(Assert.java:115)
	at org.junit.Assert.assertEquals(Assert.java:144)
	at org.apache.commons.lang3.builder.ShortPrefixToStringStyleTest.testAppendSuper(ShortPrefixToStringStyleTest.java:61)

Running org.apache.commons.lang3.builder.DiffResultTest
Tests run: 9, Failures: 0, Errors: 0, Skipped: 0, Time elapsed: 0.006 sec - in org.apache.commons.lang3.builder.DiffResultTest
Running org.apache.commons.lang3.builder.CompareToBuilderTest
Tests run: 48, Failures: 0, Errors: 0, Skipped: 0, Time elapsed: 0.018 sec - in org.apache.commons.lang3.builder.CompareToBuilderTest
Running org.apache.commons.lang3.builder.MultilineRecursiveToStringStyleTest
Tests run: 10, Failures: 9, Errors: 0, Skipped: 0, Time elapsed: 0.008 sec <<< FAILURE! - in org.apache.commons.lang3.builder.MultilineRecursiveToStringStyleTest
doubleArray(org.apache.commons.lang3.builder.MultilineRecursiveToStringStyleTest)  Time elapsed: 0 sec  <<< FAILURE!
org.junit.ComparisonFailure: expected:<...ull>,
  doubleArray=[{
    1.0,
    2.0
  }],
  longArray=<null>...> but was:<...ull>,
  doubleArray=[[D@3096f94],
  longArray=<null>...>
	at org.junit.Assert.assertEquals(Assert.java:115)
	at org.junit.Assert.assertEquals(Assert.java:144)
	at org.apache.commons.lang3.builder.MultilineRecursiveToStringStyleTest.doubleArray(MultilineRecursiveToStringStyleTest.java:167)

stringArray(org.apache.commons.lang3.builder.MultilineRecursiveToStringStyleTest)  Time elapsed: 0.001 sec  <<< FAILURE!
org.junit.ComparisonFailure: expected:<...ull>,
  stringArray=[{
    a,
    A
  }]
]> but was:<...ull>,
  stringArray=[[Ljava.lang.String;@547d573]
]>
	at org.junit.Assert.assertEquals(Assert.java:115)
	at org.junit.Assert.assertEquals(Assert.java:144)
	at org.apache.commons.lang3.builder.MultilineRecursiveToStringStyleTest.stringArray(MultilineRecursiveToStringStyleTest.java:203)

simpleObject(org.apache.commons.lang3.builder.MultilineRecursiveToStringStyleTest)  Time elapsed: 0 sec  <<< FAILURE!
org.junit.ComparisonFailure: expected:<...mount=100.0,
  date=[2014.10.15]
]> but was:<...mount=100.0,
  date=[java.lang.String@2a807bbc]
]>
	at org.junit.Assert.assertEquals(Assert.java:115)
	at org.junit.Assert.assertEquals(Assert.java:144)
	at org.apache.commons.lang3.builder.MultilineRecursiveToStringStyleTest.simpleObject(MultilineRecursiveToStringStyleTest.java:42)

longArray(org.apache.commons.lang3.builder.MultilineRecursiveToStringStyleTest)  Time elapsed: 0 sec  <<< FAILURE!
org.junit.ComparisonFailure: expected:<...<null>,
  longArray=[{
    1,
    2
  }],
  stringArray=<nul...> but was:<...<null>,
  longArray=[[J@53bc45d4],
  stringArray=<nul...>
	at org.junit.Assert.assertEquals(Assert.java:115)
	at org.junit.Assert.assertEquals(Assert.java:144)
	at org.apache.commons.lang3.builder.MultilineRecursiveToStringStyleTest.longArray(MultilineRecursiveToStringStyleTest.java:185)

intArray(org.apache.commons.lang3.builder.MultilineRecursiveToStringStyleTest)  Time elapsed: 0 sec  <<< FAILURE!
org.junit.ComparisonFailure: expected:<...=<null>,
  intArray=[{
    1,
    2
  }],
  doubleArray=<nul...> but was:<...=<null>,
  intArray=[[I@264b72a2],
  doubleArray=<nul...>
	at org.junit.Assert.assertEquals(Assert.java:115)
	at org.junit.Assert.assertEquals(Assert.java:144)
	at org.apache.commons.lang3.builder.MultilineRecursiveToStringStyleTest.intArray(MultilineRecursiveToStringStyleTest.java:149)

nestedAndArray(org.apache.commons.lang3.builder.MultilineRecursiveToStringStyleTest)  Time elapsed: 0.001 sec  <<< FAILURE!
org.junit.ComparisonFailure: expected:<...l.ArrayList@6eaaf8f2[{
    org.apache.commons.lang3.builder.MultilineRecursiveToStringStyleTest$Transaction@1abe10a1[
      amount=100.0,
      date=2014.10.14
    ],
    org.apache.commons.lang3.builder.MultilineRecursiveToStringStyleTest$Transaction@3435c7be[
      amount=50.0,
      date=2014.10.15
    ]
  }]
]> but was:<...l.ArrayList@6eaaf8f2[]
]>
	at org.junit.Assert.assertEquals(Assert.java:115)
	at org.junit.Assert.assertEquals(Assert.java:144)
	at org.apache.commons.lang3.builder.MultilineRecursiveToStringStyleTest.nestedAndArray(MultilineRecursiveToStringStyleTest.java:80)

charArray(org.apache.commons.lang3.builder.MultilineRecursiveToStringStyleTest)  Time elapsed: 0.001 sec  <<< FAILURE!
org.junit.ComparisonFailure: expected:<...<null>,
  charArray=[{
    a,
    A
  }],
  intArray=<null>,...> but was:<...<null>,
  charArray=[[C@44471a09],
  intArray=<null>,...>
	at org.junit.Assert.assertEquals(Assert.java:115)
	at org.junit.Assert.assertEquals(Assert.java:144)
	at org.apache.commons.lang3.builder.MultilineRecursiveToStringStyleTest.charArray(MultilineRecursiveToStringStyleTest.java:131)

nestedElements(org.apache.commons.lang3.builder.MultilineRecursiveToStringStyleTest)  Time elapsed: 0.001 sec  <<< FAILURE!
org.junit.ComparisonFailure: expected:<...er@17fe67e4[
  name=[Douglas Adams,
  bank=org.apache.commons.lang3.builder.MultilineRecursiveToStringStyleTest$Bank@3f56b60a[
    name=ASF Bank
  ]],
  accounts=<null>
...> but was:<...er@17fe67e4[
  name=[java.lang.String@1a907c4e,
  bank=org.apache.commons.lang3.builder.MultilineRecursiveToStringStyleTest$Bank@3f56b60a],
  accounts=<null>
...>
	at org.junit.Assert.assertEquals(Assert.java:115)
	at org.junit.Assert.assertEquals(Assert.java:144)
	at org.apache.commons.lang3.builder.MultilineRecursiveToStringStyleTest.nestedElements(MultilineRecursiveToStringStyleTest.java:57)

boolArray(org.apache.commons.lang3.builder.MultilineRecursiveToStringStyleTest)  Time elapsed: 0.004 sec  <<< FAILURE!
org.junit.ComparisonFailure: expected:<...d0f282[
  boolArray=[{
    true,
    false,
    true
  }],
  charArray=<null>...> but was:<...d0f282[
  boolArray=[[Z@ae136c3],
  charArray=<null>...>
	at org.junit.Assert.assertEquals(Assert.java:115)
	at org.junit.Assert.assertEquals(Assert.java:144)
	at org.apache.commons.lang3.builder.MultilineRecursiveToStringStyleTest.boolArray(MultilineRecursiveToStringStyleTest.java:113)

Running org.apache.commons.lang3.builder.RecursiveToStringStyleTest
Tests run: 8, Failures: 6, Errors: 0, Skipped: 0, Time elapsed: 0.001 sec <<< FAILURE! - in org.apache.commons.lang3.builder.RecursiveToStringStyleTest
testObjectArray(org.apache.commons.lang3.builder.RecursiveToStringStyleTest)  Time elapsed: 0 sec  <<< FAILURE!
org.junit.ComparisonFailure: expected:<...er@3edcbc7b[{<null>,[5,{3,6}]}]> but was:<...er@3edcbc7b[{<null>,[java.lang.Integer@3edcbc7b,[I@3cdd17f5]}]>
	at org.junit.Assert.assertEquals(Assert.java:115)
	at org.junit.Assert.assertEquals(Assert.java:144)
	at org.apache.commons.lang3.builder.RecursiveToStringStyleTest.testObjectArray(RecursiveToStringStyleTest.java:107)

testLongArrayArray(org.apache.commons.lang3.builder.RecursiveToStringStyleTest)  Time elapsed: 0 sec  <<< FAILURE!
org.junit.ComparisonFailure: expected:<...g.Integer@3edcbc7b[{[{1,2},<null>,{5}]}]> but was:<...g.Integer@3edcbc7b[{[[J@574ff50a,<null>,[J@4260904e]}]>
	at org.junit.Assert.assertEquals(Assert.java:115)
	at org.junit.Assert.assertEquals(Assert.java:144)
	at org.apache.commons.lang3.builder.RecursiveToStringStyleTest.testLongArrayArray(RecursiveToStringStyleTest.java:127)

testLongArray(org.apache.commons.lang3.builder.RecursiveToStringStyleTest)  Time elapsed: 0 sec  <<< FAILURE!
org.junit.ComparisonFailure: expected:<...ng.Integer@3edcbc7b[[{1,2,-3,4}]]> but was:<...ng.Integer@3edcbc7b[[[J@51a212ed]]>
	at org.junit.Assert.assertEquals(Assert.java:115)
	at org.junit.Assert.assertEquals(Assert.java:144)
	at org.apache.commons.lang3.builder.RecursiveToStringStyleTest.testLongArray(RecursiveToStringStyleTest.java:118)

testObject(org.apache.commons.lang3.builder.RecursiveToStringStyleTest)  Time elapsed: 0 sec  <<< FAILURE!
org.junit.ComparisonFailure: expected:<....Integer@3edcbc7b[a=[<size=0>]]> but was:<....Integer@3edcbc7b[a=[java.util.ArrayList@6788af79]]>
	at org.junit.Assert.assertEquals(Assert.java:115)
	at org.junit.Assert.assertEquals(Assert.java:144)
	at org.apache.commons.lang3.builder.RecursiveToStringStyleTest.testObject(RecursiveToStringStyleTest.java:75)

testPerson(org.apache.commons.lang3.builder.RecursiveToStringStyleTest)  Time elapsed: 0 sec  <<< FAILURE!
org.junit.ComparisonFailure: expected:<...erson@3eb86609[name=[John Doe,age=33,smoker=false,job=org.apache.commons.lang3.builder.RecursiveToStringStyleTest$Job@3c32f90a[title=Manager]]]> but was:<...erson@3eb86609[name=[java.lang.String@eafd67c,age=33,smoker=false,job=org.apache.commons.lang3.builder.RecursiveToStringStyleTest$Job@3c32f90a]]>
	at org.junit.Assert.assertEquals(Assert.java:115)
	at org.junit.Assert.assertEquals(Assert.java:144)
	at org.apache.commons.lang3.builder.RecursiveToStringStyleTest.testPerson(RecursiveToStringStyleTest.java:93)

testAppendSuper(org.apache.commons.lang3.builder.RecursiveToStringStyleTest)  Time elapsed: 0 sec  <<< FAILURE!
org.junit.ComparisonFailure: expected:<....Integer@3edcbc7b[a=[hello]]> but was:<....Integer@3edcbc7b[a=[java.lang.String@d697ff2]]>
	at org.junit.Assert.assertEquals(Assert.java:115)
	at org.junit.Assert.assertEquals(Assert.java:144)
	at org.apache.commons.lang3.builder.RecursiveToStringStyleTest.testAppendSuper(RecursiveToStringStyleTest.java:60)

Running org.apache.commons.lang3.builder.DefaultToStringStyleTest
Tests run: 8, Failures: 6, Errors: 0, Skipped: 0, Time elapsed: 0.001 sec <<< FAILURE! - in org.apache.commons.lang3.builder.DefaultToStringStyleTest
testObjectArray(org.apache.commons.lang3.builder.DefaultToStringStyleTest)  Time elapsed: 0 sec  <<< FAILURE!
org.junit.ComparisonFailure: expected:<...er@3edcbc7b[{<null>,[5,{3,6}]}]> but was:<...er@3edcbc7b[{<null>,[java.lang.Integer@3edcbc7b,[I@74e51332]}]>
	at org.junit.Assert.assertEquals(Assert.java:115)
	at org.junit.Assert.assertEquals(Assert.java:144)
	at org.apache.commons.lang3.builder.DefaultToStringStyleTest.testObjectArray(DefaultToStringStyleTest.java:104)

testLongArrayArray(org.apache.commons.lang3.builder.DefaultToStringStyleTest)  Time elapsed: 0 sec  <<< FAILURE!
org.junit.ComparisonFailure: expected:<...g.Integer@3edcbc7b[{[{1,2},<null>,{5}]}]> but was:<...g.Integer@3edcbc7b[{[[J@6b4f7392,<null>,[J@2d2cad48]}]>
	at org.junit.Assert.assertEquals(Assert.java:115)
	at org.junit.Assert.assertEquals(Assert.java:144)
	at org.apache.commons.lang3.builder.DefaultToStringStyleTest.testLongArrayArray(DefaultToStringStyleTest.java:124)

testLongArray(org.apache.commons.lang3.builder.DefaultToStringStyleTest)  Time elapsed: 0 sec  <<< FAILURE!
org.junit.ComparisonFailure: expected:<...ng.Integer@3edcbc7b[[{1,2,-3,4}]]> but was:<...ng.Integer@3edcbc7b[[[J@50246923]]>
	at org.junit.Assert.assertEquals(Assert.java:115)
	at org.junit.Assert.assertEquals(Assert.java:144)
	at org.apache.commons.lang3.builder.DefaultToStringStyleTest.testLongArray(DefaultToStringStyleTest.java:115)

testObject(org.apache.commons.lang3.builder.DefaultToStringStyleTest)  Time elapsed: 0 sec  <<< FAILURE!
org.junit.ComparisonFailure: expected:<....Integer@3edcbc7b[a=[<size=0>]]> but was:<....Integer@3edcbc7b[a=[java.util.ArrayList@672a1f0]]>
	at org.junit.Assert.assertEquals(Assert.java:115)
	at org.junit.Assert.assertEquals(Assert.java:144)
	at org.apache.commons.lang3.builder.DefaultToStringStyleTest.testObject(DefaultToStringStyleTest.java:76)

testPerson(org.apache.commons.lang3.builder.DefaultToStringStyleTest)  Time elapsed: 0 sec  <<< FAILURE!
org.junit.ComparisonFailure: expected:<...erson@4fe596de[name=[John Doe],age=33,smoker=false...> but was:<...erson@4fe596de[name=[java.lang.String@eafd67c],age=33,smoker=false...>
	at org.junit.Assert.assertEquals(Assert.java:115)
	at org.junit.Assert.assertEquals(Assert.java:144)
	at org.apache.commons.lang3.builder.DefaultToStringStyleTest.testPerson(DefaultToStringStyleTest.java:91)

testAppendSuper(org.apache.commons.lang3.builder.DefaultToStringStyleTest)  Time elapsed: 0 sec  <<< FAILURE!
org.junit.ComparisonFailure: expected:<....Integer@3edcbc7b[a=[hello]]> but was:<....Integer@3edcbc7b[a=[java.lang.String@d697ff2]]>
	at org.junit.Assert.assertEquals(Assert.java:115)
	at org.junit.Assert.assertEquals(Assert.java:144)
	at org.apache.commons.lang3.builder.DefaultToStringStyleTest.testAppendSuper(DefaultToStringStyleTest.java:61)

Running org.apache.commons.lang3.builder.ReflectionToStringBuilderExcludeTest
Tests run: 11, Failures: 11, Errors: 0, Skipped: 0, Time elapsed: 0.001 sec <<< FAILURE! - in org.apache.commons.lang3.builder.ReflectionToStringBuilderExcludeTest
test_toStringExcludeEmptyCollection(org.apache.commons.lang3.builder.ReflectionToStringBuilderExcludeTest)  Time elapsed: 0 sec  <<< FAILURE!
java.lang.AssertionError: null
	at org.junit.Assert.fail(Assert.java:86)
	at org.junit.Assert.assertTrue(Assert.java:41)
	at org.junit.Assert.assertTrue(Assert.java:52)
	at org.apache.commons.lang3.builder.ReflectionToStringBuilderExcludeTest.validateSecretFieldPresent(ReflectionToStringBuilderExcludeTest.java:134)
	at org.apache.commons.lang3.builder.ReflectionToStringBuilderExcludeTest.test_toStringExcludeEmptyCollection(ReflectionToStringBuilderExcludeTest.java:108)

test_toStringExcludeArrayWithNull(org.apache.commons.lang3.builder.ReflectionToStringBuilderExcludeTest)  Time elapsed: 0 sec  <<< FAILURE!
java.lang.AssertionError: null
	at org.junit.Assert.fail(Assert.java:86)
	at org.junit.Assert.assertTrue(Assert.java:41)
	at org.junit.Assert.assertTrue(Assert.java:52)
	at org.apache.commons.lang3.builder.ReflectionToStringBuilderExcludeTest.validateSecretFieldPresent(ReflectionToStringBuilderExcludeTest.java:134)
	at org.apache.commons.lang3.builder.ReflectionToStringBuilderExcludeTest.test_toStringExcludeArrayWithNull(ReflectionToStringBuilderExcludeTest.java:65)

test_toStringExcludeArray(org.apache.commons.lang3.builder.ReflectionToStringBuilderExcludeTest)  Time elapsed: 0 sec  <<< FAILURE!
java.lang.AssertionError: null
	at org.junit.Assert.fail(Assert.java:86)
	at org.junit.Assert.assertTrue(Assert.java:41)
	at org.junit.Assert.assertTrue(Assert.java:52)
	at org.apache.commons.lang3.builder.ReflectionToStringBuilderExcludeTest.validateNonSecretField(ReflectionToStringBuilderExcludeTest.java:125)
	at org.apache.commons.lang3.builder.ReflectionToStringBuilderExcludeTest.validateSecretFieldAbsent(ReflectionToStringBuilderExcludeTest.java:130)
	at org.apache.commons.lang3.builder.ReflectionToStringBuilderExcludeTest.test_toStringExcludeArray(ReflectionToStringBuilderExcludeTest.java:59)

test_toStringExcludeNullCollection(org.apache.commons.lang3.builder.ReflectionToStringBuilderExcludeTest)  Time elapsed: 0 sec  <<< FAILURE!
java.lang.AssertionError: null
	at org.junit.Assert.fail(Assert.java:86)
	at org.junit.Assert.assertTrue(Assert.java:41)
	at org.junit.Assert.assertTrue(Assert.java:52)
	at org.apache.commons.lang3.builder.ReflectionToStringBuilderExcludeTest.validateSecretFieldPresent(ReflectionToStringBuilderExcludeTest.java:134)
	at org.apache.commons.lang3.builder.ReflectionToStringBuilderExcludeTest.test_toStringExcludeNullCollection(ReflectionToStringBuilderExcludeTest.java:120)

test_toStringExcludeCollection(org.apache.commons.lang3.builder.ReflectionToStringBuilderExcludeTest)  Time elapsed: 0 sec  <<< FAILURE!
java.lang.AssertionError: null
	at org.junit.Assert.fail(Assert.java:86)
	at org.junit.Assert.assertTrue(Assert.java:41)
	at org.junit.Assert.assertTrue(Assert.java:52)
	at org.apache.commons.lang3.builder.ReflectionToStringBuilderExcludeTest.validateNonSecretField(ReflectionToStringBuilderExcludeTest.java:125)
	at org.apache.commons.lang3.builder.ReflectionToStringBuilderExcludeTest.validateSecretFieldAbsent(ReflectionToStringBuilderExcludeTest.java:130)
	at org.apache.commons.lang3.builder.ReflectionToStringBuilderExcludeTest.test_toStringExcludeCollection(ReflectionToStringBuilderExcludeTest.java:79)

test_toStringExcludeNullArray(org.apache.commons.lang3.builder.ReflectionToStringBuilderExcludeTest)  Time elapsed: 0 sec  <<< FAILURE!
java.lang.AssertionError: null
	at org.junit.Assert.fail(Assert.java:86)
	at org.junit.Assert.assertTrue(Assert.java:41)
	at org.junit.Assert.assertTrue(Assert.java:52)
	at org.apache.commons.lang3.builder.ReflectionToStringBuilderExcludeTest.validateSecretFieldPresent(ReflectionToStringBuilderExcludeTest.java:134)
	at org.apache.commons.lang3.builder.ReflectionToStringBuilderExcludeTest.test_toStringExcludeNullArray(ReflectionToStringBuilderExcludeTest.java:114)

test_toStringExcludeEmptyArray(org.apache.commons.lang3.builder.ReflectionToStringBuilderExcludeTest)  Time elapsed: 0 sec  <<< FAILURE!
java.lang.AssertionError: null
	at org.junit.Assert.fail(Assert.java:86)
	at org.junit.Assert.assertTrue(Assert.java:41)
	at org.junit.Assert.assertTrue(Assert.java:52)
	at org.apache.commons.lang3.builder.ReflectionToStringBuilderExcludeTest.validateSecretFieldPresent(ReflectionToStringBuilderExcludeTest.java:134)
	at org.apache.commons.lang3.builder.ReflectionToStringBuilderExcludeTest.test_toStringExcludeEmptyArray(ReflectionToStringBuilderExcludeTest.java:102)

test_toStringExclude(org.apache.commons.lang3.builder.ReflectionToStringBuilderExcludeTest)  Time elapsed: 0 sec  <<< FAILURE!
java.lang.AssertionError: null
	at org.junit.Assert.fail(Assert.java:86)
	at org.junit.Assert.assertTrue(Assert.java:41)
	at org.junit.Assert.assertTrue(Assert.java:52)
	at org.apache.commons.lang3.builder.ReflectionToStringBuilderExcludeTest.validateNonSecretField(ReflectionToStringBuilderExcludeTest.java:125)
	at org.apache.commons.lang3.builder.ReflectionToStringBuilderExcludeTest.validateSecretFieldAbsent(ReflectionToStringBuilderExcludeTest.java:130)
	at org.apache.commons.lang3.builder.ReflectionToStringBuilderExcludeTest.test_toStringExclude(ReflectionToStringBuilderExcludeTest.java:53)

test_toStringExcludeCollectionWithNulls(org.apache.commons.lang3.builder.ReflectionToStringBuilderExcludeTest)  Time elapsed: 0 sec  <<< FAILURE!
java.lang.AssertionError: null
	at org.junit.Assert.fail(Assert.java:86)
	at org.junit.Assert.assertTrue(Assert.java:41)
	at org.junit.Assert.assertTrue(Assert.java:52)
	at org.apache.commons.lang3.builder.ReflectionToStringBuilderExcludeTest.validateSecretFieldPresent(ReflectionToStringBuilderExcludeTest.java:134)
	at org.apache.commons.lang3.builder.ReflectionToStringBuilderExcludeTest.test_toStringExcludeCollectionWithNulls(ReflectionToStringBuilderExcludeTest.java:96)

test_toStringExcludeArrayWithNulls(org.apache.commons.lang3.builder.ReflectionToStringBuilderExcludeTest)  Time elapsed: 0 sec  <<< FAILURE!
java.lang.AssertionError: null
	at org.junit.Assert.fail(Assert.java:86)
	at org.junit.Assert.assertTrue(Assert.java:41)
	at org.junit.Assert.assertTrue(Assert.java:52)
	at org.apache.commons.lang3.builder.ReflectionToStringBuilderExcludeTest.validateSecretFieldPresent(ReflectionToStringBuilderExcludeTest.java:134)
	at org.apache.commons.lang3.builder.ReflectionToStringBuilderExcludeTest.test_toStringExcludeArrayWithNulls(ReflectionToStringBuilderExcludeTest.java:71)

test_toStringExcludeCollectionWithNull(org.apache.commons.lang3.builder.ReflectionToStringBuilderExcludeTest)  Time elapsed: 0 sec  <<< FAILURE!
java.lang.AssertionError: null
	at org.junit.Assert.fail(Assert.java:86)
	at org.junit.Assert.assertTrue(Assert.java:41)
	at org.junit.Assert.assertTrue(Assert.java:52)
	at org.apache.commons.lang3.builder.ReflectionToStringBuilderExcludeTest.validateSecretFieldPresent(ReflectionToStringBuilderExcludeTest.java:134)
	at org.apache.commons.lang3.builder.ReflectionToStringBuilderExcludeTest.test_toStringExcludeCollectionWithNull(ReflectionToStringBuilderExcludeTest.java:87)

Running org.apache.commons.lang3.builder.StandardToStringStyleTest
Tests run: 8, Failures: 6, Errors: 0, Skipped: 0, Time elapsed: 0.004 sec <<< FAILURE! - in org.apache.commons.lang3.builder.StandardToStringStyleTest
testObjectArray(org.apache.commons.lang3.builder.StandardToStringStyleTest)  Time elapsed: 0 sec  <<< FAILURE!
org.junit.ComparisonFailure: expected:<Integer[[%NULL%, [5, [3, 6]]]]> but was:<Integer[[%NULL%, [java.lang.Integer@3edcbc7b, [I@102ecebf]]]>
	at org.junit.Assert.assertEquals(Assert.java:115)
	at org.junit.Assert.assertEquals(Assert.java:144)
	at org.apache.commons.lang3.builder.StandardToStringStyleTest.testObjectArray(StandardToStringStyleTest.java:119)

testLongArrayArray(org.apache.commons.lang3.builder.StandardToStringStyleTest)  Time elapsed: 0 sec  <<< FAILURE!
org.junit.ComparisonFailure: expected:<Integer[[[[1, 2], %NULL%, [5]]]]> but was:<Integer[[[[J@710765e5, %NULL%, [J@1cb2d75c]]]>
	at org.junit.Assert.assertEquals(Assert.java:115)
	at org.junit.Assert.assertEquals(Assert.java:144)
	at org.apache.commons.lang3.builder.StandardToStringStyleTest.testLongArrayArray(StandardToStringStyleTest.java:139)

testLongArray(org.apache.commons.lang3.builder.StandardToStringStyleTest)  Time elapsed: 0 sec  <<< FAILURE!
org.junit.ComparisonFailure: expected:<Integer[[[1, 2, -3, 4]]]> but was:<Integer[[[J@2158e7bc]]>
	at org.junit.Assert.assertEquals(Assert.java:115)
	at org.junit.Assert.assertEquals(Assert.java:144)
	at org.apache.commons.lang3.builder.StandardToStringStyleTest.testLongArray(StandardToStringStyleTest.java:130)

testObject(org.apache.commons.lang3.builder.StandardToStringStyleTest)  Time elapsed: 0 sec  <<< FAILURE!
org.junit.ComparisonFailure: expected:<Integer[a=[%SIZE=0%]]> but was:<Integer[a=[java.util.ArrayList@53d5f8be]]>
	at org.junit.Assert.assertEquals(Assert.java:115)
	at org.junit.Assert.assertEquals(Assert.java:144)
	at org.apache.commons.lang3.builder.StandardToStringStyleTest.testObject(StandardToStringStyleTest.java:91)

testPerson(org.apache.commons.lang3.builder.StandardToStringStyleTest)  Time elapsed: 0 sec  <<< FAILURE!
org.junit.ComparisonFailure: expected:<...yleTest.Person[name=[Suzy Queue],age=19,smoker=false...> but was:<...yleTest.Person[name=[java.lang.String@40a5464c],age=19,smoker=false...>
	at org.junit.Assert.assertEquals(Assert.java:115)
	at org.junit.Assert.assertEquals(Assert.java:144)
	at org.apache.commons.lang3.builder.StandardToStringStyleTest.testPerson(StandardToStringStyleTest.java:106)

testAppendSuper(org.apache.commons.lang3.builder.StandardToStringStyleTest)  Time elapsed: 0.001 sec  <<< FAILURE!
org.junit.ComparisonFailure: expected:<Integer[a=[hello]]> but was:<Integer[a=[java.lang.String@d697ff2]]>
	at org.junit.Assert.assertEquals(Assert.java:115)
	at org.junit.Assert.assertEquals(Assert.java:144)
	at org.apache.commons.lang3.builder.StandardToStringStyleTest.testAppendSuper(StandardToStringStyleTest.java:76)

Running org.apache.commons.lang3.builder.ToStringStyleTest
Tests run: 12, Failures: 0, Errors: 0, Skipped: 0, Time elapsed: 0.003 sec - in org.apache.commons.lang3.builder.ToStringStyleTest
Running org.apache.commons.lang3.builder.DiffTest
Tests run: 4, Failures: 0, Errors: 0, Skipped: 0, Time elapsed: 0.001 sec - in org.apache.commons.lang3.builder.DiffTest
Running org.apache.commons.lang3.builder.SimpleToStringStyleTest
Tests run: 8, Failures: 6, Errors: 0, Skipped: 0, Time elapsed: 0.005 sec <<< FAILURE! - in org.apache.commons.lang3.builder.SimpleToStringStyleTest
testObjectArray(org.apache.commons.lang3.builder.SimpleToStringStyleTest)  Time elapsed: 0.001 sec  <<< FAILURE!
org.junit.ComparisonFailure: expected:<{<null>,5,[{3,6}]}> but was:<{<null>,5,[[I@22aa48bc]}>
	at org.junit.Assert.assertEquals(Assert.java:115)
	at org.junit.Assert.assertEquals(Assert.java:144)
	at org.apache.commons.lang3.builder.SimpleToStringStyleTest.testObjectArray(SimpleToStringStyleTest.java:102)

testLongArrayArray(org.apache.commons.lang3.builder.SimpleToStringStyleTest)  Time elapsed: 0 sec  <<< FAILURE!
org.junit.ComparisonFailure: expected:<{[{1,2},<null>,{5}]}> but was:<{[[J@598d406b,<null>,[J@48805ebb]}>
	at org.junit.Assert.assertEquals(Assert.java:115)
	at org.junit.Assert.assertEquals(Assert.java:144)
	at org.apache.commons.lang3.builder.SimpleToStringStyleTest.testLongArrayArray(SimpleToStringStyleTest.java:122)

testLongArray(org.apache.commons.lang3.builder.SimpleToStringStyleTest)  Time elapsed: 0.001 sec  <<< FAILURE!
org.junit.ComparisonFailure: expected:<[{1,2,-3,4}]> but was:<[[J@63cb6c2c]>
	at org.junit.Assert.assertEquals(Assert.java:115)
	at org.junit.Assert.assertEquals(Assert.java:144)
	at org.apache.commons.lang3.builder.SimpleToStringStyleTest.testLongArray(SimpleToStringStyleTest.java:113)

testObject(org.apache.commons.lang3.builder.SimpleToStringStyleTest)  Time elapsed: 0.001 sec  <<< FAILURE!
org.junit.ComparisonFailure: expected:<[<size=0>]> but was:<[java.util.ArrayList@402aefe3]>
	at org.junit.Assert.assertEquals(Assert.java:115)
	at org.junit.Assert.assertEquals(Assert.java:144)
	at org.apache.commons.lang3.builder.SimpleToStringStyleTest.testObject(SimpleToStringStyleTest.java:75)

testPerson(org.apache.commons.lang3.builder.SimpleToStringStyleTest)  Time elapsed: 0 sec  <<< FAILURE!
org.junit.ComparisonFailure: expected:<[Jane Q. Public],47,false> but was:<[java.lang.String@42eb40fe],47,false>
	at org.junit.Assert.assertEquals(Assert.java:115)
	at org.junit.Assert.assertEquals(Assert.java:144)
	at org.apache.commons.lang3.builder.SimpleToStringStyleTest.testPerson(SimpleToStringStyleTest.java:89)

testAppendSuper(org.apache.commons.lang3.builder.SimpleToStringStyleTest)  Time elapsed: 0.001 sec  <<< FAILURE!
org.junit.ComparisonFailure: expected:<[hello]> but was:<[java.lang.String@d697ff2]>
	at org.junit.Assert.assertEquals(Assert.java:115)
	at org.junit.Assert.assertEquals(Assert.java:144)
	at org.apache.commons.lang3.builder.SimpleToStringStyleTest.testAppendSuper(SimpleToStringStyleTest.java:60)

Running org.apache.commons.lang3.builder.MultiLineToStringStyleTest
Tests run: 8, Failures: 6, Errors: 0, Skipped: 0, Time elapsed: 0.005 sec <<< FAILURE! - in org.apache.commons.lang3.builder.MultiLineToStringStyleTest
testObjectArray(org.apache.commons.lang3.builder.MultiLineToStringStyleTest)  Time elapsed: 0 sec  <<< FAILURE!
org.junit.ComparisonFailure: expected:<...3edcbc7b[
  {<null>,[5,{3,6}]}
]> but was:<...3edcbc7b[
  {<null>,[java.lang.Integer@3edcbc7b,[I@62f80604]}
]>
	at org.junit.Assert.assertEquals(Assert.java:115)
	at org.junit.Assert.assertEquals(Assert.java:144)
	at org.apache.commons.lang3.builder.MultiLineToStringStyleTest.testObjectArray(MultiLineToStringStyleTest.java:105)

testLongArrayArray(org.apache.commons.lang3.builder.MultiLineToStringStyleTest)  Time elapsed: 0 sec  <<< FAILURE!
org.junit.ComparisonFailure: expected:<...nteger@3edcbc7b[
  {[{1,2},<null>,{5}]}
]> but was:<...nteger@3edcbc7b[
  {[[J@953235f,<null>,[J@313736c1]}
]>
	at org.junit.Assert.assertEquals(Assert.java:115)
	at org.junit.Assert.assertEquals(Assert.java:144)
	at org.apache.commons.lang3.builder.MultiLineToStringStyleTest.testLongArrayArray(MultiLineToStringStyleTest.java:125)

testLongArray(org.apache.commons.lang3.builder.MultiLineToStringStyleTest)  Time elapsed: 0 sec  <<< FAILURE!
org.junit.ComparisonFailure: expected:<...Integer@3edcbc7b[
  [{1,2,-3,4}]
]> but was:<...Integer@3edcbc7b[
  [[J@1febd225]
]>
	at org.junit.Assert.assertEquals(Assert.java:115)
	at org.junit.Assert.assertEquals(Assert.java:144)
	at org.apache.commons.lang3.builder.MultiLineToStringStyleTest.testLongArray(MultiLineToStringStyleTest.java:116)

testObject(org.apache.commons.lang3.builder.MultiLineToStringStyleTest)  Time elapsed: 0.002 sec  <<< FAILURE!
org.junit.ComparisonFailure: expected:<...teger@3edcbc7b[
  a=[<size=0>]
]> but was:<...teger@3edcbc7b[
  a=[java.util.ArrayList@33318b82]
]>
	at org.junit.Assert.assertEquals(Assert.java:115)
	at org.junit.Assert.assertEquals(Assert.java:144)
	at org.apache.commons.lang3.builder.MultiLineToStringStyleTest.testObject(MultiLineToStringStyleTest.java:77)

testPerson(org.apache.commons.lang3.builder.MultiLineToStringStyleTest)  Time elapsed: 0 sec  <<< FAILURE!
org.junit.ComparisonFailure: expected:<...on@79be1e0f[
  name=[Jane Doe]
  age=25
  smoker=t...> but was:<...on@79be1e0f[
  name=[java.lang.String@30a7a93a]
  age=25
  smoker=t...>
	at org.junit.Assert.assertEquals(Assert.java:115)
	at org.junit.Assert.assertEquals(Assert.java:144)
	at org.apache.commons.lang3.builder.MultiLineToStringStyleTest.testPerson(MultiLineToStringStyleTest.java:92)

testAppendSuper(org.apache.commons.lang3.builder.MultiLineToStringStyleTest)  Time elapsed: 0 sec  <<< FAILURE!
org.junit.ComparisonFailure: expected:<...teger@3edcbc7b[
  a=[hello]
]> but was:<...teger@3edcbc7b[
  a=[java.lang.String@d697ff2]
]>
	at org.junit.Assert.assertEquals(Assert.java:115)
	at org.junit.Assert.assertEquals(Assert.java:144)
	at org.apache.commons.lang3.builder.MultiLineToStringStyleTest.testAppendSuper(MultiLineToStringStyleTest.java:62)

Running org.apache.commons.lang3.builder.ToStringStyleConcurrencyTest
Tests run: 3, Failures: 0, Errors: 0, Skipped: 0, Time elapsed: 0.38 sec - in org.apache.commons.lang3.builder.ToStringStyleConcurrencyTest
Running org.apache.commons.lang3.builder.ReflectionToStringBuilderMutateInspectConcurrencyTest
Tests run: 1, Failures: 0, Errors: 0, Skipped: 1, Time elapsed: 0.001 sec - in org.apache.commons.lang3.builder.ReflectionToStringBuilderMutateInspectConcurrencyTest
Running org.apache.commons.lang3.builder.ToStringBuilderTest
Tests run: 74, Failures: 43, Errors: 0, Skipped: 1, Time elapsed: 0.057 sec <<< FAILURE! - in org.apache.commons.lang3.builder.ToStringBuilderTest
testCharArray(org.apache.commons.lang3.builder.ToStringBuilderTest)  Time elapsed: 0.001 sec  <<< FAILURE!
org.junit.ComparisonFailure: expected:<...ng.Integer@3edcbc7b[[{A,2,_,D}]]> but was:<...ng.Integer@3edcbc7b[[[C@5b888e9e]]>
	at org.junit.Assert.assertEquals(Assert.java:115)
	at org.junit.Assert.assertEquals(Assert.java:144)
	at org.apache.commons.lang3.builder.ToStringBuilderTest.testCharArray(ToStringBuilderTest.java:768)

testDoubleArrayArray(org.apache.commons.lang3.builder.ToStringBuilderTest)  Time elapsed: 0 sec  <<< FAILURE!
org.junit.ComparisonFailure: expected:<...g.Integer@3edcbc7b[{[{1.0,2.29686},<null>,{NaN}]}]> but was:<...g.Integer@3edcbc7b[{[[D@757ff1ad,<null>,[D@22d3d11f]}]>
	at org.junit.Assert.assertEquals(Assert.java:115)
	at org.junit.Assert.assertEquals(Assert.java:144)
	at org.apache.commons.lang3.builder.ToStringBuilderTest.testDoubleArrayArray(ToStringBuilderTest.java:857)

testReflectionBoolean(org.apache.commons.lang3.builder.ToStringBuilderTest)  Time elapsed: 0 sec  <<< FAILURE!
org.junit.ComparisonFailure: expected:<...lean@6b6a4b18[value=[true]]> but was:<...lean@6b6a4b18[value=[java.lang.Boolean@d86edfb]]>
	at org.junit.Assert.assertEquals(Assert.java:115)
	at org.junit.Assert.assertEquals(Assert.java:144)
	at org.apache.commons.lang3.builder.ToStringBuilderTest.testReflectionBoolean(ToStringBuilderTest.java:116)

testObjectArray(org.apache.commons.lang3.builder.ToStringBuilderTest)  Time elapsed: 0.001 sec  <<< FAILURE!
org.junit.ComparisonFailure: expected:<...er@3edcbc7b[{<null>,[5,{3,6}]}]> but was:<...er@3edcbc7b[{<null>,[java.lang.Integer@3edcbc7b,[I@157200ad]}]>
	at org.junit.Assert.assertEquals(Assert.java:115)
	at org.junit.Assert.assertEquals(Assert.java:144)
	at org.apache.commons.lang3.builder.ToStringBuilderTest.testObjectArray(ToStringBuilderTest.java:717)

testObjectBuild(org.apache.commons.lang3.builder.ToStringBuilderTest)  Time elapsed: 0.001 sec  <<< FAILURE!
org.junit.ComparisonFailure: expected:<....Integer@3edcbc7b[a=[<size=0>]]> but was:<....Integer@3edcbc7b[a=[java.util.ArrayList@6f8a68da]]>
	at org.junit.Assert.assertEquals(Assert.java:115)
	at org.junit.Assert.assertEquals(Assert.java:144)
	at org.apache.commons.lang3.builder.ToStringBuilderTest.testObjectBuild(ToStringBuilderTest.java:647)

testObjectCycle(org.apache.commons.lang3.builder.ToStringBuilderTest)  Time elapsed: 0.001 sec  <<< FAILURE!
org.junit.ComparisonFailure: expected:<...ObjectCycle@31f61519[[org.apache.commons.lang3.builder.ToStringBuilderTest$ObjectCycle@67e9f96b]]]> but was:<...ObjectCycle@31f61519[]]>
	at org.junit.Assert.assertEquals(Assert.java:115)
	at org.junit.Assert.assertEquals(Assert.java:144)
	at org.apache.commons.lang3.builder.ToStringBuilderTest.testObjectCycle(ToStringBuilderTest.java:892)

testSelfInstanceTwoVarsReflectionObjectCycle(org.apache.commons.lang3.builder.ToStringBuilderTest)  Time elapsed: 0.001 sec  <<< FAILURE!
org.junit.ComparisonFailure: expected:<...@4da8692d,otherType=[The Other Type]]> but was:<...@4da8692d,otherType=[java.lang.String@9343bd5]]>
	at org.junit.Assert.assertEquals(Assert.java:115)
	at org.junit.Assert.assertEquals(Assert.java:144)
	at org.apache.commons.lang3.builder.ToStringBuilderTest.testSelfInstanceTwoVarsReflectionObjectCycle(ToStringBuilderTest.java:549)

testShortArrayArray(org.apache.commons.lang3.builder.ToStringBuilderTest)  Time elapsed: 0 sec  <<< FAILURE!
org.junit.ComparisonFailure: expected:<...g.Integer@3edcbc7b[{[{1,2},<null>,{5}]}]> but was:<...g.Integer@3edcbc7b[{[[S@11b13588,<null>,[S@9317ccb]}]>
	at org.junit.Assert.assertEquals(Assert.java:115)
	at org.junit.Assert.assertEquals(Assert.java:144)
	at org.apache.commons.lang3.builder.ToStringBuilderTest.testShortArrayArray(ToStringBuilderTest.java:827)

testBooleanArrayArray(org.apache.commons.lang3.builder.ToStringBuilderTest)  Time elapsed: 0 sec  <<< FAILURE!
org.junit.ComparisonFailure: expected:<...g.Integer@3edcbc7b[{[{true,false},<null>,{false}]}]> but was:<...g.Integer@3edcbc7b[{[[Z@ff7f824,<null>,[Z@60c40bac]}]>
	at org.junit.Assert.assertEquals(Assert.java:115)
	at org.junit.Assert.assertEquals(Assert.java:144)
	at org.apache.commons.lang3.builder.ToStringBuilderTest.testBooleanArrayArray(ToStringBuilderTest.java:877)

testFloatArray(org.apache.commons.lang3.builder.ToStringBuilderTest)  Time elapsed: 0.001 sec  <<< FAILURE!
org.junit.ComparisonFailure: expected:<...ng.Integer@3edcbc7b[[{1.0,2.9876,-3.00001,4.3}]]> but was:<...ng.Integer@3edcbc7b[[[F@66da7ad5]]>
	at org.junit.Assert.assertEquals(Assert.java:115)
	at org.junit.Assert.assertEquals(Assert.java:144)
	at org.apache.commons.lang3.builder.ToStringBuilderTest.testFloatArray(ToStringBuilderTest.java:788)

testByteArray(org.apache.commons.lang3.builder.ToStringBuilderTest)  Time elapsed: 0 sec  <<< FAILURE!
org.junit.ComparisonFailure: expected:<...ng.Integer@3edcbc7b[[{1,2,-3,4}]]> but was:<...ng.Integer@3edcbc7b[[[B@3651a783]]>
	at org.junit.Assert.assertEquals(Assert.java:115)
	at org.junit.Assert.assertEquals(Assert.java:144)
	at org.apache.commons.lang3.builder.ToStringBuilderTest.testByteArray(ToStringBuilderTest.java:758)

testReflectionLongArrayArray(org.apache.commons.lang3.builder.ToStringBuilderTest)  Time elapsed: 0 sec  <<< FAILURE!
org.junit.ComparisonFailure: expected:<[[J@61797eca[{[{1,2},<null>,{5}]}]> but was:<[[J@61797eca[{[[J@6f7331c4,<null>,[J@73c87405]}]>
	at org.junit.Assert.assertEquals(Assert.java:115)
	at org.junit.Assert.assertEquals(Assert.java:144)
	at org.apache.commons.lang3.builder.ToStringBuilderTest.testReflectionLongArrayArray(ToStringBuilderTest.java:253)

testReflectionArrayArrayCycle(org.apache.commons.lang3.builder.ToStringBuilderTest)  Time elapsed: 0.001 sec  <<< FAILURE!
org.junit.ComparisonFailure: expected:<...g.Object;@6d392fa5[{[{[[Ljava.lang.Object;@6d392fa5,[[Ljava.lang.Object;@6d392fa5},{[[Ljava.lang.Object;@6d392fa5,[[Ljava.lang.Object;@6d392fa5}]}]> but was:<...g.Object;@6d392fa5[{[[Ljava.lang.Object;@456731a8,[Ljava.lang.Object;@79ed3030]}]>
	at org.junit.Assert.assertEquals(Assert.java:115)
	at org.junit.Assert.assertEquals(Assert.java:144)
	at org.apache.commons.lang3.builder.ToStringBuilderTest.testReflectionArrayArrayCycle(ToStringBuilderTest.java:432)

testLongArrayArray(org.apache.commons.lang3.builder.ToStringBuilderTest)  Time elapsed: 0 sec  <<< FAILURE!
org.junit.ComparisonFailure: expected:<...g.Integer@3edcbc7b[{[{1,2},<null>,{5}]}]> but was:<...g.Integer@3edcbc7b[{[[J@5d5ef3e7,<null>,[J@4def295]}]>
	at org.junit.Assert.assertEquals(Assert.java:115)
	at org.junit.Assert.assertEquals(Assert.java:144)
	at org.apache.commons.lang3.builder.ToStringBuilderTest.testLongArrayArray(ToStringBuilderTest.java:807)

testReflectionDoubleArrayArray(org.apache.commons.lang3.builder.ToStringBuilderTest)  Time elapsed: 0 sec  <<< FAILURE!
org.junit.ComparisonFailure: expected:<[[D@320a2593[{[{1.0,2.29686},<null>,{NaN}]}]> but was:<[[D@320a2593[{[[D@3828ef8f,<null>,[D@787b217]}]>
	at org.junit.Assert.assertEquals(Assert.java:115)
	at org.junit.Assert.assertEquals(Assert.java:144)
	at org.apache.commons.lang3.builder.ToStringBuilderTest.testReflectionDoubleArrayArray(ToStringBuilderTest.java:298)

testReflectionInteger(org.apache.commons.lang3.builder.ToStringBuilderTest)  Time elapsed: 0 sec  <<< FAILURE!
org.junit.ComparisonFailure: expected:<...eger@3edcbc7b[value=[5]]> but was:<...eger@3edcbc7b[value=[java.lang.Integer@254f6e3f]]>
	at org.junit.Assert.assertEquals(Assert.java:115)
	at org.junit.Assert.assertEquals(Assert.java:144)
	at org.apache.commons.lang3.builder.ToStringBuilderTest.testReflectionInteger(ToStringBuilderTest.java:97)

testBooleanArray(org.apache.commons.lang3.builder.ToStringBuilderTest)  Time elapsed: 0 sec  <<< FAILURE!
org.junit.ComparisonFailure: expected:<...ng.Integer@3edcbc7b[[{true,false,false}]]> but was:<...ng.Integer@3edcbc7b[[[Z@1cefd3c]]>
	at org.junit.Assert.assertEquals(Assert.java:115)
	at org.junit.Assert.assertEquals(Assert.java:144)
	at org.apache.commons.lang3.builder.ToStringBuilderTest.testBooleanArray(ToStringBuilderTest.java:798)

testFloatArrayArray(org.apache.commons.lang3.builder.ToStringBuilderTest)  Time elapsed: 0.001 sec  <<< FAILURE!
org.junit.ComparisonFailure: expected:<...g.Integer@3edcbc7b[{[{1.0,2.29686},<null>,{NaN}]}]> but was:<...g.Integer@3edcbc7b[{[[F@3c536f11,<null>,[F@9a0e408]}]>
	at org.junit.Assert.assertEquals(Assert.java:115)
	at org.junit.Assert.assertEquals(Assert.java:144)
	at org.apache.commons.lang3.builder.ToStringBuilderTest.testFloatArrayArray(ToStringBuilderTest.java:867)

testReflectionIntArrayArray(org.apache.commons.lang3.builder.ToStringBuilderTest)  Time elapsed: 0 sec  <<< FAILURE!
org.junit.ComparisonFailure: expected:<[[I@4b9526d4[{[{1,2},<null>,{5}]}]> but was:<[[I@4b9526d4[{[[I@2d284f10,<null>,[I@315eba99]}]>
	at org.junit.Assert.assertEquals(Assert.java:115)
	at org.junit.Assert.assertEquals(Assert.java:144)
	at org.apache.commons.lang3.builder.ToStringBuilderTest.testReflectionIntArrayArray(ToStringBuilderTest.java:262)

testSimpleReflectionStatics(org.apache.commons.lang3.builder.ToStringBuilderTest)  Time elapsed: 0.001 sec  <<< FAILURE!
org.junit.ComparisonFailure: expected:<...57dbbd[staticString=[staticString],staticInt=12345]> but was:<...57dbbd[staticString=[java.lang.String@3f14a0de],staticInt=12345]>
	at org.junit.Assert.assertEquals(Assert.java:115)
	at org.junit.Assert.assertEquals(Assert.java:144)
	at org.apache.commons.lang3.builder.ToStringBuilderTest.testSimpleReflectionStatics(ToStringBuilderTest.java:907)

testReflectionStatics(org.apache.commons.lang3.builder.ToStringBuilderTest)  Time elapsed: 0.001 sec  <<< FAILURE!
org.junit.ComparisonFailure: expected:<...8290a3[staticString=[staticString,staticInt=12345,instanceString=instanceString],instanceInt=67890]> but was:<...8290a3[staticString=[java.lang.String@3f14a0de,staticInt=12345,instanceString=java.lang.String@1d085c24],instanceInt=67890]>
	at org.junit.Assert.assertEquals(Assert.java:115)
	at org.junit.Assert.assertEquals(Assert.java:144)
	at org.apache.commons.lang3.builder.ToStringBuilderTest.testReflectionStatics(ToStringBuilderTest.java:927)

testReflectionhortArrayArray(org.apache.commons.lang3.builder.ToStringBuilderTest)  Time elapsed: 0 sec  <<< FAILURE!
org.junit.ComparisonFailure: expected:<[[S@3a888c1[{[{1,2},<null>,{5}]}]> but was:<[[S@3a888c1[{[[S@2daa38c7,<null>,[S@275a83d]}]>
	at org.junit.Assert.assertEquals(Assert.java:115)
	at org.junit.Assert.assertEquals(Assert.java:144)
	at org.apache.commons.lang3.builder.ToStringBuilderTest.testReflectionhortArrayArray(ToStringBuilderTest.java:271)

testReflectionObjectArray(org.apache.commons.lang3.builder.ToStringBuilderTest)  Time elapsed: 0.001 sec  <<< FAILURE!
org.junit.ComparisonFailure: expected:<...@7a783e0d[{<null>,5,[{3,6}]}]> but was:<...@7a783e0d[{<null>,5,[[I@6c32064b]}]>
	at org.junit.Assert.assertEquals(Assert.java:115)
	at org.junit.Assert.assertEquals(Assert.java:144)
	at org.apache.commons.lang3.builder.ToStringBuilderTest.testReflectionObjectArray(ToStringBuilderTest.java:160)

testReflectionObjectCycle(org.apache.commons.lang3.builder.ToStringBuilderTest)  Time elapsed: 0.001 sec  <<< FAILURE!
org.junit.ComparisonFailure: expected:<...nTestCycleB@317240d9[[a=org.apache.commons.lang3.builder.ToStringBuilderTest$ReflectionTestCycleA@483b5d6b]]]> but was:<...nTestCycleB@317240d9[]]>
	at org.junit.Assert.assertEquals(Assert.java:115)
	at org.junit.Assert.assertEquals(Assert.java:144)
	at org.apache.commons.lang3.builder.ToStringBuilderTest.testReflectionObjectCycle(ToStringBuilderTest.java:562)

testReflectionBooleanArrayArray(org.apache.commons.lang3.builder.ToStringBuilderTest)  Time elapsed: 0.001 sec  <<< FAILURE!
org.junit.ComparisonFailure: expected:<[[Z@3b27402d[{[{true,false},<null>,{false}]}]> but was:<[[Z@3b27402d[{[[Z@de668b2,<null>,[Z@11e3853f]}]>
	at org.junit.Assert.assertEquals(Assert.java:115)
	at org.junit.Assert.assertEquals(Assert.java:144)
	at org.apache.commons.lang3.builder.ToStringBuilderTest.testReflectionBooleanArrayArray(ToStringBuilderTest.java:307)

testLongArray(org.apache.commons.lang3.builder.ToStringBuilderTest)  Time elapsed: 0 sec  <<< FAILURE!
org.junit.ComparisonFailure: expected:<...ng.Integer@3edcbc7b[[{1,2,-3,4}]]> but was:<...ng.Integer@3edcbc7b[[[J@7040f445]]>
	at org.junit.Assert.assertEquals(Assert.java:115)
	at org.junit.Assert.assertEquals(Assert.java:144)
	at org.apache.commons.lang3.builder.ToStringBuilderTest.testLongArray(ToStringBuilderTest.java:728)

testShortArray(org.apache.commons.lang3.builder.ToStringBuilderTest)  Time elapsed: 0 sec  <<< FAILURE!
org.junit.ComparisonFailure: expected:<...ng.Integer@3edcbc7b[[{1,2,-3,4}]]> but was:<...ng.Integer@3edcbc7b[[[S@1d523624]]>
	at org.junit.Assert.assertEquals(Assert.java:115)
	at org.junit.Assert.assertEquals(Assert.java:144)
	at org.apache.commons.lang3.builder.ToStringBuilderTest.testShortArray(ToStringBuilderTest.java:748)

testIntArrayArray(org.apache.commons.lang3.builder.ToStringBuilderTest)  Time elapsed: 0.001 sec  <<< FAILURE!
org.junit.ComparisonFailure: expected:<...g.Integer@3edcbc7b[{[{1,2},<null>,{5}]}]> but was:<...g.Integer@3edcbc7b[{[[I@608486,<null>,[I@409c799b]}]>
	at org.junit.Assert.assertEquals(Assert.java:115)
	at org.junit.Assert.assertEquals(Assert.java:144)
	at org.apache.commons.lang3.builder.ToStringBuilderTest.testIntArrayArray(ToStringBuilderTest.java:817)

testInheritedReflectionStatics(org.apache.commons.lang3.builder.ToStringBuilderTest)  Time elapsed: 0.001 sec  <<< FAILURE!
org.junit.ComparisonFailure: expected:<...64a8d[staticString2=[staticString2],staticInt2=67890]> but was:<...64a8d[staticString2=[java.lang.String@3f7ac6d8],staticInt2=67890]>
	at org.junit.Assert.assertEquals(Assert.java:115)
	at org.junit.Assert.assertEquals(Assert.java:144)
	at org.apache.commons.lang3.builder.ToStringBuilderTest.testInheritedReflectionStatics(ToStringBuilderTest.java:947)

testReflectionByteArrayArray(org.apache.commons.lang3.builder.ToStringBuilderTest)  Time elapsed: 0 sec  <<< FAILURE!
org.junit.ComparisonFailure: expected:<[[B@1594af77[{[{1,2},<null>,{5}]}]> but was:<[[B@1594af77[{[[B@548bb8b2,<null>,[B@210ad97b]}]>
	at org.junit.Assert.assertEquals(Assert.java:115)
	at org.junit.Assert.assertEquals(Assert.java:144)
	at org.apache.commons.lang3.builder.ToStringBuilderTest.testReflectionByteArrayArray(ToStringBuilderTest.java:280)

testReflectionArrayCycleLevel2(org.apache.commons.lang3.builder.ToStringBuilderTest)  Time elapsed: 0 sec  <<< FAILURE!
org.junit.ComparisonFailure: expected:<...g.Object;@4f4c2b2f[{[{[Ljava.lang.Object;@4f4c2b2f}]}]> but was:<...g.Object;@4f4c2b2f[{[[Ljava.lang.Object;@11a74355]}]>
	at org.junit.Assert.assertEquals(Assert.java:115)
	at org.junit.Assert.assertEquals(Assert.java:144)
	at org.apache.commons.lang3.builder.ToStringBuilderTest.testReflectionArrayCycleLevel2(ToStringBuilderTest.java:416)

testAppendToString(org.apache.commons.lang3.builder.ToStringBuilderTest)  Time elapsed: 0.001 sec  <<< FAILURE!
org.junit.ComparisonFailure: expected:<....Integer@3edcbc7b[a=[hello]]> but was:<....Integer@3edcbc7b[a=[java.lang.String@d697ff2]]>
	at org.junit.Assert.assertEquals(Assert.java:115)
	at org.junit.Assert.assertEquals(Assert.java:144)
	at org.apache.commons.lang3.builder.ToStringBuilderTest.testAppendToString(ToStringBuilderTest.java:614)

testReflectionArrayAndObjectCycle(org.apache.commons.lang3.builder.ToStringBuilderTest)  Time elapsed: 0 sec  <<< FAILURE!
org.junit.ComparisonFailure: expected:<...TestFixture@1f181935[[o=[Ljava.lang.Object;@7c358a80]]}]> but was:<...TestFixture@1f181935[]}]>
	at org.junit.Assert.assertEquals(Assert.java:115)
	at org.junit.Assert.assertEquals(Assert.java:144)
	at org.apache.commons.lang3.builder.ToStringBuilderTest.testReflectionArrayAndObjectCycle(ToStringBuilderTest.java:576)

testReflectionCharArrayArray(org.apache.commons.lang3.builder.ToStringBuilderTest)  Time elapsed: 0 sec  <<< FAILURE!
org.junit.ComparisonFailure: expected:<[[C@671ef685[{[{A,B},<null>,{p}]}]> but was:<[[C@671ef685[{[[C@21cacaa7,<null>,[C@8beab46]}]>
	at org.junit.Assert.assertEquals(Assert.java:115)
	at org.junit.Assert.assertEquals(Assert.java:144)
	at org.apache.commons.lang3.builder.ToStringBuilderTest.testReflectionCharArrayArray(ToStringBuilderTest.java:289)

testIntArray(org.apache.commons.lang3.builder.ToStringBuilderTest)  Time elapsed: 0.001 sec  <<< FAILURE!
org.junit.ComparisonFailure: expected:<...ng.Integer@3edcbc7b[[{1,2,-3,4}]]> but was:<...ng.Integer@3edcbc7b[[[I@1dde8526]]>
	at org.junit.Assert.assertEquals(Assert.java:115)
	at org.junit.Assert.assertEquals(Assert.java:144)
	at org.apache.commons.lang3.builder.ToStringBuilderTest.testIntArray(ToStringBuilderTest.java:738)

testByteArrayArray(org.apache.commons.lang3.builder.ToStringBuilderTest)  Time elapsed: 0 sec  <<< FAILURE!
org.junit.ComparisonFailure: expected:<...g.Integer@3edcbc7b[{[{1,2},<null>,{5}]}]> but was:<...g.Integer@3edcbc7b[{[[B@7bf7911b,<null>,[B@3a57c332]}]>
	at org.junit.Assert.assertEquals(Assert.java:115)
	at org.junit.Assert.assertEquals(Assert.java:144)
	at org.apache.commons.lang3.builder.ToStringBuilderTest.testByteArrayArray(ToStringBuilderTest.java:837)

testCharArrayArray(org.apache.commons.lang3.builder.ToStringBuilderTest)  Time elapsed: 0 sec  <<< FAILURE!
org.junit.ComparisonFailure: expected:<...g.Integer@3edcbc7b[{[{A,B},<null>,{p}]}]> but was:<...g.Integer@3edcbc7b[{[[C@2250b410,<null>,[C@605d9809]}]>
	at org.junit.Assert.assertEquals(Assert.java:115)
	at org.junit.Assert.assertEquals(Assert.java:144)
	at org.apache.commons.lang3.builder.ToStringBuilderTest.testCharArrayArray(ToStringBuilderTest.java:847)

testObject(org.apache.commons.lang3.builder.ToStringBuilderTest)  Time elapsed: 0 sec  <<< FAILURE!
org.junit.ComparisonFailure: expected:<....Integer@3edcbc7b[a=[<size=0>]]> but was:<....Integer@3edcbc7b[a=[java.util.ArrayList@68bb6598]]>
	at org.junit.Assert.assertEquals(Assert.java:115)
	at org.junit.Assert.assertEquals(Assert.java:144)
	at org.apache.commons.lang3.builder.ToStringBuilderTest.testObject(ToStringBuilderTest.java:629)

testAppendSuper(org.apache.commons.lang3.builder.ToStringBuilderTest)  Time elapsed: 0 sec  <<< FAILURE!
org.junit.ComparisonFailure: expected:<....Integer@3edcbc7b[a=[hello]]> but was:<....Integer@3edcbc7b[a=[java.lang.String@d697ff2]]>
	at org.junit.Assert.assertEquals(Assert.java:115)
	at org.junit.Assert.assertEquals(Assert.java:144)
	at org.apache.commons.lang3.builder.ToStringBuilderTest.testAppendSuper(ToStringBuilderTest.java:604)

testInnerClassReflection(org.apache.commons.lang3.builder.ToStringBuilderTest)  Time elapsed: 0.001 sec  <<< FAILURE!
org.junit.ComparisonFailure: expected:<...Outer$Inner@2ead7b0c[[]]]> but was:<...Outer$Inner@2ead7b0c[]]>
	at org.junit.Assert.assertEquals(Assert.java:115)
	at org.junit.Assert.assertEquals(Assert.java:144)
	at org.apache.commons.lang3.builder.ToStringBuilderTest.testInnerClassReflection(ToStringBuilderTest.java:376)

testReflectionCharacter(org.apache.commons.lang3.builder.ToStringBuilderTest)  Time elapsed: 0.001 sec  <<< FAILURE!
org.junit.ComparisonFailure: expected:<...cter@615d5d35[value=[A]]> but was:<...cter@615d5d35[value=[java.lang.Character@38927483]]>
	at org.junit.Assert.assertEquals(Assert.java:115)
	at org.junit.Assert.assertEquals(Assert.java:144)
	at org.apache.commons.lang3.builder.ToStringBuilderTest.testReflectionCharacter(ToStringBuilderTest.java:106)

testDoubleArray(org.apache.commons.lang3.builder.ToStringBuilderTest)  Time elapsed: 0 sec  <<< FAILURE!
org.junit.ComparisonFailure: expected:<...ng.Integer@3edcbc7b[[{1.0,2.9876,-3.00001,4.3}]]> but was:<...ng.Integer@3edcbc7b[[[D@171f6179]]>
	at org.junit.Assert.assertEquals(Assert.java:115)
	at org.junit.Assert.assertEquals(Assert.java:144)
	at org.apache.commons.lang3.builder.ToStringBuilderTest.testDoubleArray(ToStringBuilderTest.java:778)

testReflectionFloatArrayArray(org.apache.commons.lang3.builder.ToStringBuilderTest)  Time elapsed: 0.001 sec  <<< FAILURE!
org.junit.ComparisonFailure: expected:<[[F@d385acb[{[{1.0,2.29686},<null>,{NaN}]}]> but was:<[[F@d385acb[{[[F@6ed0cc34,<null>,[F@4e0ea2c2]}]>
	at org.junit.Assert.assertEquals(Assert.java:115)
	at org.junit.Assert.assertEquals(Assert.java:144)
	at org.apache.commons.lang3.builder.ToStringBuilderTest.testReflectionFloatArrayArray(ToStringBuilderTest.java:243)

Running org.apache.commons.lang3.builder.EqualsBuilderTest
Tests run: 48, Failures: 0, Errors: 0, Skipped: 0, Time elapsed: 0.022 sec - in org.apache.commons.lang3.builder.EqualsBuilderTest
Running org.apache.commons.lang3.builder.HashCodeBuilderAndEqualsBuilderTest
Tests run: 4, Failures: 0, Errors: 0, Skipped: 0, Time elapsed: 0.006 sec - in org.apache.commons.lang3.builder.HashCodeBuilderAndEqualsBuilderTest
Running org.apache.commons.lang3.builder.ReflectionToStringBuilderConcurrencyTest
Tests run: 3, Failures: 0, Errors: 0, Skipped: 3, Time elapsed: 0.001 sec - in org.apache.commons.lang3.builder.ReflectionToStringBuilderConcurrencyTest
Running org.apache.commons.lang3.builder.JsonToStringStyleTest
Tests run: 9, Failures: 3, Errors: 0, Skipped: 0, Time elapsed: 0.001 sec <<< FAILURE! - in org.apache.commons.lang3.builder.JsonToStringStyleTest
testObject(org.apache.commons.lang3.builder.JsonToStringStyleTest)  Time elapsed: 0 sec  <<< FAILURE!
org.junit.ComparisonFailure: expected:<{"a":[[]]}> but was:<{"a":[java.util.ArrayList@5f7860a1]}>
	at org.junit.Assert.assertEquals(Assert.java:115)
	at org.junit.Assert.assertEquals(Assert.java:144)
	at org.apache.commons.lang3.builder.JsonToStringStyleTest.testObject(JsonToStringStyleTest.java:132)

testPerson(org.apache.commons.lang3.builder.JsonToStringStyleTest)  Time elapsed: 0 sec  <<< FAILURE!
org.junit.ComparisonFailure: expected:<{"name":["Jane Doe"],"age":25,"smoker":t...> but was:<{"name":[java.lang.String@30a7a93a],"age":25,"smoker":t...>
	at org.junit.Assert.assertEquals(Assert.java:115)
	at org.junit.Assert.assertEquals(Assert.java:144)
	at org.apache.commons.lang3.builder.JsonToStringStyleTest.testPerson(JsonToStringStyleTest.java:192)

testAppendSuper(org.apache.commons.lang3.builder.JsonToStringStyleTest)  Time elapsed: 0 sec  <<< FAILURE!
org.junit.ComparisonFailure: expected:<{"a":["hello"]}> but was:<{"a":[java.lang.String@d697ff2]}>
	at org.junit.Assert.assertEquals(Assert.java:115)
	at org.junit.Assert.assertEquals(Assert.java:144)
	at org.apache.commons.lang3.builder.JsonToStringStyleTest.testAppendSuper(JsonToStringStyleTest.java:74)

Running org.apache.commons.lang3.builder.NoClassNameToStringStyleTest
Tests run: 8, Failures: 6, Errors: 0, Skipped: 0, Time elapsed: 0.004 sec <<< FAILURE! - in org.apache.commons.lang3.builder.NoClassNameToStringStyleTest
testObjectArray(org.apache.commons.lang3.builder.NoClassNameToStringStyleTest)  Time elapsed: 0 sec  <<< FAILURE!
org.junit.ComparisonFailure: expected:<[{<null>,5,[{3,6}]}]> but was:<[{<null>,5,[[I@58101afe]}]>
	at org.junit.Assert.assertEquals(Assert.java:115)
	at org.junit.Assert.assertEquals(Assert.java:144)
	at org.apache.commons.lang3.builder.NoClassNameToStringStyleTest.testObjectArray(NoClassNameToStringStyleTest.java:102)

testLongArrayArray(org.apache.commons.lang3.builder.NoClassNameToStringStyleTest)  Time elapsed: 0 sec  <<< FAILURE!
org.junit.ComparisonFailure: expected:<[{[{1,2},<null>,{5}]}]> but was:<[{[[J@95c46dd,<null>,[J@9305bf8]}]>
	at org.junit.Assert.assertEquals(Assert.java:115)
	at org.junit.Assert.assertEquals(Assert.java:144)
	at org.apache.commons.lang3.builder.NoClassNameToStringStyleTest.testLongArrayArray(NoClassNameToStringStyleTest.java:122)

testLongArray(org.apache.commons.lang3.builder.NoClassNameToStringStyleTest)  Time elapsed: 0.001 sec  <<< FAILURE!
org.junit.ComparisonFailure: expected:<[[{1,2,-3,4}]]> but was:<[[[J@45e5fb7e]]>
	at org.junit.Assert.assertEquals(Assert.java:115)
	at org.junit.Assert.assertEquals(Assert.java:144)
	at org.apache.commons.lang3.builder.NoClassNameToStringStyleTest.testLongArray(NoClassNameToStringStyleTest.java:113)

testObject(org.apache.commons.lang3.builder.NoClassNameToStringStyleTest)  Time elapsed: 0.001 sec  <<< FAILURE!
org.junit.ComparisonFailure: expected:<[a=[<size=0>]]> but was:<[a=[java.util.ArrayList@7de2310b]]>
	at org.junit.Assert.assertEquals(Assert.java:115)
	at org.junit.Assert.assertEquals(Assert.java:144)
	at org.apache.commons.lang3.builder.NoClassNameToStringStyleTest.testObject(NoClassNameToStringStyleTest.java:75)

testPerson(org.apache.commons.lang3.builder.NoClassNameToStringStyleTest)  Time elapsed: 0.001 sec  <<< FAILURE!
org.junit.ComparisonFailure: expected:<[name=[John Q. Public],age=45,smoker=true]> but was:<[name=[java.lang.String@257b746],age=45,smoker=true]>
	at org.junit.Assert.assertEquals(Assert.java:115)
	at org.junit.Assert.assertEquals(Assert.java:144)
	at org.apache.commons.lang3.builder.NoClassNameToStringStyleTest.testPerson(NoClassNameToStringStyleTest.java:89)

testAppendSuper(org.apache.commons.lang3.builder.NoClassNameToStringStyleTest)  Time elapsed: 0 sec  <<< FAILURE!
org.junit.ComparisonFailure: expected:<[a=[hello]]> but was:<[a=[java.lang.String@d697ff2]]>
	at org.junit.Assert.assertEquals(Assert.java:115)
	at org.junit.Assert.assertEquals(Assert.java:144)
	at org.apache.commons.lang3.builder.NoClassNameToStringStyleTest.testAppendSuper(NoClassNameToStringStyleTest.java:60)

Running org.apache.commons.lang3.builder.DiffBuilderTest
Tests run: 30, Failures: 0, Errors: 0, Skipped: 0, Time elapsed: 0.025 sec - in org.apache.commons.lang3.builder.DiffBuilderTest
Running org.apache.commons.lang3.builder.HashCodeBuilderTest
Tests run: 44, Failures: 0, Errors: 0, Skipped: 0, Time elapsed: 0.016 sec - in org.apache.commons.lang3.builder.HashCodeBuilderTest
Running org.apache.commons.lang3.concurrent.AtomicInitializerTest
Tests run: 3, Failures: 0, Errors: 0, Skipped: 0, Time elapsed: 0.006 sec - in org.apache.commons.lang3.concurrent.AtomicInitializerTest
Running org.apache.commons.lang3.concurrent.CallableBackgroundInitializerTest
Tests run: 4, Failures: 0, Errors: 0, Skipped: 0, Time elapsed: 0.003 sec - in org.apache.commons.lang3.concurrent.CallableBackgroundInitializerTest
Running org.apache.commons.lang3.concurrent.BackgroundInitializerTest
Tests run: 15, Failures: 0, Errors: 0, Skipped: 0, Time elapsed: 0.011 sec - in org.apache.commons.lang3.concurrent.BackgroundInitializerTest
Running org.apache.commons.lang3.concurrent.LazyInitializerTest
Tests run: 3, Failures: 0, Errors: 0, Skipped: 0, Time elapsed: 0.003 sec - in org.apache.commons.lang3.concurrent.LazyInitializerTest
Running org.apache.commons.lang3.concurrent.BasicThreadFactoryTest
Tests run: 15, Failures: 0, Errors: 0, Skipped: 0, Time elapsed: 0.04 sec - in org.apache.commons.lang3.concurrent.BasicThreadFactoryTest
Running org.apache.commons.lang3.concurrent.ConstantInitializerTest
Tests run: 7, Failures: 0, Errors: 0, Skipped: 0, Time elapsed: 0.001 sec - in org.apache.commons.lang3.concurrent.ConstantInitializerTest
Running org.apache.commons.lang3.concurrent.MultiBackgroundInitializerTest
Tests run: 17, Failures: 0, Errors: 0, Skipped: 0, Time elapsed: 0.017 sec - in org.apache.commons.lang3.concurrent.MultiBackgroundInitializerTest
Running org.apache.commons.lang3.concurrent.AtomicSafeInitializerTest
Tests run: 4, Failures: 0, Errors: 0, Skipped: 0, Time elapsed: 0.011 sec - in org.apache.commons.lang3.concurrent.AtomicSafeInitializerTest
Running org.apache.commons.lang3.concurrent.ConcurrentUtilsTest
Tests run: 40, Failures: 0, Errors: 0, Skipped: 0, Time elapsed: 0.01 sec - in org.apache.commons.lang3.concurrent.ConcurrentUtilsTest
Running org.apache.commons.lang3.concurrent.TimedSemaphoreTest
Tests run: 15, Failures: 0, Errors: 0, Skipped: 0, Time elapsed: 1.187 sec - in org.apache.commons.lang3.concurrent.TimedSemaphoreTest
Running org.apache.commons.lang3.StringUtilsSubstringTest
Tests run: 14, Failures: 0, Errors: 0, Skipped: 0, Time elapsed: 0.006 sec - in org.apache.commons.lang3.StringUtilsSubstringTest
Running org.apache.commons.lang3.SystemUtilsTest
Tests run: 12, Failures: 0, Errors: 0, Skipped: 0, Time elapsed: 0.003 sec - in org.apache.commons.lang3.SystemUtilsTest
Running org.apache.commons.lang3.CharRangeTest
Tests run: 16, Failures: 0, Errors: 0, Skipped: 0, Time elapsed: 0.032 sec - in org.apache.commons.lang3.CharRangeTest
Running org.apache.commons.lang3.CharSetTest
Tests run: 14, Failures: 0, Errors: 0, Skipped: 0, Time elapsed: 0.008 sec - in org.apache.commons.lang3.CharSetTest
Running org.apache.commons.lang3.StringUtilsStartsEndsWithTest
Tests run: 6, Failures: 0, Errors: 0, Skipped: 0, Time elapsed: 0.003 sec - in org.apache.commons.lang3.StringUtilsStartsEndsWithTest
Running org.apache.commons.lang3.RandomStringUtilsTest
Tests run: 11, Failures: 0, Errors: 0, Skipped: 0, Time elapsed: 0.04 sec - in org.apache.commons.lang3.RandomStringUtilsTest
Running org.apache.commons.lang3.SerializationUtilsTest
Tests run: 26, Failures: 0, Errors: 0, Skipped: 0, Time elapsed: 0.044 sec - in org.apache.commons.lang3.SerializationUtilsTest
Running org.apache.commons.lang3.time.StopWatchTest
Tests run: 8, Failures: 0, Errors: 0, Skipped: 0, Time elapsed: 4.764 sec - in org.apache.commons.lang3.time.StopWatchTest
Running org.apache.commons.lang3.time.DateUtilsRoundingTest
Tests run: 22, Failures: 0, Errors: 0, Skipped: 0, Time elapsed: 0.165 sec - in org.apache.commons.lang3.time.DateUtilsRoundingTest
Running org.apache.commons.lang3.time.FastDateParserTest
Tests run: 33, Failures: 0, Errors: 0, Skipped: 0, Time elapsed: 2.118 sec - in org.apache.commons.lang3.time.FastDateParserTest
Running org.apache.commons.lang3.time.FastDateFormat_ParserTest
Tests run: 33, Failures: 0, Errors: 0, Skipped: 0, Time elapsed: 0.722 sec - in org.apache.commons.lang3.time.FastDateFormat_ParserTest
Running org.apache.commons.lang3.time.DurationFormatUtilsTest
Tests run: 25, Failures: 0, Errors: 0, Skipped: 0, Time elapsed: 0.778 sec - in org.apache.commons.lang3.time.DurationFormatUtilsTest
Running org.apache.commons.lang3.time.DateFormatUtilsTest
Tests run: 10, Failures: 0, Errors: 0, Skipped: 0, Time elapsed: 0.002 sec - in org.apache.commons.lang3.time.DateFormatUtilsTest
Running org.apache.commons.lang3.time.DateUtilsFragmentTest
Tests run: 57, Failures: 0, Errors: 0, Skipped: 0, Time elapsed: 0.035 sec - in org.apache.commons.lang3.time.DateUtilsFragmentTest
Running org.apache.commons.lang3.time.FastDatePrinterTimeZonesTest
Tests run: 617, Failures: 0, Errors: 0, Skipped: 0, Time elapsed: 0.178 sec - in org.apache.commons.lang3.time.FastDatePrinterTimeZonesTest
Running org.apache.commons.lang3.time.FastDateFormatTest
>>FastDateFormatTest: FastDateParser:34477  SimpleDateFormat:3704
Tests run: 14, Failures: 0, Errors: 0, Skipped: 0, Time elapsed: 4.193 sec - in org.apache.commons.lang3.time.FastDateFormatTest
Running org.apache.commons.lang3.time.FastDateFormat_PrinterTest
Tests run: 17, Failures: 0, Errors: 0, Skipped: 0, Time elapsed: 0.007 sec - in org.apache.commons.lang3.time.FastDateFormat_PrinterTest
Running org.apache.commons.lang3.time.FastDatePrinterTest
Tests run: 17, Failures: 0, Errors: 0, Skipped: 0, Time elapsed: 0.004 sec - in org.apache.commons.lang3.time.FastDatePrinterTest
Running org.apache.commons.lang3.time.FastDateParserSDFTest
Tests run: 276, Failures: 0, Errors: 0, Skipped: 92, Time elapsed: 0.061 sec - in org.apache.commons.lang3.time.FastDateParserSDFTest
Running org.apache.commons.lang3.time.DateUtilsTest
DateUtilsTest: Default Locale=en_US
Tests run: 38, Failures: 0, Errors: 0, Skipped: 0, Time elapsed: 0.016 sec - in org.apache.commons.lang3.time.DateUtilsTest
Running org.apache.commons.lang3.reflect.InheritanceUtilsTest
Tests run: 9, Failures: 0, Errors: 0, Skipped: 0, Time elapsed: 0.001 sec - in org.apache.commons.lang3.reflect.InheritanceUtilsTest
Running org.apache.commons.lang3.reflect.MethodUtilsTest
Tests run: 23, Failures: 0, Errors: 0, Skipped: 0, Time elapsed: 0.028 sec - in org.apache.commons.lang3.reflect.MethodUtilsTest
Running org.apache.commons.lang3.reflect.ConstructorUtilsTest
Tests run: 7, Failures: 0, Errors: 0, Skipped: 0, Time elapsed: 0.005 sec - in org.apache.commons.lang3.reflect.ConstructorUtilsTest
Running org.apache.commons.lang3.reflect.FieldUtilsTest
Tests run: 64, Failures: 0, Errors: 0, Skipped: 0, Time elapsed: 0.031 sec - in org.apache.commons.lang3.reflect.FieldUtilsTest
Running org.apache.commons.lang3.reflect.TypeLiteralTest
Tests run: 4, Failures: 0, Errors: 0, Skipped: 0, Time elapsed: 0.004 sec - in org.apache.commons.lang3.reflect.TypeLiteralTest
Running org.apache.commons.lang3.reflect.TypeUtilsTest
Tests run: 19, Failures: 0, Errors: 0, Skipped: 0, Time elapsed: 0.032 sec - in org.apache.commons.lang3.reflect.TypeUtilsTest
Running org.apache.commons.lang3.mutable.MutableByteTest
Tests run: 17, Failures: 0, Errors: 0, Skipped: 0, Time elapsed: 0.002 sec - in org.apache.commons.lang3.mutable.MutableByteTest
Running org.apache.commons.lang3.mutable.MutableShortTest
Tests run: 14, Failures: 0, Errors: 0, Skipped: 0, Time elapsed: 0.001 sec - in org.apache.commons.lang3.mutable.MutableShortTest
Running org.apache.commons.lang3.mutable.MutableIntTest
Tests run: 17, Failures: 0, Errors: 0, Skipped: 0, Time elapsed: 0.003 sec - in org.apache.commons.lang3.mutable.MutableIntTest
Running org.apache.commons.lang3.mutable.MutableDoubleTest
Tests run: 18, Failures: 0, Errors: 0, Skipped: 0, Time elapsed: 0.004 sec - in org.apache.commons.lang3.mutable.MutableDoubleTest
Running org.apache.commons.lang3.mutable.MutableFloatTest
Tests run: 18, Failures: 0, Errors: 0, Skipped: 0, Time elapsed: 0.004 sec - in org.apache.commons.lang3.mutable.MutableFloatTest
Running org.apache.commons.lang3.mutable.MutableLongTest
Tests run: 17, Failures: 0, Errors: 0, Skipped: 0, Time elapsed: 0.003 sec - in org.apache.commons.lang3.mutable.MutableLongTest
Running org.apache.commons.lang3.mutable.MutableBooleanTest
Tests run: 9, Failures: 0, Errors: 0, Skipped: 0, Time elapsed: 0.001 sec - in org.apache.commons.lang3.mutable.MutableBooleanTest
Running org.apache.commons.lang3.mutable.MutableObjectTest
Tests run: 5, Failures: 0, Errors: 0, Skipped: 0, Time elapsed: 0 sec - in org.apache.commons.lang3.mutable.MutableObjectTest
Running org.apache.commons.lang3.text.translate.UnicodeEscaperTest
Tests run: 3, Failures: 0, Errors: 0, Skipped: 0, Time elapsed: 0 sec - in org.apache.commons.lang3.text.translate.UnicodeEscaperTest
Running org.apache.commons.lang3.text.translate.EntityArraysTest
Tests run: 3, Failures: 0, Errors: 0, Skipped: 0, Time elapsed: 0 sec - in org.apache.commons.lang3.text.translate.EntityArraysTest
Running org.apache.commons.lang3.text.translate.UnicodeUnpairedSurrogateRemoverTest
Tests run: 2, Failures: 0, Errors: 0, Skipped: 0, Time elapsed: 0 sec - in org.apache.commons.lang3.text.translate.UnicodeUnpairedSurrogateRemoverTest
Running org.apache.commons.lang3.text.translate.NumericEntityUnescaperTest
Tests run: 3, Failures: 0, Errors: 0, Skipped: 0, Time elapsed: 0.001 sec - in org.apache.commons.lang3.text.translate.NumericEntityUnescaperTest
Running org.apache.commons.lang3.text.translate.NumericEntityEscaperTest
Tests run: 4, Failures: 0, Errors: 0, Skipped: 0, Time elapsed: 0.001 sec - in org.apache.commons.lang3.text.translate.NumericEntityEscaperTest
Running org.apache.commons.lang3.text.translate.LookupTranslatorTest
Tests run: 2, Failures: 0, Errors: 0, Skipped: 0, Time elapsed: 0.001 sec - in org.apache.commons.lang3.text.translate.LookupTranslatorTest
Running org.apache.commons.lang3.text.translate.UnicodeUnescaperTest
Tests run: 3, Failures: 0, Errors: 0, Skipped: 0, Time elapsed: 0 sec - in org.apache.commons.lang3.text.translate.UnicodeUnescaperTest
Running org.apache.commons.lang3.text.translate.OctalUnescaperTest
Tests run: 1, Failures: 0, Errors: 0, Skipped: 0, Time elapsed: 0 sec - in org.apache.commons.lang3.text.translate.OctalUnescaperTest
Running org.apache.commons.lang3.text.StrMatcherTest
Tests run: 14, Failures: 0, Errors: 0, Skipped: 0, Time elapsed: 0.002 sec - in org.apache.commons.lang3.text.StrMatcherTest
Running org.apache.commons.lang3.text.StrTokenizerTest
Tests run: 55, Failures: 0, Errors: 0, Skipped: 0, Time elapsed: 0.013 sec - in org.apache.commons.lang3.text.StrTokenizerTest
Running org.apache.commons.lang3.text.FormattableUtilsTest
Tests run: 5, Failures: 0, Errors: 0, Skipped: 0, Time elapsed: 0 sec - in org.apache.commons.lang3.text.FormattableUtilsTest
Running org.apache.commons.lang3.text.CompositeFormatTest
Tests run: 2, Failures: 0, Errors: 0, Skipped: 0, Time elapsed: 0 sec - in org.apache.commons.lang3.text.CompositeFormatTest
Running org.apache.commons.lang3.text.WordUtilsTest
Tests run: 12, Failures: 0, Errors: 0, Skipped: 0, Time elapsed: 0.004 sec - in org.apache.commons.lang3.text.WordUtilsTest
Running org.apache.commons.lang3.text.StrLookupTest
Tests run: 5, Failures: 0, Errors: 0, Skipped: 0, Time elapsed: 0.002 sec - in org.apache.commons.lang3.text.StrLookupTest
Running org.apache.commons.lang3.text.StrBuilderAppendInsertTest
Tests run: 51, Failures: 0, Errors: 0, Skipped: 0, Time elapsed: 0.011 sec - in org.apache.commons.lang3.text.StrBuilderAppendInsertTest
Running org.apache.commons.lang3.text.ExtendedMessageFormatTest
Tests run: 10, Failures: 0, Errors: 0, Skipped: 0, Time elapsed: 0.713 sec - in org.apache.commons.lang3.text.ExtendedMessageFormatTest
Running org.apache.commons.lang3.text.StrSubstitutorTest
Tests run: 40, Failures: 0, Errors: 0, Skipped: 0, Time elapsed: 0.031 sec - in org.apache.commons.lang3.text.StrSubstitutorTest
Running org.apache.commons.lang3.text.StrBuilderTest
Tests run: 90, Failures: 0, Errors: 0, Skipped: 0, Time elapsed: 0.049 sec - in org.apache.commons.lang3.text.StrBuilderTest
Running org.apache.commons.lang3.StringEscapeUtilsTest
Tests run: 28, Failures: 0, Errors: 0, Skipped: 0, Time elapsed: 0.282 sec - in org.apache.commons.lang3.StringEscapeUtilsTest
Running org.apache.commons.lang3.AnnotationUtilsTest
Tests run: 10, Failures: 1, Errors: 0, Skipped: 0, Time elapsed: 0.023 sec <<< FAILURE! - in org.apache.commons.lang3.AnnotationUtilsTest
testToString(org.apache.commons.lang3.AnnotationUtilsTest)  Time elapsed: 0.002 sec  <<< FAILURE!
java.lang.AssertionError: null
	at org.junit.Assert.fail(Assert.java:86)
	at org.junit.Assert.assertTrue(Assert.java:41)
	at org.junit.Assert.assertTrue(Assert.java:52)
	at org.apache.commons.lang3.AnnotationUtilsTest.testToString(AnnotationUtilsTest.java:503)

Running org.apache.commons.lang3.ConversionTest
Tests run: 42, Failures: 0, Errors: 0, Skipped: 0, Time elapsed: 0.015 sec - in org.apache.commons.lang3.ConversionTest
Running org.apache.commons.lang3.StringUtilsTrimEmptyTest
Tests run: 15, Failures: 0, Errors: 0, Skipped: 0, Time elapsed: 0.004 sec - in org.apache.commons.lang3.StringUtilsTrimEmptyTest
Running org.apache.commons.lang3.EnumUtilsTest
Tests run: 34, Failures: 0, Errors: 0, Skipped: 0, Time elapsed: 0.008 sec - in org.apache.commons.lang3.EnumUtilsTest
Running org.apache.commons.lang3.exception.ExceptionUtilsTest
Tests run: 28, Failures: 0, Errors: 0, Skipped: 0, Time elapsed: 0.023 sec - in org.apache.commons.lang3.exception.ExceptionUtilsTest
Running org.apache.commons.lang3.exception.DefaultExceptionContextTest
Tests run: 8, Failures: 0, Errors: 0, Skipped: 0, Time elapsed: 0.004 sec - in org.apache.commons.lang3.exception.DefaultExceptionContextTest
Running org.apache.commons.lang3.exception.ContextedExceptionTest
Tests run: 14, Failures: 0, Errors: 0, Skipped: 0, Time elapsed: 0.009 sec - in org.apache.commons.lang3.exception.ContextedExceptionTest
Running org.apache.commons.lang3.exception.ContextedRuntimeExceptionTest
Tests run: 14, Failures: 0, Errors: 0, Skipped: 0, Time elapsed: 0.01 sec - in org.apache.commons.lang3.exception.ContextedRuntimeExceptionTest
Running org.apache.commons.lang3.BitFieldTest
Tests run: 15, Failures: 0, Errors: 0, Skipped: 0, Time elapsed: 0.002 sec - in org.apache.commons.lang3.BitFieldTest
Running org.apache.commons.lang3.ArrayUtilsRemoveMultipleTest
Tests run: 55, Failures: 0, Errors: 0, Skipped: 0, Time elapsed: 0.009 sec - in org.apache.commons.lang3.ArrayUtilsRemoveMultipleTest
Running org.apache.commons.lang3.HashSetvBitSetTest
Ratio=10% array=100 count=1 extract=11872697 bitset=1267809
Ratio=7% array=100 count=10 extract=16001306 bitset=1172796
Ratio=4% array=100 count=50 extract=22640442 bitset=1065303
Ratio=4% array=100 count=100 extract=9554074 bitset=427478
Ratio=81% array=1000 count=10 extract=6565361 bitset=5366289
Ratio=33% array=1000 count=100 extract=15060829 bitset=5040344
Ratio=13% array=1000 count=500 extract=46314510 bitset=6333635
Ratio=1% array=1000 count=1000 extract=68965629 bitset=775180
Ratio=3% count=0 hash=4787088 bits=180127
Ratio=11% count=5 hash=1750814 bits=205766
Ratio=32% count=10 hash=903181 bits=291615
Ratio=24% count=200 hash=18200967 bits=4436192
Ratio=19% count=50 hash=6569550 bits=1310599
Ratio=21% count=100 hash=14878606 bits=3184602
Ratio=21% count=1000 hash=73635698 bits=15824158
Ratio=22% count=2000 hash=149120665 bits=33470899
Tests run: 2, Failures: 0, Errors: 0, Skipped: 0, Time elapsed: 0.64 sec - in org.apache.commons.lang3.HashSetvBitSetTest
Running org.apache.commons.lang3.StringUtilsTest
Tests run: 124, Failures: 0, Errors: 0, Skipped: 0, Time elapsed: 0.128 sec - in org.apache.commons.lang3.StringUtilsTest
Running org.apache.commons.lang3.ArrayUtilsRemoveTest
Tests run: 19, Failures: 0, Errors: 0, Skipped: 0, Time elapsed: 0 sec - in org.apache.commons.lang3.ArrayUtilsRemoveTest
Running org.apache.commons.lang3.ObjectUtilsTest
Tests run: 36, Failures: 0, Errors: 0, Skipped: 0, Time elapsed: 0.015 sec - in org.apache.commons.lang3.ObjectUtilsTest
Running org.apache.commons.lang3.ClassPathUtilsTest
Tests run: 13, Failures: 0, Errors: 0, Skipped: 0, Time elapsed: 0.001 sec - in org.apache.commons.lang3.ClassPathUtilsTest
Running org.apache.commons.lang3.math.NumberUtilsTest
Tests run: 91, Failures: 0, Errors: 0, Skipped: 0, Time elapsed: 0.035 sec - in org.apache.commons.lang3.math.NumberUtilsTest
Running org.apache.commons.lang3.math.IEEE754rUtilsTest
Tests run: 3, Failures: 0, Errors: 0, Skipped: 0, Time elapsed: 0.003 sec - in org.apache.commons.lang3.math.IEEE754rUtilsTest
Running org.apache.commons.lang3.math.FractionTest
Tests run: 25, Failures: 0, Errors: 0, Skipped: 0, Time elapsed: 0.335 sec - in org.apache.commons.lang3.math.FractionTest
Running org.apache.commons.lang3.BooleanUtilsTest
Tests run: 72, Failures: 0, Errors: 0, Skipped: 0, Time elapsed: 0.008 sec - in org.apache.commons.lang3.BooleanUtilsTest
Running org.apache.commons.lang3.CharSequenceUtilsTest
Tests run: 2, Failures: 0, Errors: 0, Skipped: 0, Time elapsed: 0 sec - in org.apache.commons.lang3.CharSequenceUtilsTest
Running org.apache.commons.lang3.CharSetUtilsTest
Tests run: 11, Failures: 0, Errors: 0, Skipped: 0, Time elapsed: 0 sec - in org.apache.commons.lang3.CharSetUtilsTest
Running org.apache.commons.lang3.ArrayUtilsAddTest
Tests run: 13, Failures: 0, Errors: 0, Skipped: 0, Time elapsed: 0.001 sec - in org.apache.commons.lang3.ArrayUtilsAddTest
Running org.apache.commons.lang3.CharEncodingTest
Tests run: 6, Failures: 0, Errors: 0, Skipped: 0, Time elapsed: 0.023 sec - in org.apache.commons.lang3.CharEncodingTest
Running org.apache.commons.lang3.ClassUtilsTest
Tests run: 57, Failures: 0, Errors: 0, Skipped: 0, Time elapsed: 0.019 sec - in org.apache.commons.lang3.ClassUtilsTest
Running org.apache.commons.lang3.RangeTest
Tests run: 24, Failures: 0, Errors: 0, Skipped: 0, Time elapsed: 0.008 sec - in org.apache.commons.lang3.RangeTest
Running org.apache.commons.lang3.event.EventUtilsTest
Tests run: 8, Failures: 0, Errors: 0, Skipped: 0, Time elapsed: 0.017 sec - in org.apache.commons.lang3.event.EventUtilsTest
Running org.apache.commons.lang3.event.EventListenerSupportTest
Tests run: 9, Failures: 0, Errors: 0, Skipped: 0, Time elapsed: 0.021 sec - in org.apache.commons.lang3.event.EventListenerSupportTest
Running org.apache.commons.lang3.ArrayUtilsTest
Tests run: 205, Failures: 1, Errors: 0, Skipped: 0, Time elapsed: 0.039 sec <<< FAILURE! - in org.apache.commons.lang3.ArrayUtilsTest
testToString(org.apache.commons.lang3.ArrayUtilsTest)  Time elapsed: 0 sec  <<< FAILURE!
org.junit.ComparisonFailure: expected:<[{}]> but was:<[[Ljava.lang.Object;@6c029886]>
	at org.junit.Assert.assertEquals(Assert.java:115)
	at org.junit.Assert.assertEquals(Assert.java:144)
	at org.apache.commons.lang3.ArrayUtilsTest.testToString(ArrayUtilsTest.java:53)

Running org.apache.commons.lang3.CharUtilsTest
Tests run: 24, Failures: 0, Errors: 0, Skipped: 0, Time elapsed: 0.001 sec - in org.apache.commons.lang3.CharUtilsTest
Running org.apache.commons.lang3.NotImplementedExceptionTest
Tests run: 1, Failures: 0, Errors: 0, Skipped: 0, Time elapsed: 0 sec - in org.apache.commons.lang3.NotImplementedExceptionTest
Running org.apache.commons.lang3.StringUtilsEqualsIndexOfTest
Tests run: 50, Failures: 0, Errors: 0, Skipped: 0, Time elapsed: 0.002 sec - in org.apache.commons.lang3.StringUtilsEqualsIndexOfTest
Running org.apache.commons.lang3.RandomUtilsTest
Tests run: 23, Failures: 0, Errors: 0, Skipped: 0, Time elapsed: 0.001 sec - in org.apache.commons.lang3.RandomUtilsTest

Results :

Failed tests: 
  AnnotationUtilsTest.testToString:503 null
  ArrayUtilsTest.testToString:53 expected:<[{}]> but was:<[[Ljava.lang.Object;@6c029886]>
  DefaultToStringStyleTest.testAppendSuper:61 expected:<....Integer@3edcbc7b[a=[hello]]> but was:<....Integer@3edcbc7b[a=[java.lang.String@d697ff2]]>
  DefaultToStringStyleTest.testLongArray:115 expected:<...ng.Integer@3edcbc7b[[{1,2,-3,4}]]> but was:<...ng.Integer@3edcbc7b[[[J@50246923]]>
  DefaultToStringStyleTest.testLongArrayArray:124 expected:<...g.Integer@3edcbc7b[{[{1,2},<null>,{5}]}]> but was:<...g.Integer@3edcbc7b[{[[J@6b4f7392,<null>,[J@2d2cad48]}]>
  DefaultToStringStyleTest.testObject:76 expected:<....Integer@3edcbc7b[a=[<size=0>]]> but was:<....Integer@3edcbc7b[a=[java.util.ArrayList@672a1f0]]>
  DefaultToStringStyleTest.testObjectArray:104 expected:<...er@3edcbc7b[{<null>,[5,{3,6}]}]> but was:<...er@3edcbc7b[{<null>,[java.lang.Integer@3edcbc7b,[I@74e51332]}]>
  DefaultToStringStyleTest.testPerson:91 expected:<...erson@4fe596de[name=[John Doe],age=33,smoker=false...> but was:<...erson@4fe596de[name=[java.lang.String@eafd67c],age=33,smoker=false...>
  JsonToStringStyleTest.testAppendSuper:74 expected:<{"a":["hello"]}> but was:<{"a":[java.lang.String@d697ff2]}>
  JsonToStringStyleTest.testObject:132 expected:<{"a":[[]]}> but was:<{"a":[java.util.ArrayList@5f7860a1]}>
  JsonToStringStyleTest.testPerson:192 expected:<{"name":["Jane Doe"],"age":25,"smoker":t...> but was:<{"name":[java.lang.String@30a7a93a],"age":25,"smoker":t...>
  MultiLineToStringStyleTest.testAppendSuper:62 expected:<...teger@3edcbc7b[
  a=[hello]
]> but was:<...teger@3edcbc7b[
  a=[java.lang.String@d697ff2]
]>
  MultiLineToStringStyleTest.testLongArray:116 expected:<...Integer@3edcbc7b[
  [{1,2,-3,4}]
]> but was:<...Integer@3edcbc7b[
  [[J@1febd225]
]>
  MultiLineToStringStyleTest.testLongArrayArray:125 expected:<...nteger@3edcbc7b[
  {[{1,2},<null>,{5}]}
]> but was:<...nteger@3edcbc7b[
  {[[J@953235f,<null>,[J@313736c1]}
]>
  MultiLineToStringStyleTest.testObject:77 expected:<...teger@3edcbc7b[
  a=[<size=0>]
]> but was:<...teger@3edcbc7b[
  a=[java.util.ArrayList@33318b82]
]>
  MultiLineToStringStyleTest.testObjectArray:105 expected:<...3edcbc7b[
  {<null>,[5,{3,6}]}
]> but was:<...3edcbc7b[
  {<null>,[java.lang.Integer@3edcbc7b,[I@62f80604]}
]>
  MultiLineToStringStyleTest.testPerson:92 expected:<...on@79be1e0f[
  name=[Jane Doe]
  age=25
  smoker=t...> but was:<...on@79be1e0f[
  name=[java.lang.String@30a7a93a]
  age=25
  smoker=t...>
  MultilineRecursiveToStringStyleTest.boolArray:113 expected:<...d0f282[
  boolArray=[{
    true,
    false,
    true
  }],
  charArray=<null>...> but was:<...d0f282[
  boolArray=[[Z@ae136c3],
  charArray=<null>...>
  MultilineRecursiveToStringStyleTest.charArray:131 expected:<...<null>,
  charArray=[{
    a,
    A
  }],
  intArray=<null>,...> but was:<...<null>,
  charArray=[[C@44471a09],
  intArray=<null>,...>
  MultilineRecursiveToStringStyleTest.doubleArray:167 expected:<...ull>,
  doubleArray=[{
    1.0,
    2.0
  }],
  longArray=<null>...> but was:<...ull>,
  doubleArray=[[D@3096f94],
  longArray=<null>...>
  MultilineRecursiveToStringStyleTest.intArray:149 expected:<...=<null>,
  intArray=[{
    1,
    2
  }],
  doubleArray=<nul...> but was:<...=<null>,
  intArray=[[I@264b72a2],
  doubleArray=<nul...>
  MultilineRecursiveToStringStyleTest.longArray:185 expected:<...<null>,
  longArray=[{
    1,
    2
  }],
  stringArray=<nul...> but was:<...<null>,
  longArray=[[J@53bc45d4],
  stringArray=<nul...>
  MultilineRecursiveToStringStyleTest.nestedAndArray:80 expected:<...l.ArrayList@6eaaf8f2[{
    org.apache.commons.lang3.builder.MultilineRecursiveToStringStyleTest$Transaction@1abe10a1[
      amount=100.0,
      date=2014.10.14
    ],
    org.apache.commons.lang3.builder.MultilineRecursiveToStringStyleTest$Transaction@3435c7be[
      amount=50.0,
      date=2014.10.15
    ]
  }]
]> but was:<...l.ArrayList@6eaaf8f2[]
]>
  MultilineRecursiveToStringStyleTest.nestedElements:57 expected:<...er@17fe67e4[
  name=[Douglas Adams,
  bank=org.apache.commons.lang3.builder.MultilineRecursiveToStringStyleTest$Bank@3f56b60a[
    name=ASF Bank
  ]],
  accounts=<null>
...> but was:<...er@17fe67e4[
  name=[java.lang.String@1a907c4e,
  bank=org.apache.commons.lang3.builder.MultilineRecursiveToStringStyleTest$Bank@3f56b60a],
  accounts=<null>
...>
  MultilineRecursiveToStringStyleTest.simpleObject:42 expected:<...mount=100.0,
  date=[2014.10.15]
]> but was:<...mount=100.0,
  date=[java.lang.String@2a807bbc]
]>
  MultilineRecursiveToStringStyleTest.stringArray:203 expected:<...ull>,
  stringArray=[{
    a,
    A
  }]
]> but was:<...ull>,
  stringArray=[[Ljava.lang.String;@547d573]
]>
  NoClassNameToStringStyleTest.testAppendSuper:60 expected:<[a=[hello]]> but was:<[a=[java.lang.String@d697ff2]]>
  NoClassNameToStringStyleTest.testLongArray:113 expected:<[[{1,2,-3,4}]]> but was:<[[[J@45e5fb7e]]>
  NoClassNameToStringStyleTest.testLongArrayArray:122 expected:<[{[{1,2},<null>,{5}]}]> but was:<[{[[J@95c46dd,<null>,[J@9305bf8]}]>
  NoClassNameToStringStyleTest.testObject:75 expected:<[a=[<size=0>]]> but was:<[a=[java.util.ArrayList@7de2310b]]>
  NoClassNameToStringStyleTest.testObjectArray:102 expected:<[{<null>,5,[{3,6}]}]> but was:<[{<null>,5,[[I@58101afe]}]>
  NoClassNameToStringStyleTest.testPerson:89 expected:<[name=[John Q. Public],age=45,smoker=true]> but was:<[name=[java.lang.String@257b746],age=45,smoker=true]>
  NoFieldNamesToStringStyleTest.testAppendSuper:61 expected:<...ng.Integer@3edcbc7b[[hello]]> but was:<...ng.Integer@3edcbc7b[[java.lang.String@d697ff2]]>
  NoFieldNamesToStringStyleTest.testLongArray:115 expected:<...ng.Integer@3edcbc7b[[{1,2,-3,4}]]> but was:<...ng.Integer@3edcbc7b[[[J@66d62c90]]>
  NoFieldNamesToStringStyleTest.testLongArrayArray:124 expected:<...g.Integer@3edcbc7b[{[{1,2},<null>,{5}]}]> but was:<...g.Integer@3edcbc7b[{[[J@7b2f2f8,<null>,[J@756d7bba]}]>
  NoFieldNamesToStringStyleTest.testObject:76 expected:<...ng.Integer@3edcbc7b[[<size=0>]]> but was:<...ng.Integer@3edcbc7b[[java.util.ArrayList@3a16cef5]]>
  NoFieldNamesToStringStyleTest.testObjectArray:104 expected:<...er@3edcbc7b[{<null>,[5,{3,6}]}]> but was:<...er@3edcbc7b[{<null>,[java.lang.Integer@3edcbc7b,[I@422bcbb9]}]>
  NoFieldNamesToStringStyleTest.testPerson:91 expected:<...est$Person@2f6d549e[[Ron Paul],72,false]> but was:<...est$Person@2f6d549e[[java.lang.String@32ce6965],72,false]>
  RecursiveToStringStyleTest.testAppendSuper:60 expected:<....Integer@3edcbc7b[a=[hello]]> but was:<....Integer@3edcbc7b[a=[java.lang.String@d697ff2]]>
  RecursiveToStringStyleTest.testLongArray:118 expected:<...ng.Integer@3edcbc7b[[{1,2,-3,4}]]> but was:<...ng.Integer@3edcbc7b[[[J@51a212ed]]>
  RecursiveToStringStyleTest.testLongArrayArray:127 expected:<...g.Integer@3edcbc7b[{[{1,2},<null>,{5}]}]> but was:<...g.Integer@3edcbc7b[{[[J@574ff50a,<null>,[J@4260904e]}]>
  RecursiveToStringStyleTest.testObject:75 expected:<....Integer@3edcbc7b[a=[<size=0>]]> but was:<....Integer@3edcbc7b[a=[java.util.ArrayList@6788af79]]>
  RecursiveToStringStyleTest.testObjectArray:107 expected:<...er@3edcbc7b[{<null>,[5,{3,6}]}]> but was:<...er@3edcbc7b[{<null>,[java.lang.Integer@3edcbc7b,[I@3cdd17f5]}]>
  RecursiveToStringStyleTest.testPerson:93 expected:<...erson@3eb86609[name=[John Doe,age=33,smoker=false,job=org.apache.commons.lang3.builder.RecursiveToStringStyleTest$Job@3c32f90a[title=Manager]]]> but was:<...erson@3eb86609[name=[java.lang.String@eafd67c,age=33,smoker=false,job=org.apache.commons.lang3.builder.RecursiveToStringStyleTest$Job@3c32f90a]]>
  ReflectionToStringBuilderExcludeTest.test_toStringExclude:53->validateSecretFieldAbsent:130->validateNonSecretField:125 null
  ReflectionToStringBuilderExcludeTest.test_toStringExcludeArray:59->validateSecretFieldAbsent:130->validateNonSecretField:125 null
  ReflectionToStringBuilderExcludeTest.test_toStringExcludeArrayWithNull:65->validateSecretFieldPresent:134 null
  ReflectionToStringBuilderExcludeTest.test_toStringExcludeArrayWithNulls:71->validateSecretFieldPresent:134 null
  ReflectionToStringBuilderExcludeTest.test_toStringExcludeCollection:79->validateSecretFieldAbsent:130->validateNonSecretField:125 null
  ReflectionToStringBuilderExcludeTest.test_toStringExcludeCollectionWithNull:87->validateSecretFieldPresent:134 null
  ReflectionToStringBuilderExcludeTest.test_toStringExcludeCollectionWithNulls:96->validateSecretFieldPresent:134 null
  ReflectionToStringBuilderExcludeTest.test_toStringExcludeEmptyArray:102->validateSecretFieldPresent:134 null
  ReflectionToStringBuilderExcludeTest.test_toStringExcludeEmptyCollection:108->validateSecretFieldPresent:134 null
  ReflectionToStringBuilderExcludeTest.test_toStringExcludeNullArray:114->validateSecretFieldPresent:134 null
  ReflectionToStringBuilderExcludeTest.test_toStringExcludeNullCollection:120->validateSecretFieldPresent:134 null
  ShortPrefixToStringStyleTest.testAppendSuper:61 expected:<Integer[a=[hello]]> but was:<Integer[a=[java.lang.String@d697ff2]]>
  ShortPrefixToStringStyleTest.testLongArray:115 expected:<Integer[[{1,2,-3,4}]]> but was:<Integer[[[J@758f1c22]]>
  ShortPrefixToStringStyleTest.testLongArrayArray:124 expected:<Integer[{[{1,2},<null>,{5}]}]> but was:<Integer[{[[J@1d5de95f,<null>,[J@846b09]}]>
  ShortPrefixToStringStyleTest.testObject:76 expected:<Integer[a=[<size=0>]]> but was:<Integer[a=[java.util.ArrayList@680387a]]>
  ShortPrefixToStringStyleTest.testObjectArray:104 expected:<Integer[{<null>,[5,{3,6}]}]> but was:<Integer[{<null>,[java.lang.Integer@3edcbc7b,[I@94eefbf]}]>
  ShortPrefixToStringStyleTest.testPerson:91 expected:<...yleTest.Person[name=[John Q. Public],age=45,smoker=true]> but was:<...yleTest.Person[name=[java.lang.String@257b746],age=45,smoker=true]>
  SimpleToStringStyleTest.testAppendSuper:60 expected:<[hello]> but was:<[java.lang.String@d697ff2]>
  SimpleToStringStyleTest.testLongArray:113 expected:<[{1,2,-3,4}]> but was:<[[J@63cb6c2c]>
  SimpleToStringStyleTest.testLongArrayArray:122 expected:<{[{1,2},<null>,{5}]}> but was:<{[[J@598d406b,<null>,[J@48805ebb]}>
  SimpleToStringStyleTest.testObject:75 expected:<[<size=0>]> but was:<[java.util.ArrayList@402aefe3]>
  SimpleToStringStyleTest.testObjectArray:102 expected:<{<null>,5,[{3,6}]}> but was:<{<null>,5,[[I@22aa48bc]}>
  SimpleToStringStyleTest.testPerson:89 expected:<[Jane Q. Public],47,false> but was:<[java.lang.String@42eb40fe],47,false>
  StandardToStringStyleTest.testAppendSuper:76 expected:<Integer[a=[hello]]> but was:<Integer[a=[java.lang.String@d697ff2]]>
  StandardToStringStyleTest.testLongArray:130 expected:<Integer[[[1, 2, -3, 4]]]> but was:<Integer[[[J@2158e7bc]]>
  StandardToStringStyleTest.testLongArrayArray:139 expected:<Integer[[[[1, 2], %NULL%, [5]]]]> but was:<Integer[[[[J@710765e5, %NULL%, [J@1cb2d75c]]]>
  StandardToStringStyleTest.testObject:91 expected:<Integer[a=[%SIZE=0%]]> but was:<Integer[a=[java.util.ArrayList@53d5f8be]]>
  StandardToStringStyleTest.testObjectArray:119 expected:<Integer[[%NULL%, [5, [3, 6]]]]> but was:<Integer[[%NULL%, [java.lang.Integer@3edcbc7b, [I@102ecebf]]]>
  StandardToStringStyleTest.testPerson:106 expected:<...yleTest.Person[name=[Suzy Queue],age=19,smoker=false...> but was:<...yleTest.Person[name=[java.lang.String@40a5464c],age=19,smoker=false...>
  ToStringBuilderTest.testAppendSuper:604 expected:<....Integer@3edcbc7b[a=[hello]]> but was:<....Integer@3edcbc7b[a=[java.lang.String@d697ff2]]>
  ToStringBuilderTest.testAppendToString:614 expected:<....Integer@3edcbc7b[a=[hello]]> but was:<....Integer@3edcbc7b[a=[java.lang.String@d697ff2]]>
  ToStringBuilderTest.testBooleanArray:798 expected:<...ng.Integer@3edcbc7b[[{true,false,false}]]> but was:<...ng.Integer@3edcbc7b[[[Z@1cefd3c]]>
  ToStringBuilderTest.testBooleanArrayArray:877 expected:<...g.Integer@3edcbc7b[{[{true,false},<null>,{false}]}]> but was:<...g.Integer@3edcbc7b[{[[Z@ff7f824,<null>,[Z@60c40bac]}]>
  ToStringBuilderTest.testByteArray:758 expected:<...ng.Integer@3edcbc7b[[{1,2,-3,4}]]> but was:<...ng.Integer@3edcbc7b[[[B@3651a783]]>
  ToStringBuilderTest.testByteArrayArray:837 expected:<...g.Integer@3edcbc7b[{[{1,2},<null>,{5}]}]> but was:<...g.Integer@3edcbc7b[{[[B@7bf7911b,<null>,[B@3a57c332]}]>
  ToStringBuilderTest.testCharArray:768 expected:<...ng.Integer@3edcbc7b[[{A,2,_,D}]]> but was:<...ng.Integer@3edcbc7b[[[C@5b888e9e]]>
  ToStringBuilderTest.testCharArrayArray:847 expected:<...g.Integer@3edcbc7b[{[{A,B},<null>,{p}]}]> but was:<...g.Integer@3edcbc7b[{[[C@2250b410,<null>,[C@605d9809]}]>
  ToStringBuilderTest.testDoubleArray:778 expected:<...ng.Integer@3edcbc7b[[{1.0,2.9876,-3.00001,4.3}]]> but was:<...ng.Integer@3edcbc7b[[[D@171f6179]]>
  ToStringBuilderTest.testDoubleArrayArray:857 expected:<...g.Integer@3edcbc7b[{[{1.0,2.29686},<null>,{NaN}]}]> but was:<...g.Integer@3edcbc7b[{[[D@757ff1ad,<null>,[D@22d3d11f]}]>
  ToStringBuilderTest.testFloatArray:788 expected:<...ng.Integer@3edcbc7b[[{1.0,2.9876,-3.00001,4.3}]]> but was:<...ng.Integer@3edcbc7b[[[F@66da7ad5]]>
  ToStringBuilderTest.testFloatArrayArray:867 expected:<...g.Integer@3edcbc7b[{[{1.0,2.29686},<null>,{NaN}]}]> but was:<...g.Integer@3edcbc7b[{[[F@3c536f11,<null>,[F@9a0e408]}]>
  ToStringBuilderTest.testInheritedReflectionStatics:947 expected:<...64a8d[staticString2=[staticString2],staticInt2=67890]> but was:<...64a8d[staticString2=[java.lang.String@3f7ac6d8],staticInt2=67890]>
  ToStringBuilderTest.testInnerClassReflection:376 expected:<...Outer$Inner@2ead7b0c[[]]]> but was:<...Outer$Inner@2ead7b0c[]]>
  ToStringBuilderTest.testIntArray:738 expected:<...ng.Integer@3edcbc7b[[{1,2,-3,4}]]> but was:<...ng.Integer@3edcbc7b[[[I@1dde8526]]>
  ToStringBuilderTest.testIntArrayArray:817 expected:<...g.Integer@3edcbc7b[{[{1,2},<null>,{5}]}]> but was:<...g.Integer@3edcbc7b[{[[I@608486,<null>,[I@409c799b]}]>
  ToStringBuilderTest.testLongArray:728 expected:<...ng.Integer@3edcbc7b[[{1,2,-3,4}]]> but was:<...ng.Integer@3edcbc7b[[[J@7040f445]]>
  ToStringBuilderTest.testLongArrayArray:807 expected:<...g.Integer@3edcbc7b[{[{1,2},<null>,{5}]}]> but was:<...g.Integer@3edcbc7b[{[[J@5d5ef3e7,<null>,[J@4def295]}]>
  ToStringBuilderTest.testObject:629 expected:<....Integer@3edcbc7b[a=[<size=0>]]> but was:<....Integer@3edcbc7b[a=[java.util.ArrayList@68bb6598]]>
  ToStringBuilderTest.testObjectArray:717 expected:<...er@3edcbc7b[{<null>,[5,{3,6}]}]> but was:<...er@3edcbc7b[{<null>,[java.lang.Integer@3edcbc7b,[I@157200ad]}]>
  ToStringBuilderTest.testObjectBuild:647 expected:<....Integer@3edcbc7b[a=[<size=0>]]> but was:<....Integer@3edcbc7b[a=[java.util.ArrayList@6f8a68da]]>
  ToStringBuilderTest.testObjectCycle:892 expected:<...ObjectCycle@31f61519[[org.apache.commons.lang3.builder.ToStringBuilderTest$ObjectCycle@67e9f96b]]]> but was:<...ObjectCycle@31f61519[]]>
  ToStringBuilderTest.testReflectionArrayAndObjectCycle:576 expected:<...TestFixture@1f181935[[o=[Ljava.lang.Object;@7c358a80]]}]> but was:<...TestFixture@1f181935[]}]>
  ToStringBuilderTest.testReflectionArrayArrayCycle:432 expected:<...g.Object;@6d392fa5[{[{[[Ljava.lang.Object;@6d392fa5,[[Ljava.lang.Object;@6d392fa5},{[[Ljava.lang.Object;@6d392fa5,[[Ljava.lang.Object;@6d392fa5}]}]> but was:<...g.Object;@6d392fa5[{[[Ljava.lang.Object;@456731a8,[Ljava.lang.Object;@79ed3030]}]>
  ToStringBuilderTest.testReflectionArrayCycleLevel2:416 expected:<...g.Object;@4f4c2b2f[{[{[Ljava.lang.Object;@4f4c2b2f}]}]> but was:<...g.Object;@4f4c2b2f[{[[Ljava.lang.Object;@11a74355]}]>
  ToStringBuilderTest.testReflectionBoolean:116 expected:<...lean@6b6a4b18[value=[true]]> but was:<...lean@6b6a4b18[value=[java.lang.Boolean@d86edfb]]>
  ToStringBuilderTest.testReflectionBooleanArrayArray:307 expected:<[[Z@3b27402d[{[{true,false},<null>,{false}]}]> but was:<[[Z@3b27402d[{[[Z@de668b2,<null>,[Z@11e3853f]}]>
  ToStringBuilderTest.testReflectionByteArrayArray:280 expected:<[[B@1594af77[{[{1,2},<null>,{5}]}]> but was:<[[B@1594af77[{[[B@548bb8b2,<null>,[B@210ad97b]}]>
  ToStringBuilderTest.testReflectionCharArrayArray:289 expected:<[[C@671ef685[{[{A,B},<null>,{p}]}]> but was:<[[C@671ef685[{[[C@21cacaa7,<null>,[C@8beab46]}]>
  ToStringBuilderTest.testReflectionCharacter:106 expected:<...cter@615d5d35[value=[A]]> but was:<...cter@615d5d35[value=[java.lang.Character@38927483]]>
  ToStringBuilderTest.testReflectionDoubleArrayArray:298 expected:<[[D@320a2593[{[{1.0,2.29686},<null>,{NaN}]}]> but was:<[[D@320a2593[{[[D@3828ef8f,<null>,[D@787b217]}]>
  ToStringBuilderTest.testReflectionFloatArrayArray:243 expected:<[[F@d385acb[{[{1.0,2.29686},<null>,{NaN}]}]> but was:<[[F@d385acb[{[[F@6ed0cc34,<null>,[F@4e0ea2c2]}]>
  ToStringBuilderTest.testReflectionIntArrayArray:262 expected:<[[I@4b9526d4[{[{1,2},<null>,{5}]}]> but was:<[[I@4b9526d4[{[[I@2d284f10,<null>,[I@315eba99]}]>
  ToStringBuilderTest.testReflectionInteger:97 expected:<...eger@3edcbc7b[value=[5]]> but was:<...eger@3edcbc7b[value=[java.lang.Integer@254f6e3f]]>
  ToStringBuilderTest.testReflectionLongArrayArray:253 expected:<[[J@61797eca[{[{1,2},<null>,{5}]}]> but was:<[[J@61797eca[{[[J@6f7331c4,<null>,[J@73c87405]}]>
  ToStringBuilderTest.testReflectionObjectArray:160 expected:<...@7a783e0d[{<null>,5,[{3,6}]}]> but was:<...@7a783e0d[{<null>,5,[[I@6c32064b]}]>
  ToStringBuilderTest.testReflectionObjectCycle:562 expected:<...nTestCycleB@317240d9[[a=org.apache.commons.lang3.builder.ToStringBuilderTest$ReflectionTestCycleA@483b5d6b]]]> but was:<...nTestCycleB@317240d9[]]>
  ToStringBuilderTest.testReflectionStatics:927 expected:<...8290a3[staticString=[staticString,staticInt=12345,instanceString=instanceString],instanceInt=67890]> but was:<...8290a3[staticString=[java.lang.String@3f14a0de,staticInt=12345,instanceString=java.lang.String@1d085c24],instanceInt=67890]>
  ToStringBuilderTest.testReflectionhortArrayArray:271 expected:<[[S@3a888c1[{[{1,2},<null>,{5}]}]> but was:<[[S@3a888c1[{[[S@2daa38c7,<null>,[S@275a83d]}]>
  ToStringBuilderTest.testSelfInstanceTwoVarsReflectionObjectCycle:549 expected:<...@4da8692d,otherType=[The Other Type]]> but was:<...@4da8692d,otherType=[java.lang.String@9343bd5]]>
  ToStringBuilderTest.testShortArray:748 expected:<...ng.Integer@3edcbc7b[[{1,2,-3,4}]]> but was:<...ng.Integer@3edcbc7b[[[S@1d523624]]>
  ToStringBuilderTest.testShortArrayArray:827 expected:<...g.Integer@3edcbc7b[{[{1,2},<null>,{5}]}]> but was:<...g.Integer@3edcbc7b[{[[S@11b13588,<null>,[S@9317ccb]}]>
  ToStringBuilderTest.testSimpleReflectionStatics:907 expected:<...57dbbd[staticString=[staticString],staticInt=12345]> but was:<...57dbbd[staticString=[java.lang.String@3f14a0de],staticInt=12345]>



Tests run: 3526, Failures: 116, Errors: 0, Skipped: 97

[INFO] ------------------------------------------------------------------------
[INFO] BUILD FAILURE
[INFO] ------------------------------------------------------------------------
[INFO] Total time: 30.933s
[INFO] Finished at: Tue Aug 04 09:18:08 BST 2015
[INFO] Final Memory: 23M/414M
[INFO] ------------------------------------------------------------------------
[ERROR] Failed to execute goal org.apache.maven.plugins:maven-surefire-plugin:2.18:test (default-test) on project commons-lang3: There are test failures.
[ERROR] 
[ERROR] Please refer to /home/perham/Study/LittleDarwin/Cases/commons-lang3-3.4-src/target/surefire-reports for the individual test results.
[ERROR] -> [Help 1]
[ERROR] 
[ERROR] To see the full stack trace of the errors, re-run Maven with the -e switch.
[ERROR] Re-run Maven using the -X switch to enable full debug logging.
[ERROR] 
[ERROR] For more information about the errors and possible solutions, please read the following articles:
[ERROR] [Help 1] http://cwiki.apache.org/confluence/display/MAVEN/MojoFailureException
