[INFO] Scanning for projects...
[INFO]                                                                         
[INFO] ------------------------------------------------------------------------
[INFO] Building Apache Commons Lang 3.4
[INFO] ------------------------------------------------------------------------
[INFO] 
[INFO] --- maven-enforcer-plugin:1.3.1:enforce (enforce-maven-3) @ commons-lang3 ---
[INFO] 
[INFO] --- build-helper-maven-plugin:1.8:parse-version (parse-version) @ commons-lang3 ---
[INFO] 
[INFO] --- maven-antrun-plugin:1.8:run (javadoc.resources) @ commons-lang3 ---
[INFO] Executing tasks

main:
[INFO] Executed tasks
[INFO] 
[INFO] --- maven-remote-resources-plugin:1.5:process (default) @ commons-lang3 ---
[INFO] 
[INFO] --- buildnumber-maven-plugin:1.3:create (default) @ commons-lang3 ---
[INFO] Executing: /bin/sh -c cd /home/perham/Study/LittleDarwin/Cases/commons-lang3-3.4-src && svn --non-interactive info
[INFO] Working directory: /home/perham/Study/LittleDarwin/Cases/commons-lang3-3.4-src
[INFO] Storing buildNumber: ?????? at timestamp: 1438672572476
[INFO] Executing: /bin/sh -c cd /home/perham/Study/LittleDarwin/Cases/commons-lang3-3.4-src && svn --non-interactive info
[INFO] Working directory: /home/perham/Study/LittleDarwin/Cases/commons-lang3-3.4-src
[INFO] Storing buildScmBranch: UNKNOWN_BRANCH
[INFO] 
[INFO] --- maven-resources-plugin:2.7:resources (default-resources) @ commons-lang3 ---
[INFO] Using 'ISO-8859-1' encoding to copy filtered resources.
[INFO] Copying 0 resource
[INFO] Copying 2 resources to META-INF
[INFO] 
[INFO] --- maven-compiler-plugin:3.2:compile (default-compile) @ commons-lang3 ---
[INFO] Changes detected - recompiling the module!
[INFO] Compiling 133 source files to /home/perham/Study/LittleDarwin/Cases/commons-lang3-3.4-src/target/classes
[INFO] /home/perham/Study/LittleDarwin/Cases/commons-lang3-3.4-src/src/main/java/org/apache/commons/lang3/SerializationUtils.java: /home/perham/Study/LittleDarwin/Cases/commons-lang3-3.4-src/src/main/java/org/apache/commons/lang3/SerializationUtils.java uses unchecked or unsafe operations.
[INFO] /home/perham/Study/LittleDarwin/Cases/commons-lang3-3.4-src/src/main/java/org/apache/commons/lang3/SerializationUtils.java: Recompile with -Xlint:unchecked for details.
[INFO] 
[INFO] --- maven-bundle-plugin:2.5.3:manifest (bundle-manifest) @ commons-lang3 ---
[INFO] 
[INFO] --- animal-sniffer-maven-plugin:1.13:check (checkAPIcompatibility) @ commons-lang3 ---
[INFO] Checking unresolved references to org.codehaus.mojo.signature:java16:1.0
[INFO] 
[INFO] --- maven-resources-plugin:2.7:testResources (default-testResources) @ commons-lang3 ---
[INFO] Using 'ISO-8859-1' encoding to copy filtered resources.
[INFO] Copying 2 resources
[INFO] Copying 2 resources to META-INF
[INFO] 
[INFO] --- maven-compiler-plugin:3.2:testCompile (default-testCompile) @ commons-lang3 ---
[INFO] Nothing to compile - all classes are up to date
[INFO] 
[INFO] --- maven-surefire-plugin:2.18:test (default-test) @ commons-lang3 ---
[INFO] Surefire report directory: /home/perham/Study/LittleDarwin/Cases/commons-lang3-3.4-src/target/surefire-reports

-------------------------------------------------------
 T E S T S
-------------------------------------------------------
Running org.apache.commons.lang3.ValidateTest
Tests run: 63, Failures: 0, Errors: 0, Skipped: 0, Time elapsed: 0.036 sec - in org.apache.commons.lang3.ValidateTest
Running org.apache.commons.lang3.LocaleUtilsTest
Tests run: 15, Failures: 0, Errors: 0, Skipped: 0, Time elapsed: 0.02 sec - in org.apache.commons.lang3.LocaleUtilsTest
Running org.apache.commons.lang3.tuple.MutableTripleTest
Tests run: 8, Failures: 0, Errors: 0, Skipped: 0, Time elapsed: 0.009 sec - in org.apache.commons.lang3.tuple.MutableTripleTest
Running org.apache.commons.lang3.tuple.TripleTest
Tests run: 10, Failures: 0, Errors: 0, Skipped: 0, Time elapsed: 0.001 sec - in org.apache.commons.lang3.tuple.TripleTest
Running org.apache.commons.lang3.tuple.ImmutablePairTest
Tests run: 6, Failures: 0, Errors: 0, Skipped: 0, Time elapsed: 0 sec - in org.apache.commons.lang3.tuple.ImmutablePairTest
Running org.apache.commons.lang3.tuple.MutablePairTest
Tests run: 8, Failures: 0, Errors: 0, Skipped: 0, Time elapsed: 0.001 sec - in org.apache.commons.lang3.tuple.MutablePairTest
Running org.apache.commons.lang3.tuple.ImmutableTripleTest
Tests run: 6, Failures: 0, Errors: 0, Skipped: 0, Time elapsed: 0.001 sec - in org.apache.commons.lang3.tuple.ImmutableTripleTest
Running org.apache.commons.lang3.tuple.PairTest
Tests run: 9, Failures: 0, Errors: 0, Skipped: 0, Time elapsed: 0.001 sec - in org.apache.commons.lang3.tuple.PairTest
Running org.apache.commons.lang3.StringUtilsIsTest
Tests run: 8, Failures: 0, Errors: 0, Skipped: 0, Time elapsed: 0.007 sec - in org.apache.commons.lang3.StringUtilsIsTest
Running org.apache.commons.lang3.JavaVersionTest
Tests run: 3, Failures: 0, Errors: 0, Skipped: 0, Time elapsed: 0.001 sec - in org.apache.commons.lang3.JavaVersionTest
Running org.apache.commons.lang3.builder.NoFieldNamesToStringStyleTest
Tests run: 16, Failures: 0, Errors: 16, Skipped: 0, Time elapsed: 0.013 sec <<< FAILURE! - in org.apache.commons.lang3.builder.NoFieldNamesToStringStyleTest
testObjectArray(org.apache.commons.lang3.builder.NoFieldNamesToStringStyleTest)  Time elapsed: 0.008 sec  <<< ERROR!
java.lang.IllegalArgumentException: The style must not be null
	at org.apache.commons.lang3.builder.ToStringBuilder.setDefaultStyle(ToStringBuilder.java:12)
	at org.apache.commons.lang3.builder.NoFieldNamesToStringStyleTest.setUp(NoFieldNamesToStringStyleTest.java:41)

testObjectArray(org.apache.commons.lang3.builder.NoFieldNamesToStringStyleTest)  Time elapsed: 0.008 sec  <<< ERROR!
java.lang.IllegalArgumentException: The style must not be null
	at org.apache.commons.lang3.builder.ToStringBuilder.setDefaultStyle(ToStringBuilder.java:12)
	at org.apache.commons.lang3.builder.NoFieldNamesToStringStyleTest.tearDown(NoFieldNamesToStringStyleTest.java:46)

testBlank(org.apache.commons.lang3.builder.NoFieldNamesToStringStyleTest)  Time elapsed: 0 sec  <<< ERROR!
java.lang.IllegalArgumentException: The style must not be null
	at org.apache.commons.lang3.builder.ToStringBuilder.setDefaultStyle(ToStringBuilder.java:12)
	at org.apache.commons.lang3.builder.NoFieldNamesToStringStyleTest.setUp(NoFieldNamesToStringStyleTest.java:41)

testBlank(org.apache.commons.lang3.builder.NoFieldNamesToStringStyleTest)  Time elapsed: 0 sec  <<< ERROR!
java.lang.IllegalArgumentException: The style must not be null
	at org.apache.commons.lang3.builder.ToStringBuilder.setDefaultStyle(ToStringBuilder.java:12)
	at org.apache.commons.lang3.builder.NoFieldNamesToStringStyleTest.tearDown(NoFieldNamesToStringStyleTest.java:46)

testLong(org.apache.commons.lang3.builder.NoFieldNamesToStringStyleTest)  Time elapsed: 0 sec  <<< ERROR!
java.lang.IllegalArgumentException: The style must not be null
	at org.apache.commons.lang3.builder.ToStringBuilder.setDefaultStyle(ToStringBuilder.java:12)
	at org.apache.commons.lang3.builder.NoFieldNamesToStringStyleTest.setUp(NoFieldNamesToStringStyleTest.java:41)

testLong(org.apache.commons.lang3.builder.NoFieldNamesToStringStyleTest)  Time elapsed: 0 sec  <<< ERROR!
java.lang.IllegalArgumentException: The style must not be null
	at org.apache.commons.lang3.builder.ToStringBuilder.setDefaultStyle(ToStringBuilder.java:12)
	at org.apache.commons.lang3.builder.NoFieldNamesToStringStyleTest.tearDown(NoFieldNamesToStringStyleTest.java:46)

testLongArrayArray(org.apache.commons.lang3.builder.NoFieldNamesToStringStyleTest)  Time elapsed: 0.001 sec  <<< ERROR!
java.lang.IllegalArgumentException: The style must not be null
	at org.apache.commons.lang3.builder.ToStringBuilder.setDefaultStyle(ToStringBuilder.java:12)
	at org.apache.commons.lang3.builder.NoFieldNamesToStringStyleTest.setUp(NoFieldNamesToStringStyleTest.java:41)

testLongArrayArray(org.apache.commons.lang3.builder.NoFieldNamesToStringStyleTest)  Time elapsed: 0.001 sec  <<< ERROR!
java.lang.IllegalArgumentException: The style must not be null
	at org.apache.commons.lang3.builder.ToStringBuilder.setDefaultStyle(ToStringBuilder.java:12)
	at org.apache.commons.lang3.builder.NoFieldNamesToStringStyleTest.tearDown(NoFieldNamesToStringStyleTest.java:46)

testLongArray(org.apache.commons.lang3.builder.NoFieldNamesToStringStyleTest)  Time elapsed: 0 sec  <<< ERROR!
java.lang.IllegalArgumentException: The style must not be null
	at org.apache.commons.lang3.builder.ToStringBuilder.setDefaultStyle(ToStringBuilder.java:12)
	at org.apache.commons.lang3.builder.NoFieldNamesToStringStyleTest.setUp(NoFieldNamesToStringStyleTest.java:41)

testLongArray(org.apache.commons.lang3.builder.NoFieldNamesToStringStyleTest)  Time elapsed: 0.001 sec  <<< ERROR!
java.lang.IllegalArgumentException: The style must not be null
	at org.apache.commons.lang3.builder.ToStringBuilder.setDefaultStyle(ToStringBuilder.java:12)
	at org.apache.commons.lang3.builder.NoFieldNamesToStringStyleTest.tearDown(NoFieldNamesToStringStyleTest.java:46)

testObject(org.apache.commons.lang3.builder.NoFieldNamesToStringStyleTest)  Time elapsed: 0 sec  <<< ERROR!
java.lang.IllegalArgumentException: The style must not be null
	at org.apache.commons.lang3.builder.ToStringBuilder.setDefaultStyle(ToStringBuilder.java:12)
	at org.apache.commons.lang3.builder.NoFieldNamesToStringStyleTest.setUp(NoFieldNamesToStringStyleTest.java:41)

testObject(org.apache.commons.lang3.builder.NoFieldNamesToStringStyleTest)  Time elapsed: 0 sec  <<< ERROR!
java.lang.IllegalArgumentException: The style must not be null
	at org.apache.commons.lang3.builder.ToStringBuilder.setDefaultStyle(ToStringBuilder.java:12)
	at org.apache.commons.lang3.builder.NoFieldNamesToStringStyleTest.tearDown(NoFieldNamesToStringStyleTest.java:46)

testPerson(org.apache.commons.lang3.builder.NoFieldNamesToStringStyleTest)  Time elapsed: 0.001 sec  <<< ERROR!
java.lang.IllegalArgumentException: The style must not be null
	at org.apache.commons.lang3.builder.ToStringBuilder.setDefaultStyle(ToStringBuilder.java:12)
	at org.apache.commons.lang3.builder.NoFieldNamesToStringStyleTest.setUp(NoFieldNamesToStringStyleTest.java:41)

testPerson(org.apache.commons.lang3.builder.NoFieldNamesToStringStyleTest)  Time elapsed: 0.001 sec  <<< ERROR!
java.lang.IllegalArgumentException: The style must not be null
	at org.apache.commons.lang3.builder.ToStringBuilder.setDefaultStyle(ToStringBuilder.java:12)
	at org.apache.commons.lang3.builder.NoFieldNamesToStringStyleTest.tearDown(NoFieldNamesToStringStyleTest.java:46)

testAppendSuper(org.apache.commons.lang3.builder.NoFieldNamesToStringStyleTest)  Time elapsed: 0 sec  <<< ERROR!
java.lang.IllegalArgumentException: The style must not be null
	at org.apache.commons.lang3.builder.ToStringBuilder.setDefaultStyle(ToStringBuilder.java:12)
	at org.apache.commons.lang3.builder.NoFieldNamesToStringStyleTest.setUp(NoFieldNamesToStringStyleTest.java:41)

testAppendSuper(org.apache.commons.lang3.builder.NoFieldNamesToStringStyleTest)  Time elapsed: 0 sec  <<< ERROR!
java.lang.IllegalArgumentException: The style must not be null
	at org.apache.commons.lang3.builder.ToStringBuilder.setDefaultStyle(ToStringBuilder.java:12)
	at org.apache.commons.lang3.builder.NoFieldNamesToStringStyleTest.tearDown(NoFieldNamesToStringStyleTest.java:46)

Running org.apache.commons.lang3.builder.ShortPrefixToStringStyleTest
Tests run: 16, Failures: 0, Errors: 16, Skipped: 0, Time elapsed: 0.001 sec <<< FAILURE! - in org.apache.commons.lang3.builder.ShortPrefixToStringStyleTest
testObjectArray(org.apache.commons.lang3.builder.ShortPrefixToStringStyleTest)  Time elapsed: 0 sec  <<< ERROR!
java.lang.IllegalArgumentException: The style must not be null
	at org.apache.commons.lang3.builder.ToStringBuilder.setDefaultStyle(ToStringBuilder.java:12)
	at org.apache.commons.lang3.builder.ShortPrefixToStringStyleTest.setUp(ShortPrefixToStringStyleTest.java:41)

testObjectArray(org.apache.commons.lang3.builder.ShortPrefixToStringStyleTest)  Time elapsed: 0 sec  <<< ERROR!
java.lang.IllegalArgumentException: The style must not be null
	at org.apache.commons.lang3.builder.ToStringBuilder.setDefaultStyle(ToStringBuilder.java:12)
	at org.apache.commons.lang3.builder.ShortPrefixToStringStyleTest.tearDown(ShortPrefixToStringStyleTest.java:46)

testBlank(org.apache.commons.lang3.builder.ShortPrefixToStringStyleTest)  Time elapsed: 0 sec  <<< ERROR!
java.lang.IllegalArgumentException: The style must not be null
	at org.apache.commons.lang3.builder.ToStringBuilder.setDefaultStyle(ToStringBuilder.java:12)
	at org.apache.commons.lang3.builder.ShortPrefixToStringStyleTest.setUp(ShortPrefixToStringStyleTest.java:41)

testBlank(org.apache.commons.lang3.builder.ShortPrefixToStringStyleTest)  Time elapsed: 0 sec  <<< ERROR!
java.lang.IllegalArgumentException: The style must not be null
	at org.apache.commons.lang3.builder.ToStringBuilder.setDefaultStyle(ToStringBuilder.java:12)
	at org.apache.commons.lang3.builder.ShortPrefixToStringStyleTest.tearDown(ShortPrefixToStringStyleTest.java:46)

testLong(org.apache.commons.lang3.builder.ShortPrefixToStringStyleTest)  Time elapsed: 0 sec  <<< ERROR!
java.lang.IllegalArgumentException: The style must not be null
	at org.apache.commons.lang3.builder.ToStringBuilder.setDefaultStyle(ToStringBuilder.java:12)
	at org.apache.commons.lang3.builder.ShortPrefixToStringStyleTest.setUp(ShortPrefixToStringStyleTest.java:41)

testLong(org.apache.commons.lang3.builder.ShortPrefixToStringStyleTest)  Time elapsed: 0 sec  <<< ERROR!
java.lang.IllegalArgumentException: The style must not be null
	at org.apache.commons.lang3.builder.ToStringBuilder.setDefaultStyle(ToStringBuilder.java:12)
	at org.apache.commons.lang3.builder.ShortPrefixToStringStyleTest.tearDown(ShortPrefixToStringStyleTest.java:46)

testLongArrayArray(org.apache.commons.lang3.builder.ShortPrefixToStringStyleTest)  Time elapsed: 0 sec  <<< ERROR!
java.lang.IllegalArgumentException: The style must not be null
	at org.apache.commons.lang3.builder.ToStringBuilder.setDefaultStyle(ToStringBuilder.java:12)
	at org.apache.commons.lang3.builder.ShortPrefixToStringStyleTest.setUp(ShortPrefixToStringStyleTest.java:41)

testLongArrayArray(org.apache.commons.lang3.builder.ShortPrefixToStringStyleTest)  Time elapsed: 0.001 sec  <<< ERROR!
java.lang.IllegalArgumentException: The style must not be null
	at org.apache.commons.lang3.builder.ToStringBuilder.setDefaultStyle(ToStringBuilder.java:12)
	at org.apache.commons.lang3.builder.ShortPrefixToStringStyleTest.tearDown(ShortPrefixToStringStyleTest.java:46)

testLongArray(org.apache.commons.lang3.builder.ShortPrefixToStringStyleTest)  Time elapsed: 0 sec  <<< ERROR!
java.lang.IllegalArgumentException: The style must not be null
	at org.apache.commons.lang3.builder.ToStringBuilder.setDefaultStyle(ToStringBuilder.java:12)
	at org.apache.commons.lang3.builder.ShortPrefixToStringStyleTest.setUp(ShortPrefixToStringStyleTest.java:41)

testLongArray(org.apache.commons.lang3.builder.ShortPrefixToStringStyleTest)  Time elapsed: 0 sec  <<< ERROR!
java.lang.IllegalArgumentException: The style must not be null
	at org.apache.commons.lang3.builder.ToStringBuilder.setDefaultStyle(ToStringBuilder.java:12)
	at org.apache.commons.lang3.builder.ShortPrefixToStringStyleTest.tearDown(ShortPrefixToStringStyleTest.java:46)

testObject(org.apache.commons.lang3.builder.ShortPrefixToStringStyleTest)  Time elapsed: 0 sec  <<< ERROR!
java.lang.IllegalArgumentException: The style must not be null
	at org.apache.commons.lang3.builder.ToStringBuilder.setDefaultStyle(ToStringBuilder.java:12)
	at org.apache.commons.lang3.builder.ShortPrefixToStringStyleTest.setUp(ShortPrefixToStringStyleTest.java:41)

testObject(org.apache.commons.lang3.builder.ShortPrefixToStringStyleTest)  Time elapsed: 0 sec  <<< ERROR!
java.lang.IllegalArgumentException: The style must not be null
	at org.apache.commons.lang3.builder.ToStringBuilder.setDefaultStyle(ToStringBuilder.java:12)
	at org.apache.commons.lang3.builder.ShortPrefixToStringStyleTest.tearDown(ShortPrefixToStringStyleTest.java:46)

testPerson(org.apache.commons.lang3.builder.ShortPrefixToStringStyleTest)  Time elapsed: 0 sec  <<< ERROR!
java.lang.IllegalArgumentException: The style must not be null
	at org.apache.commons.lang3.builder.ToStringBuilder.setDefaultStyle(ToStringBuilder.java:12)
	at org.apache.commons.lang3.builder.ShortPrefixToStringStyleTest.setUp(ShortPrefixToStringStyleTest.java:41)

testPerson(org.apache.commons.lang3.builder.ShortPrefixToStringStyleTest)  Time elapsed: 0 sec  <<< ERROR!
java.lang.IllegalArgumentException: The style must not be null
	at org.apache.commons.lang3.builder.ToStringBuilder.setDefaultStyle(ToStringBuilder.java:12)
	at org.apache.commons.lang3.builder.ShortPrefixToStringStyleTest.tearDown(ShortPrefixToStringStyleTest.java:46)

testAppendSuper(org.apache.commons.lang3.builder.ShortPrefixToStringStyleTest)  Time elapsed: 0 sec  <<< ERROR!
java.lang.IllegalArgumentException: The style must not be null
	at org.apache.commons.lang3.builder.ToStringBuilder.setDefaultStyle(ToStringBuilder.java:12)
	at org.apache.commons.lang3.builder.ShortPrefixToStringStyleTest.setUp(ShortPrefixToStringStyleTest.java:41)

testAppendSuper(org.apache.commons.lang3.builder.ShortPrefixToStringStyleTest)  Time elapsed: 0 sec  <<< ERROR!
java.lang.IllegalArgumentException: The style must not be null
	at org.apache.commons.lang3.builder.ToStringBuilder.setDefaultStyle(ToStringBuilder.java:12)
	at org.apache.commons.lang3.builder.ShortPrefixToStringStyleTest.tearDown(ShortPrefixToStringStyleTest.java:46)

Running org.apache.commons.lang3.builder.DiffResultTest
Tests run: 9, Failures: 0, Errors: 0, Skipped: 0, Time elapsed: 0.006 sec - in org.apache.commons.lang3.builder.DiffResultTest
Running org.apache.commons.lang3.builder.CompareToBuilderTest
Tests run: 48, Failures: 0, Errors: 0, Skipped: 0, Time elapsed: 0.02 sec - in org.apache.commons.lang3.builder.CompareToBuilderTest
Running org.apache.commons.lang3.builder.MultilineRecursiveToStringStyleTest
Tests run: 10, Failures: 0, Errors: 0, Skipped: 0, Time elapsed: 0.005 sec - in org.apache.commons.lang3.builder.MultilineRecursiveToStringStyleTest
Running org.apache.commons.lang3.builder.RecursiveToStringStyleTest
Tests run: 16, Failures: 0, Errors: 16, Skipped: 0, Time elapsed: 0.004 sec <<< FAILURE! - in org.apache.commons.lang3.builder.RecursiveToStringStyleTest
testObjectArray(org.apache.commons.lang3.builder.RecursiveToStringStyleTest)  Time elapsed: 0 sec  <<< ERROR!
java.lang.IllegalArgumentException: The style must not be null
	at org.apache.commons.lang3.builder.ToStringBuilder.setDefaultStyle(ToStringBuilder.java:12)
	at org.apache.commons.lang3.builder.RecursiveToStringStyleTest.setUp(RecursiveToStringStyleTest.java:40)

testObjectArray(org.apache.commons.lang3.builder.RecursiveToStringStyleTest)  Time elapsed: 0 sec  <<< ERROR!
java.lang.IllegalArgumentException: The style must not be null
	at org.apache.commons.lang3.builder.ToStringBuilder.setDefaultStyle(ToStringBuilder.java:12)
	at org.apache.commons.lang3.builder.RecursiveToStringStyleTest.tearDown(RecursiveToStringStyleTest.java:45)

testBlank(org.apache.commons.lang3.builder.RecursiveToStringStyleTest)  Time elapsed: 0 sec  <<< ERROR!
java.lang.IllegalArgumentException: The style must not be null
	at org.apache.commons.lang3.builder.ToStringBuilder.setDefaultStyle(ToStringBuilder.java:12)
	at org.apache.commons.lang3.builder.RecursiveToStringStyleTest.setUp(RecursiveToStringStyleTest.java:40)

testBlank(org.apache.commons.lang3.builder.RecursiveToStringStyleTest)  Time elapsed: 0 sec  <<< ERROR!
java.lang.IllegalArgumentException: The style must not be null
	at org.apache.commons.lang3.builder.ToStringBuilder.setDefaultStyle(ToStringBuilder.java:12)
	at org.apache.commons.lang3.builder.RecursiveToStringStyleTest.tearDown(RecursiveToStringStyleTest.java:45)

testLong(org.apache.commons.lang3.builder.RecursiveToStringStyleTest)  Time elapsed: 0.001 sec  <<< ERROR!
java.lang.IllegalArgumentException: The style must not be null
	at org.apache.commons.lang3.builder.ToStringBuilder.setDefaultStyle(ToStringBuilder.java:12)
	at org.apache.commons.lang3.builder.RecursiveToStringStyleTest.setUp(RecursiveToStringStyleTest.java:40)

testLong(org.apache.commons.lang3.builder.RecursiveToStringStyleTest)  Time elapsed: 0.001 sec  <<< ERROR!
java.lang.IllegalArgumentException: The style must not be null
	at org.apache.commons.lang3.builder.ToStringBuilder.setDefaultStyle(ToStringBuilder.java:12)
	at org.apache.commons.lang3.builder.RecursiveToStringStyleTest.tearDown(RecursiveToStringStyleTest.java:45)

testLongArrayArray(org.apache.commons.lang3.builder.RecursiveToStringStyleTest)  Time elapsed: 0 sec  <<< ERROR!
java.lang.IllegalArgumentException: The style must not be null
	at org.apache.commons.lang3.builder.ToStringBuilder.setDefaultStyle(ToStringBuilder.java:12)
	at org.apache.commons.lang3.builder.RecursiveToStringStyleTest.setUp(RecursiveToStringStyleTest.java:40)

testLongArrayArray(org.apache.commons.lang3.builder.RecursiveToStringStyleTest)  Time elapsed: 0.001 sec  <<< ERROR!
java.lang.IllegalArgumentException: The style must not be null
	at org.apache.commons.lang3.builder.ToStringBuilder.setDefaultStyle(ToStringBuilder.java:12)
	at org.apache.commons.lang3.builder.RecursiveToStringStyleTest.tearDown(RecursiveToStringStyleTest.java:45)

testLongArray(org.apache.commons.lang3.builder.RecursiveToStringStyleTest)  Time elapsed: 0 sec  <<< ERROR!
java.lang.IllegalArgumentException: The style must not be null
	at org.apache.commons.lang3.builder.ToStringBuilder.setDefaultStyle(ToStringBuilder.java:12)
	at org.apache.commons.lang3.builder.RecursiveToStringStyleTest.setUp(RecursiveToStringStyleTest.java:40)

testLongArray(org.apache.commons.lang3.builder.RecursiveToStringStyleTest)  Time elapsed: 0 sec  <<< ERROR!
java.lang.IllegalArgumentException: The style must not be null
	at org.apache.commons.lang3.builder.ToStringBuilder.setDefaultStyle(ToStringBuilder.java:12)
	at org.apache.commons.lang3.builder.RecursiveToStringStyleTest.tearDown(RecursiveToStringStyleTest.java:45)

testObject(org.apache.commons.lang3.builder.RecursiveToStringStyleTest)  Time elapsed: 0 sec  <<< ERROR!
java.lang.IllegalArgumentException: The style must not be null
	at org.apache.commons.lang3.builder.ToStringBuilder.setDefaultStyle(ToStringBuilder.java:12)
	at org.apache.commons.lang3.builder.RecursiveToStringStyleTest.setUp(RecursiveToStringStyleTest.java:40)

testObject(org.apache.commons.lang3.builder.RecursiveToStringStyleTest)  Time elapsed: 0 sec  <<< ERROR!
java.lang.IllegalArgumentException: The style must not be null
	at org.apache.commons.lang3.builder.ToStringBuilder.setDefaultStyle(ToStringBuilder.java:12)
	at org.apache.commons.lang3.builder.RecursiveToStringStyleTest.tearDown(RecursiveToStringStyleTest.java:45)

testPerson(org.apache.commons.lang3.builder.RecursiveToStringStyleTest)  Time elapsed: 0 sec  <<< ERROR!
java.lang.IllegalArgumentException: The style must not be null
	at org.apache.commons.lang3.builder.ToStringBuilder.setDefaultStyle(ToStringBuilder.java:12)
	at org.apache.commons.lang3.builder.RecursiveToStringStyleTest.setUp(RecursiveToStringStyleTest.java:40)

testPerson(org.apache.commons.lang3.builder.RecursiveToStringStyleTest)  Time elapsed: 0.001 sec  <<< ERROR!
java.lang.IllegalArgumentException: The style must not be null
	at org.apache.commons.lang3.builder.ToStringBuilder.setDefaultStyle(ToStringBuilder.java:12)
	at org.apache.commons.lang3.builder.RecursiveToStringStyleTest.tearDown(RecursiveToStringStyleTest.java:45)

testAppendSuper(org.apache.commons.lang3.builder.RecursiveToStringStyleTest)  Time elapsed: 0 sec  <<< ERROR!
java.lang.IllegalArgumentException: The style must not be null
	at org.apache.commons.lang3.builder.ToStringBuilder.setDefaultStyle(ToStringBuilder.java:12)
	at org.apache.commons.lang3.builder.RecursiveToStringStyleTest.setUp(RecursiveToStringStyleTest.java:40)

testAppendSuper(org.apache.commons.lang3.builder.RecursiveToStringStyleTest)  Time elapsed: 0 sec  <<< ERROR!
java.lang.IllegalArgumentException: The style must not be null
	at org.apache.commons.lang3.builder.ToStringBuilder.setDefaultStyle(ToStringBuilder.java:12)
	at org.apache.commons.lang3.builder.RecursiveToStringStyleTest.tearDown(RecursiveToStringStyleTest.java:45)

Running org.apache.commons.lang3.builder.DefaultToStringStyleTest
Tests run: 16, Failures: 0, Errors: 16, Skipped: 0, Time elapsed: 0.001 sec <<< FAILURE! - in org.apache.commons.lang3.builder.DefaultToStringStyleTest
testObjectArray(org.apache.commons.lang3.builder.DefaultToStringStyleTest)  Time elapsed: 0 sec  <<< ERROR!
java.lang.IllegalArgumentException: The style must not be null
	at org.apache.commons.lang3.builder.ToStringBuilder.setDefaultStyle(ToStringBuilder.java:12)
	at org.apache.commons.lang3.builder.DefaultToStringStyleTest.setUp(DefaultToStringStyleTest.java:41)

testObjectArray(org.apache.commons.lang3.builder.DefaultToStringStyleTest)  Time elapsed: 0 sec  <<< ERROR!
java.lang.IllegalArgumentException: The style must not be null
	at org.apache.commons.lang3.builder.ToStringBuilder.setDefaultStyle(ToStringBuilder.java:12)
	at org.apache.commons.lang3.builder.DefaultToStringStyleTest.tearDown(DefaultToStringStyleTest.java:46)

testBlank(org.apache.commons.lang3.builder.DefaultToStringStyleTest)  Time elapsed: 0 sec  <<< ERROR!
java.lang.IllegalArgumentException: The style must not be null
	at org.apache.commons.lang3.builder.ToStringBuilder.setDefaultStyle(ToStringBuilder.java:12)
	at org.apache.commons.lang3.builder.DefaultToStringStyleTest.setUp(DefaultToStringStyleTest.java:41)

testBlank(org.apache.commons.lang3.builder.DefaultToStringStyleTest)  Time elapsed: 0 sec  <<< ERROR!
java.lang.IllegalArgumentException: The style must not be null
	at org.apache.commons.lang3.builder.ToStringBuilder.setDefaultStyle(ToStringBuilder.java:12)
	at org.apache.commons.lang3.builder.DefaultToStringStyleTest.tearDown(DefaultToStringStyleTest.java:46)

testLong(org.apache.commons.lang3.builder.DefaultToStringStyleTest)  Time elapsed: 0 sec  <<< ERROR!
java.lang.IllegalArgumentException: The style must not be null
	at org.apache.commons.lang3.builder.ToStringBuilder.setDefaultStyle(ToStringBuilder.java:12)
	at org.apache.commons.lang3.builder.DefaultToStringStyleTest.setUp(DefaultToStringStyleTest.java:41)

testLong(org.apache.commons.lang3.builder.DefaultToStringStyleTest)  Time elapsed: 0 sec  <<< ERROR!
java.lang.IllegalArgumentException: The style must not be null
	at org.apache.commons.lang3.builder.ToStringBuilder.setDefaultStyle(ToStringBuilder.java:12)
	at org.apache.commons.lang3.builder.DefaultToStringStyleTest.tearDown(DefaultToStringStyleTest.java:46)

testLongArrayArray(org.apache.commons.lang3.builder.DefaultToStringStyleTest)  Time elapsed: 0 sec  <<< ERROR!
java.lang.IllegalArgumentException: The style must not be null
	at org.apache.commons.lang3.builder.ToStringBuilder.setDefaultStyle(ToStringBuilder.java:12)
	at org.apache.commons.lang3.builder.DefaultToStringStyleTest.setUp(DefaultToStringStyleTest.java:41)

testLongArrayArray(org.apache.commons.lang3.builder.DefaultToStringStyleTest)  Time elapsed: 0 sec  <<< ERROR!
java.lang.IllegalArgumentException: The style must not be null
	at org.apache.commons.lang3.builder.ToStringBuilder.setDefaultStyle(ToStringBuilder.java:12)
	at org.apache.commons.lang3.builder.DefaultToStringStyleTest.tearDown(DefaultToStringStyleTest.java:46)

testLongArray(org.apache.commons.lang3.builder.DefaultToStringStyleTest)  Time elapsed: 0 sec  <<< ERROR!
java.lang.IllegalArgumentException: The style must not be null
	at org.apache.commons.lang3.builder.ToStringBuilder.setDefaultStyle(ToStringBuilder.java:12)
	at org.apache.commons.lang3.builder.DefaultToStringStyleTest.setUp(DefaultToStringStyleTest.java:41)

testLongArray(org.apache.commons.lang3.builder.DefaultToStringStyleTest)  Time elapsed: 0 sec  <<< ERROR!
java.lang.IllegalArgumentException: The style must not be null
	at org.apache.commons.lang3.builder.ToStringBuilder.setDefaultStyle(ToStringBuilder.java:12)
	at org.apache.commons.lang3.builder.DefaultToStringStyleTest.tearDown(DefaultToStringStyleTest.java:46)

testObject(org.apache.commons.lang3.builder.DefaultToStringStyleTest)  Time elapsed: 0 sec  <<< ERROR!
java.lang.IllegalArgumentException: The style must not be null
	at org.apache.commons.lang3.builder.ToStringBuilder.setDefaultStyle(ToStringBuilder.java:12)
	at org.apache.commons.lang3.builder.DefaultToStringStyleTest.setUp(DefaultToStringStyleTest.java:41)

testObject(org.apache.commons.lang3.builder.DefaultToStringStyleTest)  Time elapsed: 0 sec  <<< ERROR!
java.lang.IllegalArgumentException: The style must not be null
	at org.apache.commons.lang3.builder.ToStringBuilder.setDefaultStyle(ToStringBuilder.java:12)
	at org.apache.commons.lang3.builder.DefaultToStringStyleTest.tearDown(DefaultToStringStyleTest.java:46)

testPerson(org.apache.commons.lang3.builder.DefaultToStringStyleTest)  Time elapsed: 0 sec  <<< ERROR!
java.lang.IllegalArgumentException: The style must not be null
	at org.apache.commons.lang3.builder.ToStringBuilder.setDefaultStyle(ToStringBuilder.java:12)
	at org.apache.commons.lang3.builder.DefaultToStringStyleTest.setUp(DefaultToStringStyleTest.java:41)

testPerson(org.apache.commons.lang3.builder.DefaultToStringStyleTest)  Time elapsed: 0 sec  <<< ERROR!
java.lang.IllegalArgumentException: The style must not be null
	at org.apache.commons.lang3.builder.ToStringBuilder.setDefaultStyle(ToStringBuilder.java:12)
	at org.apache.commons.lang3.builder.DefaultToStringStyleTest.tearDown(DefaultToStringStyleTest.java:46)

testAppendSuper(org.apache.commons.lang3.builder.DefaultToStringStyleTest)  Time elapsed: 0 sec  <<< ERROR!
java.lang.IllegalArgumentException: The style must not be null
	at org.apache.commons.lang3.builder.ToStringBuilder.setDefaultStyle(ToStringBuilder.java:12)
	at org.apache.commons.lang3.builder.DefaultToStringStyleTest.setUp(DefaultToStringStyleTest.java:41)

testAppendSuper(org.apache.commons.lang3.builder.DefaultToStringStyleTest)  Time elapsed: 0 sec  <<< ERROR!
java.lang.IllegalArgumentException: The style must not be null
	at org.apache.commons.lang3.builder.ToStringBuilder.setDefaultStyle(ToStringBuilder.java:12)
	at org.apache.commons.lang3.builder.DefaultToStringStyleTest.tearDown(DefaultToStringStyleTest.java:46)

Running org.apache.commons.lang3.builder.ReflectionToStringBuilderExcludeTest
Tests run: 11, Failures: 0, Errors: 0, Skipped: 0, Time elapsed: 0.001 sec - in org.apache.commons.lang3.builder.ReflectionToStringBuilderExcludeTest
Running org.apache.commons.lang3.builder.StandardToStringStyleTest
Tests run: 16, Failures: 0, Errors: 16, Skipped: 0, Time elapsed: 0.002 sec <<< FAILURE! - in org.apache.commons.lang3.builder.StandardToStringStyleTest
testObjectArray(org.apache.commons.lang3.builder.StandardToStringStyleTest)  Time elapsed: 0 sec  <<< ERROR!
java.lang.IllegalArgumentException: The style must not be null
	at org.apache.commons.lang3.builder.ToStringBuilder.setDefaultStyle(ToStringBuilder.java:12)
	at org.apache.commons.lang3.builder.StandardToStringStyleTest.setUp(StandardToStringStyleTest.java:56)

testObjectArray(org.apache.commons.lang3.builder.StandardToStringStyleTest)  Time elapsed: 0 sec  <<< ERROR!
java.lang.IllegalArgumentException: The style must not be null
	at org.apache.commons.lang3.builder.ToStringBuilder.setDefaultStyle(ToStringBuilder.java:12)
	at org.apache.commons.lang3.builder.StandardToStringStyleTest.tearDown(StandardToStringStyleTest.java:61)

testBlank(org.apache.commons.lang3.builder.StandardToStringStyleTest)  Time elapsed: 0 sec  <<< ERROR!
java.lang.IllegalArgumentException: The style must not be null
	at org.apache.commons.lang3.builder.ToStringBuilder.setDefaultStyle(ToStringBuilder.java:12)
	at org.apache.commons.lang3.builder.StandardToStringStyleTest.setUp(StandardToStringStyleTest.java:56)

testBlank(org.apache.commons.lang3.builder.StandardToStringStyleTest)  Time elapsed: 0.001 sec  <<< ERROR!
java.lang.IllegalArgumentException: The style must not be null
	at org.apache.commons.lang3.builder.ToStringBuilder.setDefaultStyle(ToStringBuilder.java:12)
	at org.apache.commons.lang3.builder.StandardToStringStyleTest.tearDown(StandardToStringStyleTest.java:61)

testLong(org.apache.commons.lang3.builder.StandardToStringStyleTest)  Time elapsed: 0 sec  <<< ERROR!
java.lang.IllegalArgumentException: The style must not be null
	at org.apache.commons.lang3.builder.ToStringBuilder.setDefaultStyle(ToStringBuilder.java:12)
	at org.apache.commons.lang3.builder.StandardToStringStyleTest.setUp(StandardToStringStyleTest.java:56)

testLong(org.apache.commons.lang3.builder.StandardToStringStyleTest)  Time elapsed: 0 sec  <<< ERROR!
java.lang.IllegalArgumentException: The style must not be null
	at org.apache.commons.lang3.builder.ToStringBuilder.setDefaultStyle(ToStringBuilder.java:12)
	at org.apache.commons.lang3.builder.StandardToStringStyleTest.tearDown(StandardToStringStyleTest.java:61)

testLongArrayArray(org.apache.commons.lang3.builder.StandardToStringStyleTest)  Time elapsed: 0 sec  <<< ERROR!
java.lang.IllegalArgumentException: The style must not be null
	at org.apache.commons.lang3.builder.ToStringBuilder.setDefaultStyle(ToStringBuilder.java:12)
	at org.apache.commons.lang3.builder.StandardToStringStyleTest.setUp(StandardToStringStyleTest.java:56)

testLongArrayArray(org.apache.commons.lang3.builder.StandardToStringStyleTest)  Time elapsed: 0 sec  <<< ERROR!
java.lang.IllegalArgumentException: The style must not be null
	at org.apache.commons.lang3.builder.ToStringBuilder.setDefaultStyle(ToStringBuilder.java:12)
	at org.apache.commons.lang3.builder.StandardToStringStyleTest.tearDown(StandardToStringStyleTest.java:61)

testLongArray(org.apache.commons.lang3.builder.StandardToStringStyleTest)  Time elapsed: 0 sec  <<< ERROR!
java.lang.IllegalArgumentException: The style must not be null
	at org.apache.commons.lang3.builder.ToStringBuilder.setDefaultStyle(ToStringBuilder.java:12)
	at org.apache.commons.lang3.builder.StandardToStringStyleTest.setUp(StandardToStringStyleTest.java:56)

testLongArray(org.apache.commons.lang3.builder.StandardToStringStyleTest)  Time elapsed: 0 sec  <<< ERROR!
java.lang.IllegalArgumentException: The style must not be null
	at org.apache.commons.lang3.builder.ToStringBuilder.setDefaultStyle(ToStringBuilder.java:12)
	at org.apache.commons.lang3.builder.StandardToStringStyleTest.tearDown(StandardToStringStyleTest.java:61)

testObject(org.apache.commons.lang3.builder.StandardToStringStyleTest)  Time elapsed: 0 sec  <<< ERROR!
java.lang.IllegalArgumentException: The style must not be null
	at org.apache.commons.lang3.builder.ToStringBuilder.setDefaultStyle(ToStringBuilder.java:12)
	at org.apache.commons.lang3.builder.StandardToStringStyleTest.setUp(StandardToStringStyleTest.java:56)

testObject(org.apache.commons.lang3.builder.StandardToStringStyleTest)  Time elapsed: 0 sec  <<< ERROR!
java.lang.IllegalArgumentException: The style must not be null
	at org.apache.commons.lang3.builder.ToStringBuilder.setDefaultStyle(ToStringBuilder.java:12)
	at org.apache.commons.lang3.builder.StandardToStringStyleTest.tearDown(StandardToStringStyleTest.java:61)

testPerson(org.apache.commons.lang3.builder.StandardToStringStyleTest)  Time elapsed: 0 sec  <<< ERROR!
java.lang.IllegalArgumentException: The style must not be null
	at org.apache.commons.lang3.builder.ToStringBuilder.setDefaultStyle(ToStringBuilder.java:12)
	at org.apache.commons.lang3.builder.StandardToStringStyleTest.setUp(StandardToStringStyleTest.java:56)

testPerson(org.apache.commons.lang3.builder.StandardToStringStyleTest)  Time elapsed: 0 sec  <<< ERROR!
java.lang.IllegalArgumentException: The style must not be null
	at org.apache.commons.lang3.builder.ToStringBuilder.setDefaultStyle(ToStringBuilder.java:12)
	at org.apache.commons.lang3.builder.StandardToStringStyleTest.tearDown(StandardToStringStyleTest.java:61)

testAppendSuper(org.apache.commons.lang3.builder.StandardToStringStyleTest)  Time elapsed: 0 sec  <<< ERROR!
java.lang.IllegalArgumentException: The style must not be null
	at org.apache.commons.lang3.builder.ToStringBuilder.setDefaultStyle(ToStringBuilder.java:12)
	at org.apache.commons.lang3.builder.StandardToStringStyleTest.setUp(StandardToStringStyleTest.java:56)

testAppendSuper(org.apache.commons.lang3.builder.StandardToStringStyleTest)  Time elapsed: 0 sec  <<< ERROR!
java.lang.IllegalArgumentException: The style must not be null
	at org.apache.commons.lang3.builder.ToStringBuilder.setDefaultStyle(ToStringBuilder.java:12)
	at org.apache.commons.lang3.builder.StandardToStringStyleTest.tearDown(StandardToStringStyleTest.java:61)

Running org.apache.commons.lang3.builder.ToStringStyleTest
Tests run: 12, Failures: 0, Errors: 0, Skipped: 0, Time elapsed: 0 sec - in org.apache.commons.lang3.builder.ToStringStyleTest
Running org.apache.commons.lang3.builder.DiffTest
Tests run: 4, Failures: 0, Errors: 0, Skipped: 0, Time elapsed: 0 sec - in org.apache.commons.lang3.builder.DiffTest
Running org.apache.commons.lang3.builder.SimpleToStringStyleTest
Tests run: 16, Failures: 0, Errors: 16, Skipped: 0, Time elapsed: 0.005 sec <<< FAILURE! - in org.apache.commons.lang3.builder.SimpleToStringStyleTest
testObjectArray(org.apache.commons.lang3.builder.SimpleToStringStyleTest)  Time elapsed: 0 sec  <<< ERROR!
java.lang.IllegalArgumentException: The style must not be null
	at org.apache.commons.lang3.builder.ToStringBuilder.setDefaultStyle(ToStringBuilder.java:12)
	at org.apache.commons.lang3.builder.SimpleToStringStyleTest.setUp(SimpleToStringStyleTest.java:40)

testObjectArray(org.apache.commons.lang3.builder.SimpleToStringStyleTest)  Time elapsed: 0 sec  <<< ERROR!
java.lang.IllegalArgumentException: The style must not be null
	at org.apache.commons.lang3.builder.ToStringBuilder.setDefaultStyle(ToStringBuilder.java:12)
	at org.apache.commons.lang3.builder.SimpleToStringStyleTest.tearDown(SimpleToStringStyleTest.java:45)

testBlank(org.apache.commons.lang3.builder.SimpleToStringStyleTest)  Time elapsed: 0 sec  <<< ERROR!
java.lang.IllegalArgumentException: The style must not be null
	at org.apache.commons.lang3.builder.ToStringBuilder.setDefaultStyle(ToStringBuilder.java:12)
	at org.apache.commons.lang3.builder.SimpleToStringStyleTest.setUp(SimpleToStringStyleTest.java:40)

testBlank(org.apache.commons.lang3.builder.SimpleToStringStyleTest)  Time elapsed: 0 sec  <<< ERROR!
java.lang.IllegalArgumentException: The style must not be null
	at org.apache.commons.lang3.builder.ToStringBuilder.setDefaultStyle(ToStringBuilder.java:12)
	at org.apache.commons.lang3.builder.SimpleToStringStyleTest.tearDown(SimpleToStringStyleTest.java:45)

testLong(org.apache.commons.lang3.builder.SimpleToStringStyleTest)  Time elapsed: 0 sec  <<< ERROR!
java.lang.IllegalArgumentException: The style must not be null
	at org.apache.commons.lang3.builder.ToStringBuilder.setDefaultStyle(ToStringBuilder.java:12)
	at org.apache.commons.lang3.builder.SimpleToStringStyleTest.setUp(SimpleToStringStyleTest.java:40)

testLong(org.apache.commons.lang3.builder.SimpleToStringStyleTest)  Time elapsed: 0 sec  <<< ERROR!
java.lang.IllegalArgumentException: The style must not be null
	at org.apache.commons.lang3.builder.ToStringBuilder.setDefaultStyle(ToStringBuilder.java:12)
	at org.apache.commons.lang3.builder.SimpleToStringStyleTest.tearDown(SimpleToStringStyleTest.java:45)

testLongArrayArray(org.apache.commons.lang3.builder.SimpleToStringStyleTest)  Time elapsed: 0 sec  <<< ERROR!
java.lang.IllegalArgumentException: The style must not be null
	at org.apache.commons.lang3.builder.ToStringBuilder.setDefaultStyle(ToStringBuilder.java:12)
	at org.apache.commons.lang3.builder.SimpleToStringStyleTest.setUp(SimpleToStringStyleTest.java:40)

testLongArrayArray(org.apache.commons.lang3.builder.SimpleToStringStyleTest)  Time elapsed: 0 sec  <<< ERROR!
java.lang.IllegalArgumentException: The style must not be null
	at org.apache.commons.lang3.builder.ToStringBuilder.setDefaultStyle(ToStringBuilder.java:12)
	at org.apache.commons.lang3.builder.SimpleToStringStyleTest.tearDown(SimpleToStringStyleTest.java:45)

testLongArray(org.apache.commons.lang3.builder.SimpleToStringStyleTest)  Time elapsed: 0 sec  <<< ERROR!
java.lang.IllegalArgumentException: The style must not be null
	at org.apache.commons.lang3.builder.ToStringBuilder.setDefaultStyle(ToStringBuilder.java:12)
	at org.apache.commons.lang3.builder.SimpleToStringStyleTest.setUp(SimpleToStringStyleTest.java:40)

testLongArray(org.apache.commons.lang3.builder.SimpleToStringStyleTest)  Time elapsed: 0.001 sec  <<< ERROR!
java.lang.IllegalArgumentException: The style must not be null
	at org.apache.commons.lang3.builder.ToStringBuilder.setDefaultStyle(ToStringBuilder.java:12)
	at org.apache.commons.lang3.builder.SimpleToStringStyleTest.tearDown(SimpleToStringStyleTest.java:45)

testObject(org.apache.commons.lang3.builder.SimpleToStringStyleTest)  Time elapsed: 0 sec  <<< ERROR!
java.lang.IllegalArgumentException: The style must not be null
	at org.apache.commons.lang3.builder.ToStringBuilder.setDefaultStyle(ToStringBuilder.java:12)
	at org.apache.commons.lang3.builder.SimpleToStringStyleTest.setUp(SimpleToStringStyleTest.java:40)

testObject(org.apache.commons.lang3.builder.SimpleToStringStyleTest)  Time elapsed: 0 sec  <<< ERROR!
java.lang.IllegalArgumentException: The style must not be null
	at org.apache.commons.lang3.builder.ToStringBuilder.setDefaultStyle(ToStringBuilder.java:12)
	at org.apache.commons.lang3.builder.SimpleToStringStyleTest.tearDown(SimpleToStringStyleTest.java:45)

testPerson(org.apache.commons.lang3.builder.SimpleToStringStyleTest)  Time elapsed: 0.002 sec  <<< ERROR!
java.lang.IllegalArgumentException: The style must not be null
	at org.apache.commons.lang3.builder.ToStringBuilder.setDefaultStyle(ToStringBuilder.java:12)
	at org.apache.commons.lang3.builder.SimpleToStringStyleTest.setUp(SimpleToStringStyleTest.java:40)

testPerson(org.apache.commons.lang3.builder.SimpleToStringStyleTest)  Time elapsed: 0.002 sec  <<< ERROR!
java.lang.IllegalArgumentException: The style must not be null
	at org.apache.commons.lang3.builder.ToStringBuilder.setDefaultStyle(ToStringBuilder.java:12)
	at org.apache.commons.lang3.builder.SimpleToStringStyleTest.tearDown(SimpleToStringStyleTest.java:45)

testAppendSuper(org.apache.commons.lang3.builder.SimpleToStringStyleTest)  Time elapsed: 0 sec  <<< ERROR!
java.lang.IllegalArgumentException: The style must not be null
	at org.apache.commons.lang3.builder.ToStringBuilder.setDefaultStyle(ToStringBuilder.java:12)
	at org.apache.commons.lang3.builder.SimpleToStringStyleTest.setUp(SimpleToStringStyleTest.java:40)

testAppendSuper(org.apache.commons.lang3.builder.SimpleToStringStyleTest)  Time elapsed: 0 sec  <<< ERROR!
java.lang.IllegalArgumentException: The style must not be null
	at org.apache.commons.lang3.builder.ToStringBuilder.setDefaultStyle(ToStringBuilder.java:12)
	at org.apache.commons.lang3.builder.SimpleToStringStyleTest.tearDown(SimpleToStringStyleTest.java:45)

Running org.apache.commons.lang3.builder.MultiLineToStringStyleTest
Tests run: 16, Failures: 0, Errors: 16, Skipped: 0, Time elapsed: 0.005 sec <<< FAILURE! - in org.apache.commons.lang3.builder.MultiLineToStringStyleTest
testObjectArray(org.apache.commons.lang3.builder.MultiLineToStringStyleTest)  Time elapsed: 0 sec  <<< ERROR!
java.lang.IllegalArgumentException: The style must not be null
	at org.apache.commons.lang3.builder.ToStringBuilder.setDefaultStyle(ToStringBuilder.java:12)
	at org.apache.commons.lang3.builder.MultiLineToStringStyleTest.setUp(MultiLineToStringStyleTest.java:42)

testObjectArray(org.apache.commons.lang3.builder.MultiLineToStringStyleTest)  Time elapsed: 0 sec  <<< ERROR!
java.lang.IllegalArgumentException: The style must not be null
	at org.apache.commons.lang3.builder.ToStringBuilder.setDefaultStyle(ToStringBuilder.java:12)
	at org.apache.commons.lang3.builder.MultiLineToStringStyleTest.tearDown(MultiLineToStringStyleTest.java:47)

testBlank(org.apache.commons.lang3.builder.MultiLineToStringStyleTest)  Time elapsed: 0 sec  <<< ERROR!
java.lang.IllegalArgumentException: The style must not be null
	at org.apache.commons.lang3.builder.ToStringBuilder.setDefaultStyle(ToStringBuilder.java:12)
	at org.apache.commons.lang3.builder.MultiLineToStringStyleTest.setUp(MultiLineToStringStyleTest.java:42)

testBlank(org.apache.commons.lang3.builder.MultiLineToStringStyleTest)  Time elapsed: 0 sec  <<< ERROR!
java.lang.IllegalArgumentException: The style must not be null
	at org.apache.commons.lang3.builder.ToStringBuilder.setDefaultStyle(ToStringBuilder.java:12)
	at org.apache.commons.lang3.builder.MultiLineToStringStyleTest.tearDown(MultiLineToStringStyleTest.java:47)

testLong(org.apache.commons.lang3.builder.MultiLineToStringStyleTest)  Time elapsed: 0 sec  <<< ERROR!
java.lang.IllegalArgumentException: The style must not be null
	at org.apache.commons.lang3.builder.ToStringBuilder.setDefaultStyle(ToStringBuilder.java:12)
	at org.apache.commons.lang3.builder.MultiLineToStringStyleTest.setUp(MultiLineToStringStyleTest.java:42)

testLong(org.apache.commons.lang3.builder.MultiLineToStringStyleTest)  Time elapsed: 0 sec  <<< ERROR!
java.lang.IllegalArgumentException: The style must not be null
	at org.apache.commons.lang3.builder.ToStringBuilder.setDefaultStyle(ToStringBuilder.java:12)
	at org.apache.commons.lang3.builder.MultiLineToStringStyleTest.tearDown(MultiLineToStringStyleTest.java:47)

testLongArrayArray(org.apache.commons.lang3.builder.MultiLineToStringStyleTest)  Time elapsed: 0 sec  <<< ERROR!
java.lang.IllegalArgumentException: The style must not be null
	at org.apache.commons.lang3.builder.ToStringBuilder.setDefaultStyle(ToStringBuilder.java:12)
	at org.apache.commons.lang3.builder.MultiLineToStringStyleTest.setUp(MultiLineToStringStyleTest.java:42)

testLongArrayArray(org.apache.commons.lang3.builder.MultiLineToStringStyleTest)  Time elapsed: 0.005 sec  <<< ERROR!
java.lang.IllegalArgumentException: The style must not be null
	at org.apache.commons.lang3.builder.ToStringBuilder.setDefaultStyle(ToStringBuilder.java:12)
	at org.apache.commons.lang3.builder.MultiLineToStringStyleTest.tearDown(MultiLineToStringStyleTest.java:47)

testLongArray(org.apache.commons.lang3.builder.MultiLineToStringStyleTest)  Time elapsed: 0 sec  <<< ERROR!
java.lang.IllegalArgumentException: The style must not be null
	at org.apache.commons.lang3.builder.ToStringBuilder.setDefaultStyle(ToStringBuilder.java:12)
	at org.apache.commons.lang3.builder.MultiLineToStringStyleTest.setUp(MultiLineToStringStyleTest.java:42)

testLongArray(org.apache.commons.lang3.builder.MultiLineToStringStyleTest)  Time elapsed: 0 sec  <<< ERROR!
java.lang.IllegalArgumentException: The style must not be null
	at org.apache.commons.lang3.builder.ToStringBuilder.setDefaultStyle(ToStringBuilder.java:12)
	at org.apache.commons.lang3.builder.MultiLineToStringStyleTest.tearDown(MultiLineToStringStyleTest.java:47)

testObject(org.apache.commons.lang3.builder.MultiLineToStringStyleTest)  Time elapsed: 0 sec  <<< ERROR!
java.lang.IllegalArgumentException: The style must not be null
	at org.apache.commons.lang3.builder.ToStringBuilder.setDefaultStyle(ToStringBuilder.java:12)
	at org.apache.commons.lang3.builder.MultiLineToStringStyleTest.setUp(MultiLineToStringStyleTest.java:42)

testObject(org.apache.commons.lang3.builder.MultiLineToStringStyleTest)  Time elapsed: 0 sec  <<< ERROR!
java.lang.IllegalArgumentException: The style must not be null
	at org.apache.commons.lang3.builder.ToStringBuilder.setDefaultStyle(ToStringBuilder.java:12)
	at org.apache.commons.lang3.builder.MultiLineToStringStyleTest.tearDown(MultiLineToStringStyleTest.java:47)

testPerson(org.apache.commons.lang3.builder.MultiLineToStringStyleTest)  Time elapsed: 0 sec  <<< ERROR!
java.lang.IllegalArgumentException: The style must not be null
	at org.apache.commons.lang3.builder.ToStringBuilder.setDefaultStyle(ToStringBuilder.java:12)
	at org.apache.commons.lang3.builder.MultiLineToStringStyleTest.setUp(MultiLineToStringStyleTest.java:42)

testPerson(org.apache.commons.lang3.builder.MultiLineToStringStyleTest)  Time elapsed: 0 sec  <<< ERROR!
java.lang.IllegalArgumentException: The style must not be null
	at org.apache.commons.lang3.builder.ToStringBuilder.setDefaultStyle(ToStringBuilder.java:12)
	at org.apache.commons.lang3.builder.MultiLineToStringStyleTest.tearDown(MultiLineToStringStyleTest.java:47)

testAppendSuper(org.apache.commons.lang3.builder.MultiLineToStringStyleTest)  Time elapsed: 0 sec  <<< ERROR!
java.lang.IllegalArgumentException: The style must not be null
	at org.apache.commons.lang3.builder.ToStringBuilder.setDefaultStyle(ToStringBuilder.java:12)
	at org.apache.commons.lang3.builder.MultiLineToStringStyleTest.setUp(MultiLineToStringStyleTest.java:42)

testAppendSuper(org.apache.commons.lang3.builder.MultiLineToStringStyleTest)  Time elapsed: 0 sec  <<< ERROR!
java.lang.IllegalArgumentException: The style must not be null
	at org.apache.commons.lang3.builder.ToStringBuilder.setDefaultStyle(ToStringBuilder.java:12)
	at org.apache.commons.lang3.builder.MultiLineToStringStyleTest.tearDown(MultiLineToStringStyleTest.java:47)

Running org.apache.commons.lang3.builder.ToStringStyleConcurrencyTest
Tests run: 3, Failures: 0, Errors: 0, Skipped: 0, Time elapsed: 4.21 sec - in org.apache.commons.lang3.builder.ToStringStyleConcurrencyTest
Running org.apache.commons.lang3.builder.ReflectionToStringBuilderMutateInspectConcurrencyTest
Tests run: 1, Failures: 0, Errors: 0, Skipped: 1, Time elapsed: 0.001 sec - in org.apache.commons.lang3.builder.ReflectionToStringBuilderMutateInspectConcurrencyTest
Running org.apache.commons.lang3.builder.ToStringBuilderTest
Tests run: 74, Failures: 1, Errors: 16, Skipped: 1, Time elapsed: 0.058 sec <<< FAILURE! - in org.apache.commons.lang3.builder.ToStringBuilderTest
testSetDefaultEx(org.apache.commons.lang3.builder.ToStringBuilderTest)  Time elapsed: 0.001 sec  <<< FAILURE!
java.lang.AssertionError: Expected exception: java.lang.IllegalArgumentException
	at org.junit.internal.runners.statements.ExpectException.evaluate(ExpectException.java:32)
	at org.junit.internal.runners.statements.RunAfters.evaluate(RunAfters.java:27)
	at org.junit.runners.ParentRunner.runLeaf(ParentRunner.java:325)
	at org.junit.runners.BlockJUnit4ClassRunner.runChild(BlockJUnit4ClassRunner.java:78)
	at org.junit.runners.BlockJUnit4ClassRunner.runChild(BlockJUnit4ClassRunner.java:57)
	at org.junit.runners.ParentRunner$3.run(ParentRunner.java:290)
	at org.junit.runners.ParentRunner$1.schedule(ParentRunner.java:71)
	at org.junit.runners.ParentRunner.runChildren(ParentRunner.java:288)
	at org.junit.runners.ParentRunner.access$000(ParentRunner.java:58)
	at org.junit.runners.ParentRunner$2.evaluate(ParentRunner.java:268)
	at org.junit.runners.ParentRunner.run(ParentRunner.java:363)
	at org.apache.maven.surefire.junit4.JUnit4Provider.execute(JUnit4Provider.java:283)
	at org.apache.maven.surefire.junit4.JUnit4Provider.executeWithRerun(JUnit4Provider.java:173)
	at org.apache.maven.surefire.junit4.JUnit4Provider.executeTestSet(JUnit4Provider.java:153)
	at org.apache.maven.surefire.junit4.JUnit4Provider.invoke(JUnit4Provider.java:128)
	at org.apache.maven.surefire.booter.ForkedBooter.invokeProviderInSameClassLoader(ForkedBooter.java:203)
	at org.apache.maven.surefire.booter.ForkedBooter.runSuitesInProcess(ForkedBooter.java:155)
	at org.apache.maven.surefire.booter.ForkedBooter.main(ForkedBooter.java:103)

testReflectionCharArrayArray(org.apache.commons.lang3.builder.ToStringBuilderTest)  Time elapsed: 0 sec  <<< ERROR!
java.lang.NullPointerException: null
	at org.apache.commons.lang3.builder.ToStringBuilder.<init>(ToStringBuilder.java:28)
	at org.apache.commons.lang3.builder.ReflectionToStringBuilder.<init>(ReflectionToStringBuilder.java:461)
	at org.apache.commons.lang3.builder.ReflectionToStringBuilder.toString(ReflectionToStringBuilder.java:287)
	at org.apache.commons.lang3.builder.ReflectionToStringBuilder.toString(ReflectionToStringBuilder.java:118)
	at org.apache.commons.lang3.builder.ToStringBuilder.reflectionToString(ToStringBuilder.java:14)
	at org.apache.commons.lang3.builder.ToStringBuilderTest.testReflectionCharArrayArray(ToStringBuilderTest.java:289)

testIntArray(org.apache.commons.lang3.builder.ToStringBuilderTest)  Time elapsed: 0 sec  <<< ERROR!
java.lang.NullPointerException: null
	at org.apache.commons.lang3.builder.ToStringBuilder.<init>(ToStringBuilder.java:28)
	at org.apache.commons.lang3.builder.ToStringBuilder.<init>(ToStringBuilder.java:21)
	at org.apache.commons.lang3.builder.ToStringBuilderTest.testIntArray(ToStringBuilderTest.java:737)

testDouble(org.apache.commons.lang3.builder.ToStringBuilderTest)  Time elapsed: 0 sec  <<< ERROR!
java.lang.NullPointerException: null
	at org.apache.commons.lang3.builder.ToStringBuilder.<init>(ToStringBuilder.java:28)
	at org.apache.commons.lang3.builder.ToStringBuilder.<init>(ToStringBuilder.java:21)
	at org.apache.commons.lang3.builder.ToStringBuilderTest.testDouble(ToStringBuilderTest.java:694)

testByteArrayArray(org.apache.commons.lang3.builder.ToStringBuilderTest)  Time elapsed: 0 sec  <<< ERROR!
java.lang.NullPointerException: null
	at org.apache.commons.lang3.builder.ToStringBuilder.<init>(ToStringBuilder.java:28)
	at org.apache.commons.lang3.builder.ToStringBuilder.<init>(ToStringBuilder.java:21)
	at org.apache.commons.lang3.builder.ToStringBuilderTest.testByteArrayArray(ToStringBuilderTest.java:837)

testReflectionShortArray(org.apache.commons.lang3.builder.ToStringBuilderTest)  Time elapsed: 0.001 sec  <<< ERROR!
java.lang.NullPointerException: null
	at org.apache.commons.lang3.builder.ToStringBuilder.<init>(ToStringBuilder.java:28)
	at org.apache.commons.lang3.builder.ReflectionToStringBuilder.<init>(ReflectionToStringBuilder.java:461)
	at org.apache.commons.lang3.builder.ReflectionToStringBuilder.toString(ReflectionToStringBuilder.java:287)
	at org.apache.commons.lang3.builder.ReflectionToStringBuilder.toString(ReflectionToStringBuilder.java:118)
	at org.apache.commons.lang3.builder.ToStringBuilder.reflectionToString(ToStringBuilder.java:14)
	at org.apache.commons.lang3.builder.ToStringBuilderTest.testReflectionShortArray(ToStringBuilderTest.java:187)

testCharArrayArray(org.apache.commons.lang3.builder.ToStringBuilderTest)  Time elapsed: 0 sec  <<< ERROR!
java.lang.NullPointerException: null
	at org.apache.commons.lang3.builder.ToStringBuilder.<init>(ToStringBuilder.java:28)
	at org.apache.commons.lang3.builder.ToStringBuilder.<init>(ToStringBuilder.java:21)
	at org.apache.commons.lang3.builder.ToStringBuilderTest.testCharArrayArray(ToStringBuilderTest.java:847)

testSelfInstanceVarReflectionObjectCycle(org.apache.commons.lang3.builder.ToStringBuilderTest)  Time elapsed: 0.001 sec  <<< ERROR!
java.lang.NullPointerException: null
	at org.apache.commons.lang3.builder.ToStringBuilder.<init>(ToStringBuilder.java:28)
	at org.apache.commons.lang3.builder.ReflectionToStringBuilder.<init>(ReflectionToStringBuilder.java:461)
	at org.apache.commons.lang3.builder.ReflectionToStringBuilder.toString(ReflectionToStringBuilder.java:287)
	at org.apache.commons.lang3.builder.ReflectionToStringBuilder.toString(ReflectionToStringBuilder.java:118)
	at org.apache.commons.lang3.builder.ToStringBuilder.reflectionToString(ToStringBuilder.java:14)
	at org.apache.commons.lang3.builder.ToStringBuilderTest$SelfInstanceVarReflectionTestFixture.toString(ToStringBuilderTest.java:499)
	at org.apache.commons.lang3.builder.ToStringBuilderTest.testSelfInstanceVarReflectionObjectCycle(ToStringBuilderTest.java:539)

testObject(org.apache.commons.lang3.builder.ToStringBuilderTest)  Time elapsed: 0.001 sec  <<< ERROR!
java.lang.NullPointerException: null
	at org.apache.commons.lang3.builder.ToStringBuilder.<init>(ToStringBuilder.java:28)
	at org.apache.commons.lang3.builder.ToStringBuilder.<init>(ToStringBuilder.java:21)
	at org.apache.commons.lang3.builder.ToStringBuilderTest.testObject(ToStringBuilderTest.java:623)

testAppendSuper(org.apache.commons.lang3.builder.ToStringBuilderTest)  Time elapsed: 0 sec  <<< ERROR!
java.lang.NullPointerException: null
	at org.apache.commons.lang3.builder.ToStringBuilder.<init>(ToStringBuilder.java:28)
	at org.apache.commons.lang3.builder.ToStringBuilder.<init>(ToStringBuilder.java:21)
	at org.apache.commons.lang3.builder.ToStringBuilderTest.testAppendSuper(ToStringBuilderTest.java:601)

testReflectionIntArray(org.apache.commons.lang3.builder.ToStringBuilderTest)  Time elapsed: 0.001 sec  <<< ERROR!
java.lang.NullPointerException: null
	at org.apache.commons.lang3.builder.ToStringBuilder.<init>(ToStringBuilder.java:28)
	at org.apache.commons.lang3.builder.ReflectionToStringBuilder.<init>(ReflectionToStringBuilder.java:461)
	at org.apache.commons.lang3.builder.ReflectionToStringBuilder.toString(ReflectionToStringBuilder.java:287)
	at org.apache.commons.lang3.builder.ReflectionToStringBuilder.toString(ReflectionToStringBuilder.java:118)
	at org.apache.commons.lang3.builder.ToStringBuilder.reflectionToString(ToStringBuilder.java:14)
	at org.apache.commons.lang3.builder.ToStringBuilderTest.testReflectionIntArray(ToStringBuilderTest.java:178)

testReflectionCharArray(org.apache.commons.lang3.builder.ToStringBuilderTest)  Time elapsed: 0 sec  <<< ERROR!
java.lang.NullPointerException: null
	at org.apache.commons.lang3.builder.ToStringBuilder.<init>(ToStringBuilder.java:28)
	at org.apache.commons.lang3.builder.ReflectionToStringBuilder.<init>(ReflectionToStringBuilder.java:461)
	at org.apache.commons.lang3.builder.ReflectionToStringBuilder.toString(ReflectionToStringBuilder.java:287)
	at org.apache.commons.lang3.builder.ReflectionToStringBuilder.toString(ReflectionToStringBuilder.java:118)
	at org.apache.commons.lang3.builder.ToStringBuilder.reflectionToString(ToStringBuilder.java:14)
	at org.apache.commons.lang3.builder.ToStringBuilderTest.testReflectionCharArray(ToStringBuilderTest.java:205)

testGetSetDefault(org.apache.commons.lang3.builder.ToStringBuilderTest)  Time elapsed: 0.001 sec  <<< ERROR!
java.lang.IllegalArgumentException: The style must not be null
	at org.apache.commons.lang3.builder.ToStringBuilder.setDefaultStyle(ToStringBuilder.java:12)
	at org.apache.commons.lang3.builder.ToStringBuilderTest.testGetSetDefault(ToStringBuilderTest.java:78)

testInnerClassReflection(org.apache.commons.lang3.builder.ToStringBuilderTest)  Time elapsed: 0.001 sec  <<< ERROR!
java.lang.NullPointerException: null
	at org.apache.commons.lang3.builder.ToStringBuilder.<init>(ToStringBuilder.java:28)
	at org.apache.commons.lang3.builder.ReflectionToStringBuilder.<init>(ReflectionToStringBuilder.java:461)
	at org.apache.commons.lang3.builder.ReflectionToStringBuilder.toString(ReflectionToStringBuilder.java:287)
	at org.apache.commons.lang3.builder.ReflectionToStringBuilder.toString(ReflectionToStringBuilder.java:118)
	at org.apache.commons.lang3.builder.ToStringBuilder.reflectionToString(ToStringBuilder.java:14)
	at org.apache.commons.lang3.builder.ToStringBuilderTest$Outer.toString(ToStringBuilderTest.java:389)
	at org.apache.commons.lang3.builder.ToStringBuilderTest.testInnerClassReflection(ToStringBuilderTest.java:376)

testReflectionCharacter(org.apache.commons.lang3.builder.ToStringBuilderTest)  Time elapsed: 0.001 sec  <<< ERROR!
java.lang.NullPointerException: null
	at org.apache.commons.lang3.builder.ToStringBuilder.<init>(ToStringBuilder.java:28)
	at org.apache.commons.lang3.builder.ReflectionToStringBuilder.<init>(ReflectionToStringBuilder.java:461)
	at org.apache.commons.lang3.builder.ReflectionToStringBuilder.toString(ReflectionToStringBuilder.java:287)
	at org.apache.commons.lang3.builder.ReflectionToStringBuilder.toString(ReflectionToStringBuilder.java:118)
	at org.apache.commons.lang3.builder.ToStringBuilder.reflectionToString(ToStringBuilder.java:14)
	at org.apache.commons.lang3.builder.ToStringBuilderTest.testReflectionCharacter(ToStringBuilderTest.java:106)

testDoubleArray(org.apache.commons.lang3.builder.ToStringBuilderTest)  Time elapsed: 0 sec  <<< ERROR!
java.lang.NullPointerException: null
	at org.apache.commons.lang3.builder.ToStringBuilder.<init>(ToStringBuilder.java:28)
	at org.apache.commons.lang3.builder.ToStringBuilder.<init>(ToStringBuilder.java:21)
	at org.apache.commons.lang3.builder.ToStringBuilderTest.testDoubleArray(ToStringBuilderTest.java:777)

testReflectionFloatArrayArray(org.apache.commons.lang3.builder.ToStringBuilderTest)  Time elapsed: 0.001 sec  <<< ERROR!
java.lang.NullPointerException: null
	at org.apache.commons.lang3.builder.ToStringBuilder.<init>(ToStringBuilder.java:28)
	at org.apache.commons.lang3.builder.ReflectionToStringBuilder.<init>(ReflectionToStringBuilder.java:461)
	at org.apache.commons.lang3.builder.ReflectionToStringBuilder.toString(ReflectionToStringBuilder.java:287)
	at org.apache.commons.lang3.builder.ReflectionToStringBuilder.toString(ReflectionToStringBuilder.java:118)
	at org.apache.commons.lang3.builder.ToStringBuilder.reflectionToString(ToStringBuilder.java:14)
	at org.apache.commons.lang3.builder.ToStringBuilderTest.testReflectionFloatArrayArray(ToStringBuilderTest.java:243)

Running org.apache.commons.lang3.builder.EqualsBuilderTest
Tests run: 48, Failures: 0, Errors: 0, Skipped: 0, Time elapsed: 0.023 sec - in org.apache.commons.lang3.builder.EqualsBuilderTest
Running org.apache.commons.lang3.builder.HashCodeBuilderAndEqualsBuilderTest
Tests run: 4, Failures: 0, Errors: 0, Skipped: 0, Time elapsed: 0.008 sec - in org.apache.commons.lang3.builder.HashCodeBuilderAndEqualsBuilderTest
Running org.apache.commons.lang3.builder.ReflectionToStringBuilderConcurrencyTest
Tests run: 3, Failures: 0, Errors: 0, Skipped: 3, Time elapsed: 0 sec - in org.apache.commons.lang3.builder.ReflectionToStringBuilderConcurrencyTest
Running org.apache.commons.lang3.builder.JsonToStringStyleTest
Tests run: 18, Failures: 0, Errors: 18, Skipped: 0, Time elapsed: 0.005 sec <<< FAILURE! - in org.apache.commons.lang3.builder.JsonToStringStyleTest
testObjectArray(org.apache.commons.lang3.builder.JsonToStringStyleTest)  Time elapsed: 0 sec  <<< ERROR!
java.lang.IllegalArgumentException: The style must not be null
	at org.apache.commons.lang3.builder.ToStringBuilder.setDefaultStyle(ToStringBuilder.java:12)
	at org.apache.commons.lang3.builder.JsonToStringStyleTest.setUp(JsonToStringStyleTest.java:42)

testObjectArray(org.apache.commons.lang3.builder.JsonToStringStyleTest)  Time elapsed: 0 sec  <<< ERROR!
java.lang.IllegalArgumentException: The style must not be null
	at org.apache.commons.lang3.builder.ToStringBuilder.setDefaultStyle(ToStringBuilder.java:12)
	at org.apache.commons.lang3.builder.JsonToStringStyleTest.tearDown(JsonToStringStyleTest.java:47)

testBlank(org.apache.commons.lang3.builder.JsonToStringStyleTest)  Time elapsed: 0 sec  <<< ERROR!
java.lang.IllegalArgumentException: The style must not be null
	at org.apache.commons.lang3.builder.ToStringBuilder.setDefaultStyle(ToStringBuilder.java:12)
	at org.apache.commons.lang3.builder.JsonToStringStyleTest.setUp(JsonToStringStyleTest.java:42)

testBlank(org.apache.commons.lang3.builder.JsonToStringStyleTest)  Time elapsed: 0.001 sec  <<< ERROR!
java.lang.IllegalArgumentException: The style must not be null
	at org.apache.commons.lang3.builder.ToStringBuilder.setDefaultStyle(ToStringBuilder.java:12)
	at org.apache.commons.lang3.builder.JsonToStringStyleTest.tearDown(JsonToStringStyleTest.java:47)

testLong(org.apache.commons.lang3.builder.JsonToStringStyleTest)  Time elapsed: 0 sec  <<< ERROR!
java.lang.IllegalArgumentException: The style must not be null
	at org.apache.commons.lang3.builder.ToStringBuilder.setDefaultStyle(ToStringBuilder.java:12)
	at org.apache.commons.lang3.builder.JsonToStringStyleTest.setUp(JsonToStringStyleTest.java:42)

testLong(org.apache.commons.lang3.builder.JsonToStringStyleTest)  Time elapsed: 0 sec  <<< ERROR!
java.lang.IllegalArgumentException: The style must not be null
	at org.apache.commons.lang3.builder.ToStringBuilder.setDefaultStyle(ToStringBuilder.java:12)
	at org.apache.commons.lang3.builder.JsonToStringStyleTest.tearDown(JsonToStringStyleTest.java:47)

testNull(org.apache.commons.lang3.builder.JsonToStringStyleTest)  Time elapsed: 0 sec  <<< ERROR!
java.lang.IllegalArgumentException: The style must not be null
	at org.apache.commons.lang3.builder.ToStringBuilder.setDefaultStyle(ToStringBuilder.java:12)
	at org.apache.commons.lang3.builder.JsonToStringStyleTest.setUp(JsonToStringStyleTest.java:42)

testNull(org.apache.commons.lang3.builder.JsonToStringStyleTest)  Time elapsed: 0.001 sec  <<< ERROR!
java.lang.IllegalArgumentException: The style must not be null
	at org.apache.commons.lang3.builder.ToStringBuilder.setDefaultStyle(ToStringBuilder.java:12)
	at org.apache.commons.lang3.builder.JsonToStringStyleTest.tearDown(JsonToStringStyleTest.java:47)

testLongArrayArray(org.apache.commons.lang3.builder.JsonToStringStyleTest)  Time elapsed: 0 sec  <<< ERROR!
java.lang.IllegalArgumentException: The style must not be null
	at org.apache.commons.lang3.builder.ToStringBuilder.setDefaultStyle(ToStringBuilder.java:12)
	at org.apache.commons.lang3.builder.JsonToStringStyleTest.setUp(JsonToStringStyleTest.java:42)

testLongArrayArray(org.apache.commons.lang3.builder.JsonToStringStyleTest)  Time elapsed: 0 sec  <<< ERROR!
java.lang.IllegalArgumentException: The style must not be null
	at org.apache.commons.lang3.builder.ToStringBuilder.setDefaultStyle(ToStringBuilder.java:12)
	at org.apache.commons.lang3.builder.JsonToStringStyleTest.tearDown(JsonToStringStyleTest.java:47)

testLongArray(org.apache.commons.lang3.builder.JsonToStringStyleTest)  Time elapsed: 0.001 sec  <<< ERROR!
java.lang.IllegalArgumentException: The style must not be null
	at org.apache.commons.lang3.builder.ToStringBuilder.setDefaultStyle(ToStringBuilder.java:12)
	at org.apache.commons.lang3.builder.JsonToStringStyleTest.setUp(JsonToStringStyleTest.java:42)

testLongArray(org.apache.commons.lang3.builder.JsonToStringStyleTest)  Time elapsed: 0.001 sec  <<< ERROR!
java.lang.IllegalArgumentException: The style must not be null
	at org.apache.commons.lang3.builder.ToStringBuilder.setDefaultStyle(ToStringBuilder.java:12)
	at org.apache.commons.lang3.builder.JsonToStringStyleTest.tearDown(JsonToStringStyleTest.java:47)

testObject(org.apache.commons.lang3.builder.JsonToStringStyleTest)  Time elapsed: 0 sec  <<< ERROR!
java.lang.IllegalArgumentException: The style must not be null
	at org.apache.commons.lang3.builder.ToStringBuilder.setDefaultStyle(ToStringBuilder.java:12)
	at org.apache.commons.lang3.builder.JsonToStringStyleTest.setUp(JsonToStringStyleTest.java:42)

testObject(org.apache.commons.lang3.builder.JsonToStringStyleTest)  Time elapsed: 0 sec  <<< ERROR!
java.lang.IllegalArgumentException: The style must not be null
	at org.apache.commons.lang3.builder.ToStringBuilder.setDefaultStyle(ToStringBuilder.java:12)
	at org.apache.commons.lang3.builder.JsonToStringStyleTest.tearDown(JsonToStringStyleTest.java:47)

testPerson(org.apache.commons.lang3.builder.JsonToStringStyleTest)  Time elapsed: 0.001 sec  <<< ERROR!
java.lang.IllegalArgumentException: The style must not be null
	at org.apache.commons.lang3.builder.ToStringBuilder.setDefaultStyle(ToStringBuilder.java:12)
	at org.apache.commons.lang3.builder.JsonToStringStyleTest.setUp(JsonToStringStyleTest.java:42)

testPerson(org.apache.commons.lang3.builder.JsonToStringStyleTest)  Time elapsed: 0.001 sec  <<< ERROR!
java.lang.IllegalArgumentException: The style must not be null
	at org.apache.commons.lang3.builder.ToStringBuilder.setDefaultStyle(ToStringBuilder.java:12)
	at org.apache.commons.lang3.builder.JsonToStringStyleTest.tearDown(JsonToStringStyleTest.java:47)

testAppendSuper(org.apache.commons.lang3.builder.JsonToStringStyleTest)  Time elapsed: 0 sec  <<< ERROR!
java.lang.IllegalArgumentException: The style must not be null
	at org.apache.commons.lang3.builder.ToStringBuilder.setDefaultStyle(ToStringBuilder.java:12)
	at org.apache.commons.lang3.builder.JsonToStringStyleTest.setUp(JsonToStringStyleTest.java:42)

testAppendSuper(org.apache.commons.lang3.builder.JsonToStringStyleTest)  Time elapsed: 0 sec  <<< ERROR!
java.lang.IllegalArgumentException: The style must not be null
	at org.apache.commons.lang3.builder.ToStringBuilder.setDefaultStyle(ToStringBuilder.java:12)
	at org.apache.commons.lang3.builder.JsonToStringStyleTest.tearDown(JsonToStringStyleTest.java:47)

Running org.apache.commons.lang3.builder.NoClassNameToStringStyleTest
Tests run: 16, Failures: 0, Errors: 16, Skipped: 0, Time elapsed: 0.001 sec <<< FAILURE! - in org.apache.commons.lang3.builder.NoClassNameToStringStyleTest
testObjectArray(org.apache.commons.lang3.builder.NoClassNameToStringStyleTest)  Time elapsed: 0 sec  <<< ERROR!
java.lang.IllegalArgumentException: The style must not be null
	at org.apache.commons.lang3.builder.ToStringBuilder.setDefaultStyle(ToStringBuilder.java:12)
	at org.apache.commons.lang3.builder.NoClassNameToStringStyleTest.setUp(NoClassNameToStringStyleTest.java:40)

testObjectArray(org.apache.commons.lang3.builder.NoClassNameToStringStyleTest)  Time elapsed: 0 sec  <<< ERROR!
java.lang.IllegalArgumentException: The style must not be null
	at org.apache.commons.lang3.builder.ToStringBuilder.setDefaultStyle(ToStringBuilder.java:12)
	at org.apache.commons.lang3.builder.NoClassNameToStringStyleTest.tearDown(NoClassNameToStringStyleTest.java:45)

testBlank(org.apache.commons.lang3.builder.NoClassNameToStringStyleTest)  Time elapsed: 0.001 sec  <<< ERROR!
java.lang.IllegalArgumentException: The style must not be null
	at org.apache.commons.lang3.builder.ToStringBuilder.setDefaultStyle(ToStringBuilder.java:12)
	at org.apache.commons.lang3.builder.NoClassNameToStringStyleTest.setUp(NoClassNameToStringStyleTest.java:40)

testBlank(org.apache.commons.lang3.builder.NoClassNameToStringStyleTest)  Time elapsed: 0.001 sec  <<< ERROR!
java.lang.IllegalArgumentException: The style must not be null
	at org.apache.commons.lang3.builder.ToStringBuilder.setDefaultStyle(ToStringBuilder.java:12)
	at org.apache.commons.lang3.builder.NoClassNameToStringStyleTest.tearDown(NoClassNameToStringStyleTest.java:45)

testLong(org.apache.commons.lang3.builder.NoClassNameToStringStyleTest)  Time elapsed: 0 sec  <<< ERROR!
java.lang.IllegalArgumentException: The style must not be null
	at org.apache.commons.lang3.builder.ToStringBuilder.setDefaultStyle(ToStringBuilder.java:12)
	at org.apache.commons.lang3.builder.NoClassNameToStringStyleTest.setUp(NoClassNameToStringStyleTest.java:40)

testLong(org.apache.commons.lang3.builder.NoClassNameToStringStyleTest)  Time elapsed: 0 sec  <<< ERROR!
java.lang.IllegalArgumentException: The style must not be null
	at org.apache.commons.lang3.builder.ToStringBuilder.setDefaultStyle(ToStringBuilder.java:12)
	at org.apache.commons.lang3.builder.NoClassNameToStringStyleTest.tearDown(NoClassNameToStringStyleTest.java:45)

testLongArrayArray(org.apache.commons.lang3.builder.NoClassNameToStringStyleTest)  Time elapsed: 0 sec  <<< ERROR!
java.lang.IllegalArgumentException: The style must not be null
	at org.apache.commons.lang3.builder.ToStringBuilder.setDefaultStyle(ToStringBuilder.java:12)
	at org.apache.commons.lang3.builder.NoClassNameToStringStyleTest.setUp(NoClassNameToStringStyleTest.java:40)

testLongArrayArray(org.apache.commons.lang3.builder.NoClassNameToStringStyleTest)  Time elapsed: 0 sec  <<< ERROR!
java.lang.IllegalArgumentException: The style must not be null
	at org.apache.commons.lang3.builder.ToStringBuilder.setDefaultStyle(ToStringBuilder.java:12)
	at org.apache.commons.lang3.builder.NoClassNameToStringStyleTest.tearDown(NoClassNameToStringStyleTest.java:45)

testLongArray(org.apache.commons.lang3.builder.NoClassNameToStringStyleTest)  Time elapsed: 0 sec  <<< ERROR!
java.lang.IllegalArgumentException: The style must not be null
	at org.apache.commons.lang3.builder.ToStringBuilder.setDefaultStyle(ToStringBuilder.java:12)
	at org.apache.commons.lang3.builder.NoClassNameToStringStyleTest.setUp(NoClassNameToStringStyleTest.java:40)

testLongArray(org.apache.commons.lang3.builder.NoClassNameToStringStyleTest)  Time elapsed: 0 sec  <<< ERROR!
java.lang.IllegalArgumentException: The style must not be null
	at org.apache.commons.lang3.builder.ToStringBuilder.setDefaultStyle(ToStringBuilder.java:12)
	at org.apache.commons.lang3.builder.NoClassNameToStringStyleTest.tearDown(NoClassNameToStringStyleTest.java:45)

testObject(org.apache.commons.lang3.builder.NoClassNameToStringStyleTest)  Time elapsed: 0 sec  <<< ERROR!
java.lang.IllegalArgumentException: The style must not be null
	at org.apache.commons.lang3.builder.ToStringBuilder.setDefaultStyle(ToStringBuilder.java:12)
	at org.apache.commons.lang3.builder.NoClassNameToStringStyleTest.setUp(NoClassNameToStringStyleTest.java:40)

testObject(org.apache.commons.lang3.builder.NoClassNameToStringStyleTest)  Time elapsed: 0 sec  <<< ERROR!
java.lang.IllegalArgumentException: The style must not be null
	at org.apache.commons.lang3.builder.ToStringBuilder.setDefaultStyle(ToStringBuilder.java:12)
	at org.apache.commons.lang3.builder.NoClassNameToStringStyleTest.tearDown(NoClassNameToStringStyleTest.java:45)

testPerson(org.apache.commons.lang3.builder.NoClassNameToStringStyleTest)  Time elapsed: 0 sec  <<< ERROR!
java.lang.IllegalArgumentException: The style must not be null
	at org.apache.commons.lang3.builder.ToStringBuilder.setDefaultStyle(ToStringBuilder.java:12)
	at org.apache.commons.lang3.builder.NoClassNameToStringStyleTest.setUp(NoClassNameToStringStyleTest.java:40)

testPerson(org.apache.commons.lang3.builder.NoClassNameToStringStyleTest)  Time elapsed: 0 sec  <<< ERROR!
java.lang.IllegalArgumentException: The style must not be null
	at org.apache.commons.lang3.builder.ToStringBuilder.setDefaultStyle(ToStringBuilder.java:12)
	at org.apache.commons.lang3.builder.NoClassNameToStringStyleTest.tearDown(NoClassNameToStringStyleTest.java:45)

testAppendSuper(org.apache.commons.lang3.builder.NoClassNameToStringStyleTest)  Time elapsed: 0 sec  <<< ERROR!
java.lang.IllegalArgumentException: The style must not be null
	at org.apache.commons.lang3.builder.ToStringBuilder.setDefaultStyle(ToStringBuilder.java:12)
	at org.apache.commons.lang3.builder.NoClassNameToStringStyleTest.setUp(NoClassNameToStringStyleTest.java:40)

testAppendSuper(org.apache.commons.lang3.builder.NoClassNameToStringStyleTest)  Time elapsed: 0 sec  <<< ERROR!
java.lang.IllegalArgumentException: The style must not be null
	at org.apache.commons.lang3.builder.ToStringBuilder.setDefaultStyle(ToStringBuilder.java:12)
	at org.apache.commons.lang3.builder.NoClassNameToStringStyleTest.tearDown(NoClassNameToStringStyleTest.java:45)

Running org.apache.commons.lang3.builder.DiffBuilderTest
Tests run: 30, Failures: 0, Errors: 0, Skipped: 0, Time elapsed: 0.015 sec - in org.apache.commons.lang3.builder.DiffBuilderTest
Running org.apache.commons.lang3.builder.HashCodeBuilderTest
Tests run: 44, Failures: 0, Errors: 0, Skipped: 0, Time elapsed: 0.011 sec - in org.apache.commons.lang3.builder.HashCodeBuilderTest
Running org.apache.commons.lang3.concurrent.AtomicInitializerTest
Tests run: 3, Failures: 0, Errors: 0, Skipped: 0, Time elapsed: 0.013 sec - in org.apache.commons.lang3.concurrent.AtomicInitializerTest
Running org.apache.commons.lang3.concurrent.CallableBackgroundInitializerTest
Tests run: 4, Failures: 0, Errors: 0, Skipped: 0, Time elapsed: 0.002 sec - in org.apache.commons.lang3.concurrent.CallableBackgroundInitializerTest
Running org.apache.commons.lang3.concurrent.BackgroundInitializerTest
Tests run: 15, Failures: 0, Errors: 0, Skipped: 0, Time elapsed: 0.018 sec - in org.apache.commons.lang3.concurrent.BackgroundInitializerTest
Running org.apache.commons.lang3.concurrent.LazyInitializerTest
Tests run: 3, Failures: 0, Errors: 0, Skipped: 0, Time elapsed: 0.006 sec - in org.apache.commons.lang3.concurrent.LazyInitializerTest
Running org.apache.commons.lang3.concurrent.BasicThreadFactoryTest
Tests run: 15, Failures: 0, Errors: 0, Skipped: 0, Time elapsed: 0.033 sec - in org.apache.commons.lang3.concurrent.BasicThreadFactoryTest
Running org.apache.commons.lang3.concurrent.ConstantInitializerTest
Tests run: 7, Failures: 0, Errors: 0, Skipped: 0, Time elapsed: 0.001 sec - in org.apache.commons.lang3.concurrent.ConstantInitializerTest
Running org.apache.commons.lang3.concurrent.MultiBackgroundInitializerTest
Tests run: 17, Failures: 0, Errors: 0, Skipped: 0, Time elapsed: 0.028 sec - in org.apache.commons.lang3.concurrent.MultiBackgroundInitializerTest
Running org.apache.commons.lang3.concurrent.AtomicSafeInitializerTest
Tests run: 4, Failures: 0, Errors: 0, Skipped: 0, Time elapsed: 0.013 sec - in org.apache.commons.lang3.concurrent.AtomicSafeInitializerTest
Running org.apache.commons.lang3.concurrent.ConcurrentUtilsTest
Tests run: 40, Failures: 0, Errors: 0, Skipped: 0, Time elapsed: 0.015 sec - in org.apache.commons.lang3.concurrent.ConcurrentUtilsTest
Running org.apache.commons.lang3.concurrent.TimedSemaphoreTest
Tests run: 15, Failures: 0, Errors: 0, Skipped: 0, Time elapsed: 1.182 sec - in org.apache.commons.lang3.concurrent.TimedSemaphoreTest
Running org.apache.commons.lang3.StringUtilsSubstringTest
Tests run: 14, Failures: 0, Errors: 0, Skipped: 0, Time elapsed: 0.006 sec - in org.apache.commons.lang3.StringUtilsSubstringTest
Running org.apache.commons.lang3.SystemUtilsTest
Tests run: 12, Failures: 0, Errors: 0, Skipped: 0, Time elapsed: 0.003 sec - in org.apache.commons.lang3.SystemUtilsTest
Running org.apache.commons.lang3.CharRangeTest
Tests run: 16, Failures: 0, Errors: 0, Skipped: 0, Time elapsed: 0.03 sec - in org.apache.commons.lang3.CharRangeTest
Running org.apache.commons.lang3.CharSetTest
Tests run: 14, Failures: 0, Errors: 0, Skipped: 0, Time elapsed: 0.008 sec - in org.apache.commons.lang3.CharSetTest
Running org.apache.commons.lang3.StringUtilsStartsEndsWithTest
Tests run: 6, Failures: 0, Errors: 0, Skipped: 0, Time elapsed: 0.003 sec - in org.apache.commons.lang3.StringUtilsStartsEndsWithTest
Running org.apache.commons.lang3.RandomStringUtilsTest
Tests run: 11, Failures: 0, Errors: 0, Skipped: 0, Time elapsed: 0.039 sec - in org.apache.commons.lang3.RandomStringUtilsTest
Running org.apache.commons.lang3.SerializationUtilsTest
Tests run: 26, Failures: 0, Errors: 0, Skipped: 0, Time elapsed: 0.042 sec - in org.apache.commons.lang3.SerializationUtilsTest
Running org.apache.commons.lang3.time.StopWatchTest
Tests run: 8, Failures: 0, Errors: 0, Skipped: 0, Time elapsed: 4.764 sec - in org.apache.commons.lang3.time.StopWatchTest
Running org.apache.commons.lang3.time.DateUtilsRoundingTest
Tests run: 22, Failures: 0, Errors: 0, Skipped: 0, Time elapsed: 0.151 sec - in org.apache.commons.lang3.time.DateUtilsRoundingTest
Running org.apache.commons.lang3.time.FastDateParserTest
Tests run: 33, Failures: 0, Errors: 0, Skipped: 0, Time elapsed: 2.037 sec - in org.apache.commons.lang3.time.FastDateParserTest
Running org.apache.commons.lang3.time.FastDateFormat_ParserTest
Tests run: 33, Failures: 0, Errors: 0, Skipped: 0, Time elapsed: 0.743 sec - in org.apache.commons.lang3.time.FastDateFormat_ParserTest
Running org.apache.commons.lang3.time.DurationFormatUtilsTest
Tests run: 25, Failures: 0, Errors: 0, Skipped: 0, Time elapsed: 0.793 sec - in org.apache.commons.lang3.time.DurationFormatUtilsTest
Running org.apache.commons.lang3.time.DateFormatUtilsTest
Tests run: 10, Failures: 0, Errors: 0, Skipped: 0, Time elapsed: 0.002 sec - in org.apache.commons.lang3.time.DateFormatUtilsTest
Running org.apache.commons.lang3.time.DateUtilsFragmentTest
Tests run: 57, Failures: 0, Errors: 0, Skipped: 0, Time elapsed: 0.011 sec - in org.apache.commons.lang3.time.DateUtilsFragmentTest
Running org.apache.commons.lang3.time.FastDatePrinterTimeZonesTest
Tests run: 617, Failures: 0, Errors: 0, Skipped: 0, Time elapsed: 0.208 sec - in org.apache.commons.lang3.time.FastDatePrinterTimeZonesTest
Running org.apache.commons.lang3.time.FastDateFormatTest
>>FastDateFormatTest: FastDateParser:35188  SimpleDateFormat:3613
Tests run: 14, Failures: 0, Errors: 0, Skipped: 0, Time elapsed: 4.199 sec - in org.apache.commons.lang3.time.FastDateFormatTest
Running org.apache.commons.lang3.time.FastDateFormat_PrinterTest
Tests run: 17, Failures: 0, Errors: 0, Skipped: 0, Time elapsed: 0.01 sec - in org.apache.commons.lang3.time.FastDateFormat_PrinterTest
Running org.apache.commons.lang3.time.FastDatePrinterTest
Tests run: 17, Failures: 0, Errors: 0, Skipped: 0, Time elapsed: 0.003 sec - in org.apache.commons.lang3.time.FastDatePrinterTest
Running org.apache.commons.lang3.time.FastDateParserSDFTest
Tests run: 276, Failures: 0, Errors: 0, Skipped: 92, Time elapsed: 0.059 sec - in org.apache.commons.lang3.time.FastDateParserSDFTest
Running org.apache.commons.lang3.time.DateUtilsTest
DateUtilsTest: Default Locale=en_US
Tests run: 38, Failures: 0, Errors: 0, Skipped: 0, Time elapsed: 0.026 sec - in org.apache.commons.lang3.time.DateUtilsTest
Running org.apache.commons.lang3.reflect.InheritanceUtilsTest
Tests run: 9, Failures: 0, Errors: 0, Skipped: 0, Time elapsed: 0.001 sec - in org.apache.commons.lang3.reflect.InheritanceUtilsTest
Running org.apache.commons.lang3.reflect.MethodUtilsTest
Tests run: 23, Failures: 0, Errors: 0, Skipped: 0, Time elapsed: 0.028 sec - in org.apache.commons.lang3.reflect.MethodUtilsTest
Running org.apache.commons.lang3.reflect.ConstructorUtilsTest
Tests run: 7, Failures: 0, Errors: 0, Skipped: 0, Time elapsed: 0.005 sec - in org.apache.commons.lang3.reflect.ConstructorUtilsTest
Running org.apache.commons.lang3.reflect.FieldUtilsTest
Tests run: 64, Failures: 0, Errors: 0, Skipped: 0, Time elapsed: 0.024 sec - in org.apache.commons.lang3.reflect.FieldUtilsTest
Running org.apache.commons.lang3.reflect.TypeLiteralTest
Tests run: 4, Failures: 0, Errors: 0, Skipped: 0, Time elapsed: 0.006 sec - in org.apache.commons.lang3.reflect.TypeLiteralTest
Running org.apache.commons.lang3.reflect.TypeUtilsTest
Tests run: 19, Failures: 0, Errors: 0, Skipped: 0, Time elapsed: 0.046 sec - in org.apache.commons.lang3.reflect.TypeUtilsTest
Running org.apache.commons.lang3.mutable.MutableByteTest
Tests run: 17, Failures: 0, Errors: 0, Skipped: 0, Time elapsed: 0.003 sec - in org.apache.commons.lang3.mutable.MutableByteTest
Running org.apache.commons.lang3.mutable.MutableShortTest
Tests run: 14, Failures: 0, Errors: 0, Skipped: 0, Time elapsed: 0.001 sec - in org.apache.commons.lang3.mutable.MutableShortTest
Running org.apache.commons.lang3.mutable.MutableIntTest
Tests run: 17, Failures: 0, Errors: 0, Skipped: 0, Time elapsed: 0.003 sec - in org.apache.commons.lang3.mutable.MutableIntTest
Running org.apache.commons.lang3.mutable.MutableDoubleTest
Tests run: 18, Failures: 0, Errors: 0, Skipped: 0, Time elapsed: 0.003 sec - in org.apache.commons.lang3.mutable.MutableDoubleTest
Running org.apache.commons.lang3.mutable.MutableFloatTest
Tests run: 18, Failures: 0, Errors: 0, Skipped: 0, Time elapsed: 0.004 sec - in org.apache.commons.lang3.mutable.MutableFloatTest
Running org.apache.commons.lang3.mutable.MutableLongTest
Tests run: 17, Failures: 0, Errors: 0, Skipped: 0, Time elapsed: 0.003 sec - in org.apache.commons.lang3.mutable.MutableLongTest
Running org.apache.commons.lang3.mutable.MutableBooleanTest
Tests run: 9, Failures: 0, Errors: 0, Skipped: 0, Time elapsed: 0.001 sec - in org.apache.commons.lang3.mutable.MutableBooleanTest
Running org.apache.commons.lang3.mutable.MutableObjectTest
Tests run: 5, Failures: 0, Errors: 0, Skipped: 0, Time elapsed: 0 sec - in org.apache.commons.lang3.mutable.MutableObjectTest
Running org.apache.commons.lang3.text.translate.UnicodeEscaperTest
Tests run: 3, Failures: 0, Errors: 0, Skipped: 0, Time elapsed: 0.001 sec - in org.apache.commons.lang3.text.translate.UnicodeEscaperTest
Running org.apache.commons.lang3.text.translate.EntityArraysTest
Tests run: 3, Failures: 0, Errors: 0, Skipped: 0, Time elapsed: 0 sec - in org.apache.commons.lang3.text.translate.EntityArraysTest
Running org.apache.commons.lang3.text.translate.UnicodeUnpairedSurrogateRemoverTest
Tests run: 2, Failures: 0, Errors: 0, Skipped: 0, Time elapsed: 0 sec - in org.apache.commons.lang3.text.translate.UnicodeUnpairedSurrogateRemoverTest
Running org.apache.commons.lang3.text.translate.NumericEntityUnescaperTest
Tests run: 3, Failures: 0, Errors: 0, Skipped: 0, Time elapsed: 0.002 sec - in org.apache.commons.lang3.text.translate.NumericEntityUnescaperTest
Running org.apache.commons.lang3.text.translate.NumericEntityEscaperTest
Tests run: 4, Failures: 0, Errors: 0, Skipped: 0, Time elapsed: 0 sec - in org.apache.commons.lang3.text.translate.NumericEntityEscaperTest
Running org.apache.commons.lang3.text.translate.LookupTranslatorTest
Tests run: 2, Failures: 0, Errors: 0, Skipped: 0, Time elapsed: 0 sec - in org.apache.commons.lang3.text.translate.LookupTranslatorTest
Running org.apache.commons.lang3.text.translate.UnicodeUnescaperTest
Tests run: 3, Failures: 0, Errors: 0, Skipped: 0, Time elapsed: 0 sec - in org.apache.commons.lang3.text.translate.UnicodeUnescaperTest
Running org.apache.commons.lang3.text.translate.OctalUnescaperTest
Tests run: 1, Failures: 0, Errors: 0, Skipped: 0, Time elapsed: 0 sec - in org.apache.commons.lang3.text.translate.OctalUnescaperTest
Running org.apache.commons.lang3.text.StrMatcherTest
Tests run: 14, Failures: 0, Errors: 0, Skipped: 0, Time elapsed: 0.005 sec - in org.apache.commons.lang3.text.StrMatcherTest
Running org.apache.commons.lang3.text.StrTokenizerTest
Tests run: 55, Failures: 0, Errors: 0, Skipped: 0, Time elapsed: 0.015 sec - in org.apache.commons.lang3.text.StrTokenizerTest
Running org.apache.commons.lang3.text.FormattableUtilsTest
Tests run: 5, Failures: 0, Errors: 0, Skipped: 0, Time elapsed: 0.001 sec - in org.apache.commons.lang3.text.FormattableUtilsTest
Running org.apache.commons.lang3.text.CompositeFormatTest
Tests run: 2, Failures: 0, Errors: 0, Skipped: 0, Time elapsed: 0.001 sec - in org.apache.commons.lang3.text.CompositeFormatTest
Running org.apache.commons.lang3.text.WordUtilsTest
Tests run: 12, Failures: 0, Errors: 0, Skipped: 0, Time elapsed: 0.002 sec - in org.apache.commons.lang3.text.WordUtilsTest
Running org.apache.commons.lang3.text.StrLookupTest
Tests run: 5, Failures: 0, Errors: 0, Skipped: 0, Time elapsed: 0.002 sec - in org.apache.commons.lang3.text.StrLookupTest
Running org.apache.commons.lang3.text.StrBuilderAppendInsertTest
Tests run: 51, Failures: 0, Errors: 0, Skipped: 0, Time elapsed: 0.009 sec - in org.apache.commons.lang3.text.StrBuilderAppendInsertTest
Running org.apache.commons.lang3.text.ExtendedMessageFormatTest
Tests run: 10, Failures: 0, Errors: 0, Skipped: 0, Time elapsed: 0.678 sec - in org.apache.commons.lang3.text.ExtendedMessageFormatTest
Running org.apache.commons.lang3.text.StrSubstitutorTest
Tests run: 40, Failures: 0, Errors: 0, Skipped: 0, Time elapsed: 0.031 sec - in org.apache.commons.lang3.text.StrSubstitutorTest
Running org.apache.commons.lang3.text.StrBuilderTest
Tests run: 90, Failures: 0, Errors: 0, Skipped: 0, Time elapsed: 0.032 sec - in org.apache.commons.lang3.text.StrBuilderTest
Running org.apache.commons.lang3.StringEscapeUtilsTest
Tests run: 28, Failures: 0, Errors: 0, Skipped: 0, Time elapsed: 0.404 sec - in org.apache.commons.lang3.StringEscapeUtilsTest
Running org.apache.commons.lang3.AnnotationUtilsTest
Tests run: 10, Failures: 0, Errors: 0, Skipped: 0, Time elapsed: 0.02 sec - in org.apache.commons.lang3.AnnotationUtilsTest
Running org.apache.commons.lang3.ConversionTest
Tests run: 42, Failures: 0, Errors: 0, Skipped: 0, Time elapsed: 0.01 sec - in org.apache.commons.lang3.ConversionTest
Running org.apache.commons.lang3.StringUtilsTrimEmptyTest
Tests run: 15, Failures: 0, Errors: 0, Skipped: 0, Time elapsed: 0.006 sec - in org.apache.commons.lang3.StringUtilsTrimEmptyTest
Running org.apache.commons.lang3.EnumUtilsTest
Tests run: 34, Failures: 0, Errors: 0, Skipped: 0, Time elapsed: 0.009 sec - in org.apache.commons.lang3.EnumUtilsTest
Running org.apache.commons.lang3.exception.ExceptionUtilsTest
Tests run: 28, Failures: 0, Errors: 0, Skipped: 0, Time elapsed: 0.024 sec - in org.apache.commons.lang3.exception.ExceptionUtilsTest
Running org.apache.commons.lang3.exception.DefaultExceptionContextTest
Tests run: 8, Failures: 0, Errors: 0, Skipped: 0, Time elapsed: 0.004 sec - in org.apache.commons.lang3.exception.DefaultExceptionContextTest
Running org.apache.commons.lang3.exception.ContextedExceptionTest
Tests run: 14, Failures: 0, Errors: 0, Skipped: 0, Time elapsed: 0.01 sec - in org.apache.commons.lang3.exception.ContextedExceptionTest
Running org.apache.commons.lang3.exception.ContextedRuntimeExceptionTest
Tests run: 14, Failures: 0, Errors: 0, Skipped: 0, Time elapsed: 0.01 sec - in org.apache.commons.lang3.exception.ContextedRuntimeExceptionTest
Running org.apache.commons.lang3.BitFieldTest
Tests run: 15, Failures: 0, Errors: 0, Skipped: 0, Time elapsed: 0.003 sec - in org.apache.commons.lang3.BitFieldTest
Running org.apache.commons.lang3.ArrayUtilsRemoveMultipleTest
Tests run: 55, Failures: 0, Errors: 0, Skipped: 0, Time elapsed: 0.015 sec - in org.apache.commons.lang3.ArrayUtilsRemoveMultipleTest
Running org.apache.commons.lang3.HashSetvBitSetTest
Ratio=9% array=100 count=1 extract=11910452 bitset=1172671
Ratio=6% array=100 count=10 extract=18107528 bitset=1233661
Ratio=5% array=100 count=50 extract=21130452 bitset=1110330
Ratio=4% array=100 count=100 extract=10413772 bitset=465593
Ratio=77% array=1000 count=10 extract=6421645 bitset=4975352
Ratio=33% array=1000 count=100 extract=14281608 bitset=4740989
Ratio=7% array=1000 count=500 extract=41945088 bitset=3080525
Ratio=0% array=1000 count=1000 extract=81740256 bitset=722396
Ratio=100% count=0 hash=2471144 bits=2471599
Ratio=21% count=5 hash=3669045 bits=773317
Ratio=14% count=10 hash=2193149 bits=311949
Ratio=22% count=200 hash=18335902 bits=4144818
Ratio=17% count=50 hash=5724795 bits=1007398
Ratio=26% count=100 hash=8688314 bits=2266460
Ratio=22% count=1000 hash=71601726 bits=16174929
Ratio=22% count=2000 hash=144081964 bits=31738876
Tests run: 2, Failures: 0, Errors: 0, Skipped: 0, Time elapsed: 0.628 sec - in org.apache.commons.lang3.HashSetvBitSetTest
Running org.apache.commons.lang3.StringUtilsTest
Tests run: 124, Failures: 0, Errors: 0, Skipped: 0, Time elapsed: 0.131 sec - in org.apache.commons.lang3.StringUtilsTest
Running org.apache.commons.lang3.ArrayUtilsRemoveTest
Tests run: 19, Failures: 0, Errors: 0, Skipped: 0, Time elapsed: 0.001 sec - in org.apache.commons.lang3.ArrayUtilsRemoveTest
Running org.apache.commons.lang3.ObjectUtilsTest
Tests run: 36, Failures: 0, Errors: 0, Skipped: 0, Time elapsed: 0.004 sec - in org.apache.commons.lang3.ObjectUtilsTest
Running org.apache.commons.lang3.ClassPathUtilsTest
Tests run: 13, Failures: 0, Errors: 0, Skipped: 0, Time elapsed: 0.002 sec - in org.apache.commons.lang3.ClassPathUtilsTest
Running org.apache.commons.lang3.math.NumberUtilsTest
Tests run: 91, Failures: 0, Errors: 0, Skipped: 0, Time elapsed: 0.022 sec - in org.apache.commons.lang3.math.NumberUtilsTest
Running org.apache.commons.lang3.math.IEEE754rUtilsTest
Tests run: 3, Failures: 0, Errors: 0, Skipped: 0, Time elapsed: 0 sec - in org.apache.commons.lang3.math.IEEE754rUtilsTest
Running org.apache.commons.lang3.math.FractionTest
Tests run: 25, Failures: 0, Errors: 0, Skipped: 0, Time elapsed: 0.087 sec - in org.apache.commons.lang3.math.FractionTest
Running org.apache.commons.lang3.BooleanUtilsTest
Tests run: 72, Failures: 0, Errors: 0, Skipped: 0, Time elapsed: 0.014 sec - in org.apache.commons.lang3.BooleanUtilsTest
Running org.apache.commons.lang3.CharSequenceUtilsTest
Tests run: 2, Failures: 0, Errors: 0, Skipped: 0, Time elapsed: 0 sec - in org.apache.commons.lang3.CharSequenceUtilsTest
Running org.apache.commons.lang3.CharSetUtilsTest
Tests run: 11, Failures: 0, Errors: 0, Skipped: 0, Time elapsed: 0.009 sec - in org.apache.commons.lang3.CharSetUtilsTest
Running org.apache.commons.lang3.ArrayUtilsAddTest
Tests run: 13, Failures: 0, Errors: 0, Skipped: 0, Time elapsed: 0.001 sec - in org.apache.commons.lang3.ArrayUtilsAddTest
Running org.apache.commons.lang3.CharEncodingTest
Tests run: 6, Failures: 0, Errors: 0, Skipped: 0, Time elapsed: 0.029 sec - in org.apache.commons.lang3.CharEncodingTest
Running org.apache.commons.lang3.ClassUtilsTest
Tests run: 57, Failures: 0, Errors: 0, Skipped: 0, Time elapsed: 0.031 sec - in org.apache.commons.lang3.ClassUtilsTest
Running org.apache.commons.lang3.RangeTest
Tests run: 24, Failures: 0, Errors: 0, Skipped: 0, Time elapsed: 0.009 sec - in org.apache.commons.lang3.RangeTest
Running org.apache.commons.lang3.event.EventUtilsTest
Tests run: 8, Failures: 0, Errors: 0, Skipped: 0, Time elapsed: 0.016 sec - in org.apache.commons.lang3.event.EventUtilsTest
Running org.apache.commons.lang3.event.EventListenerSupportTest
Tests run: 9, Failures: 0, Errors: 0, Skipped: 0, Time elapsed: 0.021 sec - in org.apache.commons.lang3.event.EventListenerSupportTest
Running org.apache.commons.lang3.ArrayUtilsTest
Tests run: 205, Failures: 0, Errors: 0, Skipped: 0, Time elapsed: 0.052 sec - in org.apache.commons.lang3.ArrayUtilsTest
Running org.apache.commons.lang3.CharUtilsTest
Tests run: 24, Failures: 0, Errors: 0, Skipped: 0, Time elapsed: 0.003 sec - in org.apache.commons.lang3.CharUtilsTest
Running org.apache.commons.lang3.NotImplementedExceptionTest
Tests run: 1, Failures: 0, Errors: 0, Skipped: 0, Time elapsed: 0 sec - in org.apache.commons.lang3.NotImplementedExceptionTest
Running org.apache.commons.lang3.StringUtilsEqualsIndexOfTest
Tests run: 50, Failures: 0, Errors: 0, Skipped: 0, Time elapsed: 0.002 sec - in org.apache.commons.lang3.StringUtilsEqualsIndexOfTest
Running org.apache.commons.lang3.RandomUtilsTest
Tests run: 23, Failures: 0, Errors: 0, Skipped: 0, Time elapsed: 0.001 sec - in org.apache.commons.lang3.RandomUtilsTest

Results :

Failed tests: 
  ToStringBuilderTest.testSetDefaultEx Expected exception: java.lang.IllegalArgumentException

Tests in error: 
org.apache.commons.lang3.builder.DefaultToStringStyleTest.testAppendSuper(org.apache.commons.lang3.builder.DefaultToStringStyleTest)
  Run 1: DefaultToStringStyleTest.setUp:41 » IllegalArgument The style must not be null
  Run 2: DefaultToStringStyleTest.tearDown:46 » IllegalArgument The style must not be n...

org.apache.commons.lang3.builder.DefaultToStringStyleTest.testBlank(org.apache.commons.lang3.builder.DefaultToStringStyleTest)
  Run 1: DefaultToStringStyleTest.setUp:41 » IllegalArgument The style must not be null
  Run 2: DefaultToStringStyleTest.tearDown:46 » IllegalArgument The style must not be n...

org.apache.commons.lang3.builder.DefaultToStringStyleTest.testLong(org.apache.commons.lang3.builder.DefaultToStringStyleTest)
  Run 1: DefaultToStringStyleTest.setUp:41 » IllegalArgument The style must not be null
  Run 2: DefaultToStringStyleTest.tearDown:46 » IllegalArgument The style must not be n...

org.apache.commons.lang3.builder.DefaultToStringStyleTest.testLongArray(org.apache.commons.lang3.builder.DefaultToStringStyleTest)
  Run 1: DefaultToStringStyleTest.setUp:41 » IllegalArgument The style must not be null
  Run 2: DefaultToStringStyleTest.tearDown:46 » IllegalArgument The style must not be n...

org.apache.commons.lang3.builder.DefaultToStringStyleTest.testLongArrayArray(org.apache.commons.lang3.builder.DefaultToStringStyleTest)
  Run 1: DefaultToStringStyleTest.setUp:41 » IllegalArgument The style must not be null
  Run 2: DefaultToStringStyleTest.tearDown:46 » IllegalArgument The style must not be n...

org.apache.commons.lang3.builder.DefaultToStringStyleTest.testObject(org.apache.commons.lang3.builder.DefaultToStringStyleTest)
  Run 1: DefaultToStringStyleTest.setUp:41 » IllegalArgument The style must not be null
  Run 2: DefaultToStringStyleTest.tearDown:46 » IllegalArgument The style must not be n...

org.apache.commons.lang3.builder.DefaultToStringStyleTest.testObjectArray(org.apache.commons.lang3.builder.DefaultToStringStyleTest)
  Run 1: DefaultToStringStyleTest.setUp:41 » IllegalArgument The style must not be null
  Run 2: DefaultToStringStyleTest.tearDown:46 » IllegalArgument The style must not be n...

org.apache.commons.lang3.builder.DefaultToStringStyleTest.testPerson(org.apache.commons.lang3.builder.DefaultToStringStyleTest)
  Run 1: DefaultToStringStyleTest.setUp:41 » IllegalArgument The style must not be null
  Run 2: DefaultToStringStyleTest.tearDown:46 » IllegalArgument The style must not be n...

org.apache.commons.lang3.builder.JsonToStringStyleTest.testAppendSuper(org.apache.commons.lang3.builder.JsonToStringStyleTest)
  Run 1: JsonToStringStyleTest.setUp:42 » IllegalArgument The style must not be null
  Run 2: JsonToStringStyleTest.tearDown:47 » IllegalArgument The style must not be null

org.apache.commons.lang3.builder.JsonToStringStyleTest.testBlank(org.apache.commons.lang3.builder.JsonToStringStyleTest)
  Run 1: JsonToStringStyleTest.setUp:42 » IllegalArgument The style must not be null
  Run 2: JsonToStringStyleTest.tearDown:47 » IllegalArgument The style must not be null

org.apache.commons.lang3.builder.JsonToStringStyleTest.testLong(org.apache.commons.lang3.builder.JsonToStringStyleTest)
  Run 1: JsonToStringStyleTest.setUp:42 » IllegalArgument The style must not be null
  Run 2: JsonToStringStyleTest.tearDown:47 » IllegalArgument The style must not be null

org.apache.commons.lang3.builder.JsonToStringStyleTest.testLongArray(org.apache.commons.lang3.builder.JsonToStringStyleTest)
  Run 1: JsonToStringStyleTest.setUp:42 » IllegalArgument The style must not be null
  Run 2: JsonToStringStyleTest.tearDown:47 » IllegalArgument The style must not be null

org.apache.commons.lang3.builder.JsonToStringStyleTest.testLongArrayArray(org.apache.commons.lang3.builder.JsonToStringStyleTest)
  Run 1: JsonToStringStyleTest.setUp:42 » IllegalArgument The style must not be null
  Run 2: JsonToStringStyleTest.tearDown:47 » IllegalArgument The style must not be null

org.apache.commons.lang3.builder.JsonToStringStyleTest.testNull(org.apache.commons.lang3.builder.JsonToStringStyleTest)
  Run 1: JsonToStringStyleTest.setUp:42 » IllegalArgument The style must not be null
  Run 2: JsonToStringStyleTest.tearDown:47 » IllegalArgument The style must not be null

org.apache.commons.lang3.builder.JsonToStringStyleTest.testObject(org.apache.commons.lang3.builder.JsonToStringStyleTest)
  Run 1: JsonToStringStyleTest.setUp:42 » IllegalArgument The style must not be null
  Run 2: JsonToStringStyleTest.tearDown:47 » IllegalArgument The style must not be null

org.apache.commons.lang3.builder.JsonToStringStyleTest.testObjectArray(org.apache.commons.lang3.builder.JsonToStringStyleTest)
  Run 1: JsonToStringStyleTest.setUp:42 » IllegalArgument The style must not be null
  Run 2: JsonToStringStyleTest.tearDown:47 » IllegalArgument The style must not be null

org.apache.commons.lang3.builder.JsonToStringStyleTest.testPerson(org.apache.commons.lang3.builder.JsonToStringStyleTest)
  Run 1: JsonToStringStyleTest.setUp:42 » IllegalArgument The style must not be null
  Run 2: JsonToStringStyleTest.tearDown:47 » IllegalArgument The style must not be null

org.apache.commons.lang3.builder.MultiLineToStringStyleTest.testAppendSuper(org.apache.commons.lang3.builder.MultiLineToStringStyleTest)
  Run 1: MultiLineToStringStyleTest.setUp:42 » IllegalArgument The style must not be nu...
  Run 2: MultiLineToStringStyleTest.tearDown:47 » IllegalArgument The style must not be...

org.apache.commons.lang3.builder.MultiLineToStringStyleTest.testBlank(org.apache.commons.lang3.builder.MultiLineToStringStyleTest)
  Run 1: MultiLineToStringStyleTest.setUp:42 » IllegalArgument The style must not be nu...
  Run 2: MultiLineToStringStyleTest.tearDown:47 » IllegalArgument The style must not be...

org.apache.commons.lang3.builder.MultiLineToStringStyleTest.testLong(org.apache.commons.lang3.builder.MultiLineToStringStyleTest)
  Run 1: MultiLineToStringStyleTest.setUp:42 » IllegalArgument The style must not be nu...
  Run 2: MultiLineToStringStyleTest.tearDown:47 » IllegalArgument The style must not be...

org.apache.commons.lang3.builder.MultiLineToStringStyleTest.testLongArray(org.apache.commons.lang3.builder.MultiLineToStringStyleTest)
  Run 1: MultiLineToStringStyleTest.setUp:42 » IllegalArgument The style must not be nu...
  Run 2: MultiLineToStringStyleTest.tearDown:47 » IllegalArgument The style must not be...

org.apache.commons.lang3.builder.MultiLineToStringStyleTest.testLongArrayArray(org.apache.commons.lang3.builder.MultiLineToStringStyleTest)
  Run 1: MultiLineToStringStyleTest.setUp:42 » IllegalArgument The style must not be nu...
  Run 2: MultiLineToStringStyleTest.tearDown:47 » IllegalArgument The style must not be...

org.apache.commons.lang3.builder.MultiLineToStringStyleTest.testObject(org.apache.commons.lang3.builder.MultiLineToStringStyleTest)
  Run 1: MultiLineToStringStyleTest.setUp:42 » IllegalArgument The style must not be nu...
  Run 2: MultiLineToStringStyleTest.tearDown:47 » IllegalArgument The style must not be...

org.apache.commons.lang3.builder.MultiLineToStringStyleTest.testObjectArray(org.apache.commons.lang3.builder.MultiLineToStringStyleTest)
  Run 1: MultiLineToStringStyleTest.setUp:42 » IllegalArgument The style must not be nu...
  Run 2: MultiLineToStringStyleTest.tearDown:47 » IllegalArgument The style must not be...

org.apache.commons.lang3.builder.MultiLineToStringStyleTest.testPerson(org.apache.commons.lang3.builder.MultiLineToStringStyleTest)
  Run 1: MultiLineToStringStyleTest.setUp:42 » IllegalArgument The style must not be nu...
  Run 2: MultiLineToStringStyleTest.tearDown:47 » IllegalArgument The style must not be...

org.apache.commons.lang3.builder.NoClassNameToStringStyleTest.testAppendSuper(org.apache.commons.lang3.builder.NoClassNameToStringStyleTest)
  Run 1: NoClassNameToStringStyleTest.setUp:40 » IllegalArgument The style must not be ...
  Run 2: NoClassNameToStringStyleTest.tearDown:45 » IllegalArgument The style must not ...

org.apache.commons.lang3.builder.NoClassNameToStringStyleTest.testBlank(org.apache.commons.lang3.builder.NoClassNameToStringStyleTest)
  Run 1: NoClassNameToStringStyleTest.setUp:40 » IllegalArgument The style must not be ...
  Run 2: NoClassNameToStringStyleTest.tearDown:45 » IllegalArgument The style must not ...

org.apache.commons.lang3.builder.NoClassNameToStringStyleTest.testLong(org.apache.commons.lang3.builder.NoClassNameToStringStyleTest)
  Run 1: NoClassNameToStringStyleTest.setUp:40 » IllegalArgument The style must not be ...
  Run 2: NoClassNameToStringStyleTest.tearDown:45 » IllegalArgument The style must not ...

org.apache.commons.lang3.builder.NoClassNameToStringStyleTest.testLongArray(org.apache.commons.lang3.builder.NoClassNameToStringStyleTest)
  Run 1: NoClassNameToStringStyleTest.setUp:40 » IllegalArgument The style must not be ...
  Run 2: NoClassNameToStringStyleTest.tearDown:45 » IllegalArgument The style must not ...

org.apache.commons.lang3.builder.NoClassNameToStringStyleTest.testLongArrayArray(org.apache.commons.lang3.builder.NoClassNameToStringStyleTest)
  Run 1: NoClassNameToStringStyleTest.setUp:40 » IllegalArgument The style must not be ...
  Run 2: NoClassNameToStringStyleTest.tearDown:45 » IllegalArgument The style must not ...

org.apache.commons.lang3.builder.NoClassNameToStringStyleTest.testObject(org.apache.commons.lang3.builder.NoClassNameToStringStyleTest)
  Run 1: NoClassNameToStringStyleTest.setUp:40 » IllegalArgument The style must not be ...
  Run 2: NoClassNameToStringStyleTest.tearDown:45 » IllegalArgument The style must not ...

org.apache.commons.lang3.builder.NoClassNameToStringStyleTest.testObjectArray(org.apache.commons.lang3.builder.NoClassNameToStringStyleTest)
  Run 1: NoClassNameToStringStyleTest.setUp:40 » IllegalArgument The style must not be ...
  Run 2: NoClassNameToStringStyleTest.tearDown:45 » IllegalArgument The style must not ...

org.apache.commons.lang3.builder.NoClassNameToStringStyleTest.testPerson(org.apache.commons.lang3.builder.NoClassNameToStringStyleTest)
  Run 1: NoClassNameToStringStyleTest.setUp:40 » IllegalArgument The style must not be ...
  Run 2: NoClassNameToStringStyleTest.tearDown:45 » IllegalArgument The style must not ...

org.apache.commons.lang3.builder.NoFieldNamesToStringStyleTest.testAppendSuper(org.apache.commons.lang3.builder.NoFieldNamesToStringStyleTest)
  Run 1: NoFieldNamesToStringStyleTest.setUp:41 » IllegalArgument The style must not be...
  Run 2: NoFieldNamesToStringStyleTest.tearDown:46 » IllegalArgument The style must not...

org.apache.commons.lang3.builder.NoFieldNamesToStringStyleTest.testBlank(org.apache.commons.lang3.builder.NoFieldNamesToStringStyleTest)
  Run 1: NoFieldNamesToStringStyleTest.setUp:41 » IllegalArgument The style must not be...
  Run 2: NoFieldNamesToStringStyleTest.tearDown:46 » IllegalArgument The style must not...

org.apache.commons.lang3.builder.NoFieldNamesToStringStyleTest.testLong(org.apache.commons.lang3.builder.NoFieldNamesToStringStyleTest)
  Run 1: NoFieldNamesToStringStyleTest.setUp:41 » IllegalArgument The style must not be...
  Run 2: NoFieldNamesToStringStyleTest.tearDown:46 » IllegalArgument The style must not...

org.apache.commons.lang3.builder.NoFieldNamesToStringStyleTest.testLongArray(org.apache.commons.lang3.builder.NoFieldNamesToStringStyleTest)
  Run 1: NoFieldNamesToStringStyleTest.setUp:41 » IllegalArgument The style must not be...
  Run 2: NoFieldNamesToStringStyleTest.tearDown:46 » IllegalArgument The style must not...

org.apache.commons.lang3.builder.NoFieldNamesToStringStyleTest.testLongArrayArray(org.apache.commons.lang3.builder.NoFieldNamesToStringStyleTest)
  Run 1: NoFieldNamesToStringStyleTest.setUp:41 » IllegalArgument The style must not be...
  Run 2: NoFieldNamesToStringStyleTest.tearDown:46 » IllegalArgument The style must not...

org.apache.commons.lang3.builder.NoFieldNamesToStringStyleTest.testObject(org.apache.commons.lang3.builder.NoFieldNamesToStringStyleTest)
  Run 1: NoFieldNamesToStringStyleTest.setUp:41 » IllegalArgument The style must not be...
  Run 2: NoFieldNamesToStringStyleTest.tearDown:46 » IllegalArgument The style must not...

org.apache.commons.lang3.builder.NoFieldNamesToStringStyleTest.testObjectArray(org.apache.commons.lang3.builder.NoFieldNamesToStringStyleTest)
  Run 1: NoFieldNamesToStringStyleTest.setUp:41 » IllegalArgument The style must not be...
  Run 2: NoFieldNamesToStringStyleTest.tearDown:46 » IllegalArgument The style must not...

org.apache.commons.lang3.builder.NoFieldNamesToStringStyleTest.testPerson(org.apache.commons.lang3.builder.NoFieldNamesToStringStyleTest)
  Run 1: NoFieldNamesToStringStyleTest.setUp:41 » IllegalArgument The style must not be...
  Run 2: NoFieldNamesToStringStyleTest.tearDown:46 » IllegalArgument The style must not...

org.apache.commons.lang3.builder.RecursiveToStringStyleTest.testAppendSuper(org.apache.commons.lang3.builder.RecursiveToStringStyleTest)
  Run 1: RecursiveToStringStyleTest.setUp:40 » IllegalArgument The style must not be nu...
  Run 2: RecursiveToStringStyleTest.tearDown:45 » IllegalArgument The style must not be...

org.apache.commons.lang3.builder.RecursiveToStringStyleTest.testBlank(org.apache.commons.lang3.builder.RecursiveToStringStyleTest)
  Run 1: RecursiveToStringStyleTest.setUp:40 » IllegalArgument The style must not be nu...
  Run 2: RecursiveToStringStyleTest.tearDown:45 » IllegalArgument The style must not be...

org.apache.commons.lang3.builder.RecursiveToStringStyleTest.testLong(org.apache.commons.lang3.builder.RecursiveToStringStyleTest)
  Run 1: RecursiveToStringStyleTest.setUp:40 » IllegalArgument The style must not be nu...
  Run 2: RecursiveToStringStyleTest.tearDown:45 » IllegalArgument The style must not be...

org.apache.commons.lang3.builder.RecursiveToStringStyleTest.testLongArray(org.apache.commons.lang3.builder.RecursiveToStringStyleTest)
  Run 1: RecursiveToStringStyleTest.setUp:40 » IllegalArgument The style must not be nu...
  Run 2: RecursiveToStringStyleTest.tearDown:45 » IllegalArgument The style must not be...

org.apache.commons.lang3.builder.RecursiveToStringStyleTest.testLongArrayArray(org.apache.commons.lang3.builder.RecursiveToStringStyleTest)
  Run 1: RecursiveToStringStyleTest.setUp:40 » IllegalArgument The style must not be nu...
  Run 2: RecursiveToStringStyleTest.tearDown:45 » IllegalArgument The style must not be...

org.apache.commons.lang3.builder.RecursiveToStringStyleTest.testObject(org.apache.commons.lang3.builder.RecursiveToStringStyleTest)
  Run 1: RecursiveToStringStyleTest.setUp:40 » IllegalArgument The style must not be nu...
  Run 2: RecursiveToStringStyleTest.tearDown:45 » IllegalArgument The style must not be...

org.apache.commons.lang3.builder.RecursiveToStringStyleTest.testObjectArray(org.apache.commons.lang3.builder.RecursiveToStringStyleTest)
  Run 1: RecursiveToStringStyleTest.setUp:40 » IllegalArgument The style must not be nu...
  Run 2: RecursiveToStringStyleTest.tearDown:45 » IllegalArgument The style must not be...

org.apache.commons.lang3.builder.RecursiveToStringStyleTest.testPerson(org.apache.commons.lang3.builder.RecursiveToStringStyleTest)
  Run 1: RecursiveToStringStyleTest.setUp:40 » IllegalArgument The style must not be nu...
  Run 2: RecursiveToStringStyleTest.tearDown:45 » IllegalArgument The style must not be...

org.apache.commons.lang3.builder.ShortPrefixToStringStyleTest.testAppendSuper(org.apache.commons.lang3.builder.ShortPrefixToStringStyleTest)
  Run 1: ShortPrefixToStringStyleTest.setUp:41 » IllegalArgument The style must not be ...
  Run 2: ShortPrefixToStringStyleTest.tearDown:46 » IllegalArgument The style must not ...

org.apache.commons.lang3.builder.ShortPrefixToStringStyleTest.testBlank(org.apache.commons.lang3.builder.ShortPrefixToStringStyleTest)
  Run 1: ShortPrefixToStringStyleTest.setUp:41 » IllegalArgument The style must not be ...
  Run 2: ShortPrefixToStringStyleTest.tearDown:46 » IllegalArgument The style must not ...

org.apache.commons.lang3.builder.ShortPrefixToStringStyleTest.testLong(org.apache.commons.lang3.builder.ShortPrefixToStringStyleTest)
  Run 1: ShortPrefixToStringStyleTest.setUp:41 » IllegalArgument The style must not be ...
  Run 2: ShortPrefixToStringStyleTest.tearDown:46 » IllegalArgument The style must not ...

org.apache.commons.lang3.builder.ShortPrefixToStringStyleTest.testLongArray(org.apache.commons.lang3.builder.ShortPrefixToStringStyleTest)
  Run 1: ShortPrefixToStringStyleTest.setUp:41 » IllegalArgument The style must not be ...
  Run 2: ShortPrefixToStringStyleTest.tearDown:46 » IllegalArgument The style must not ...

org.apache.commons.lang3.builder.ShortPrefixToStringStyleTest.testLongArrayArray(org.apache.commons.lang3.builder.ShortPrefixToStringStyleTest)
  Run 1: ShortPrefixToStringStyleTest.setUp:41 » IllegalArgument The style must not be ...
  Run 2: ShortPrefixToStringStyleTest.tearDown:46 » IllegalArgument The style must not ...

org.apache.commons.lang3.builder.ShortPrefixToStringStyleTest.testObject(org.apache.commons.lang3.builder.ShortPrefixToStringStyleTest)
  Run 1: ShortPrefixToStringStyleTest.setUp:41 » IllegalArgument The style must not be ...
  Run 2: ShortPrefixToStringStyleTest.tearDown:46 » IllegalArgument The style must not ...

org.apache.commons.lang3.builder.ShortPrefixToStringStyleTest.testObjectArray(org.apache.commons.lang3.builder.ShortPrefixToStringStyleTest)
  Run 1: ShortPrefixToStringStyleTest.setUp:41 » IllegalArgument The style must not be ...
  Run 2: ShortPrefixToStringStyleTest.tearDown:46 » IllegalArgument The style must not ...

org.apache.commons.lang3.builder.ShortPrefixToStringStyleTest.testPerson(org.apache.commons.lang3.builder.ShortPrefixToStringStyleTest)
  Run 1: ShortPrefixToStringStyleTest.setUp:41 » IllegalArgument The style must not be ...
  Run 2: ShortPrefixToStringStyleTest.tearDown:46 » IllegalArgument The style must not ...

org.apache.commons.lang3.builder.SimpleToStringStyleTest.testAppendSuper(org.apache.commons.lang3.builder.SimpleToStringStyleTest)
  Run 1: SimpleToStringStyleTest.setUp:40 » IllegalArgument The style must not be null
  Run 2: SimpleToStringStyleTest.tearDown:45 » IllegalArgument The style must not be nu...

org.apache.commons.lang3.builder.SimpleToStringStyleTest.testBlank(org.apache.commons.lang3.builder.SimpleToStringStyleTest)
  Run 1: SimpleToStringStyleTest.setUp:40 » IllegalArgument The style must not be null
  Run 2: SimpleToStringStyleTest.tearDown:45 » IllegalArgument The style must not be nu...

org.apache.commons.lang3.builder.SimpleToStringStyleTest.testLong(org.apache.commons.lang3.builder.SimpleToStringStyleTest)
  Run 1: SimpleToStringStyleTest.setUp:40 » IllegalArgument The style must not be null
  Run 2: SimpleToStringStyleTest.tearDown:45 » IllegalArgument The style must not be nu...

org.apache.commons.lang3.builder.SimpleToStringStyleTest.testLongArray(org.apache.commons.lang3.builder.SimpleToStringStyleTest)
  Run 1: SimpleToStringStyleTest.setUp:40 » IllegalArgument The style must not be null
  Run 2: SimpleToStringStyleTest.tearDown:45 » IllegalArgument The style must not be nu...

org.apache.commons.lang3.builder.SimpleToStringStyleTest.testLongArrayArray(org.apache.commons.lang3.builder.SimpleToStringStyleTest)
  Run 1: SimpleToStringStyleTest.setUp:40 » IllegalArgument The style must not be null
  Run 2: SimpleToStringStyleTest.tearDown:45 » IllegalArgument The style must not be nu...

org.apache.commons.lang3.builder.SimpleToStringStyleTest.testObject(org.apache.commons.lang3.builder.SimpleToStringStyleTest)
  Run 1: SimpleToStringStyleTest.setUp:40 » IllegalArgument The style must not be null
  Run 2: SimpleToStringStyleTest.tearDown:45 » IllegalArgument The style must not be nu...

org.apache.commons.lang3.builder.SimpleToStringStyleTest.testObjectArray(org.apache.commons.lang3.builder.SimpleToStringStyleTest)
  Run 1: SimpleToStringStyleTest.setUp:40 » IllegalArgument The style must not be null
  Run 2: SimpleToStringStyleTest.tearDown:45 » IllegalArgument The style must not be nu...

org.apache.commons.lang3.builder.SimpleToStringStyleTest.testPerson(org.apache.commons.lang3.builder.SimpleToStringStyleTest)
  Run 1: SimpleToStringStyleTest.setUp:40 » IllegalArgument The style must not be null
  Run 2: SimpleToStringStyleTest.tearDown:45 » IllegalArgument The style must not be nu...

org.apache.commons.lang3.builder.StandardToStringStyleTest.testAppendSuper(org.apache.commons.lang3.builder.StandardToStringStyleTest)
  Run 1: StandardToStringStyleTest.setUp:56 » IllegalArgument The style must not be nul...
  Run 2: StandardToStringStyleTest.tearDown:61 » IllegalArgument The style must not be ...

org.apache.commons.lang3.builder.StandardToStringStyleTest.testBlank(org.apache.commons.lang3.builder.StandardToStringStyleTest)
  Run 1: StandardToStringStyleTest.setUp:56 » IllegalArgument The style must not be nul...
  Run 2: StandardToStringStyleTest.tearDown:61 » IllegalArgument The style must not be ...

org.apache.commons.lang3.builder.StandardToStringStyleTest.testLong(org.apache.commons.lang3.builder.StandardToStringStyleTest)
  Run 1: StandardToStringStyleTest.setUp:56 » IllegalArgument The style must not be nul...
  Run 2: StandardToStringStyleTest.tearDown:61 » IllegalArgument The style must not be ...

org.apache.commons.lang3.builder.StandardToStringStyleTest.testLongArray(org.apache.commons.lang3.builder.StandardToStringStyleTest)
  Run 1: StandardToStringStyleTest.setUp:56 » IllegalArgument The style must not be nul...
  Run 2: StandardToStringStyleTest.tearDown:61 » IllegalArgument The style must not be ...

org.apache.commons.lang3.builder.StandardToStringStyleTest.testLongArrayArray(org.apache.commons.lang3.builder.StandardToStringStyleTest)
  Run 1: StandardToStringStyleTest.setUp:56 » IllegalArgument The style must not be nul...
  Run 2: StandardToStringStyleTest.tearDown:61 » IllegalArgument The style must not be ...

org.apache.commons.lang3.builder.StandardToStringStyleTest.testObject(org.apache.commons.lang3.builder.StandardToStringStyleTest)
  Run 1: StandardToStringStyleTest.setUp:56 » IllegalArgument The style must not be nul...
  Run 2: StandardToStringStyleTest.tearDown:61 » IllegalArgument The style must not be ...

org.apache.commons.lang3.builder.StandardToStringStyleTest.testObjectArray(org.apache.commons.lang3.builder.StandardToStringStyleTest)
  Run 1: StandardToStringStyleTest.setUp:56 » IllegalArgument The style must not be nul...
  Run 2: StandardToStringStyleTest.tearDown:61 » IllegalArgument The style must not be ...

org.apache.commons.lang3.builder.StandardToStringStyleTest.testPerson(org.apache.commons.lang3.builder.StandardToStringStyleTest)
  Run 1: StandardToStringStyleTest.setUp:56 » IllegalArgument The style must not be nul...
  Run 2: StandardToStringStyleTest.tearDown:61 » IllegalArgument The style must not be ...

  ToStringBuilderTest.testAppendSuper:601 » NullPointer
  ToStringBuilderTest.testByteArrayArray:837 » NullPointer
  ToStringBuilderTest.testCharArrayArray:847 » NullPointer
  ToStringBuilderTest.testDouble:694 » NullPointer
  ToStringBuilderTest.testDoubleArray:777 » NullPointer
  ToStringBuilderTest.testGetSetDefault:78 » IllegalArgument The style must not ...
  ToStringBuilderTest.testInnerClassReflection:376 » NullPointer
  ToStringBuilderTest.testIntArray:737 » NullPointer
  ToStringBuilderTest.testObject:623 » NullPointer
  ToStringBuilderTest.testReflectionCharArray:205 » NullPointer
  ToStringBuilderTest.testReflectionCharArrayArray:289 » NullPointer
  ToStringBuilderTest.testReflectionCharacter:106 » NullPointer
  ToStringBuilderTest.testReflectionFloatArrayArray:243 » NullPointer
  ToStringBuilderTest.testReflectionIntArray:178 » NullPointer
  ToStringBuilderTest.testReflectionShortArray:187 » NullPointer
  ToStringBuilderTest.testSelfInstanceVarReflectionObjectCycle:539 » NullPointer


Tests run: 3526, Failures: 1, Errors: 89, Skipped: 97

[INFO] ------------------------------------------------------------------------
[INFO] BUILD FAILURE
[INFO] ------------------------------------------------------------------------
[INFO] Total time: 35.844s
[INFO] Finished at: Tue Aug 04 08:16:45 BST 2015
[INFO] Final Memory: 25M/500M
[INFO] ------------------------------------------------------------------------
[ERROR] Failed to execute goal org.apache.maven.plugins:maven-surefire-plugin:2.18:test (default-test) on project commons-lang3: There are test failures.
[ERROR] 
[ERROR] Please refer to /home/perham/Study/LittleDarwin/Cases/commons-lang3-3.4-src/target/surefire-reports for the individual test results.
[ERROR] -> [Help 1]
[ERROR] 
[ERROR] To see the full stack trace of the errors, re-run Maven with the -e switch.
[ERROR] Re-run Maven using the -X switch to enable full debug logging.
[ERROR] 
[ERROR] For more information about the errors and possible solutions, please read the following articles:
[ERROR] [Help 1] http://cwiki.apache.org/confluence/display/MAVEN/MojoFailureException
